Build: #1458 failed Scheduled

Build result summary

Details

Completed
Duration
67 minutes
Labels
None
Agent
bamboo-18.af.pivotal.io
Revision
b87ea1373d6493454e873fae79c5e3495aa61cf9 b87ea1373d6493454e873fae79c5e3495aa61cf9
Total tests
3602
Failing since
#1451 (Scheduled – )
No failed test found. A possible compilation error occurred.

Tests

Responsible

This build has been failing since #1451
No one has taken responsibility

Error summary for Default Job

The job generated some errors, drill down into the full build log for more details.

FAILURE: Build failed with an exception.

* What went wrong:
Execution failed for task ':artifactoryDeploy'.
> java.util.concurrent.ExecutionException: java.lang.NoClassDefFoundError: org/gradle/internal/concurrent/GradleThread

* Try:
Run with --info or --debug option to get more log output.

* Exception is:
org.gradle.api.tasks.TaskExecutionException: Execution failed for task ':artifactoryDeploy'.
        at org.gradle.api.internal.tasks.execution.ExecuteActionsTaskExecuter.executeActions(ExecuteActionsTaskExecuter.java:69)
        at org.gradle.api.internal.tasks.execution.ExecuteActionsTaskExecuter.execute(ExecuteActionsTaskExecuter.java:46)
        at org.gradle.api.internal.tasks.execution.PostExecutionAnalysisTaskExecuter.execute(PostExecutionAnalysisTaskExecuter.java:35)
        at org.gradle.api.internal.tasks.execution.SkipUpToDateTaskExecuter.execute(SkipUpToDateTaskExecuter.java:64)
        at org.gradle.api.internal.tasks.execution.ValidatingTaskExecuter.execute(ValidatingTaskExecuter.java:58)
        at org.gradle.api.internal.tasks.execution.SkipEmptySourceFilesTaskExecuter.execute(SkipEmptySourceFilesTaskExecuter.java:52)
        at org.gradle.api.internal.tasks.execution.SkipTaskWithNoActionsExecuter.execute(SkipTaskWithNoActionsExecuter.java:52)
        at org.gradle.api.internal.tasks.execution.SkipOnlyIfTaskExecuter.execute(SkipOnlyIfTaskExecuter.java:53)
        at org.gradle.api.internal.tasks.execution.ExecuteAtMostOnceTaskExecuter.execute(ExecuteAtMostOnceTaskExecuter.java:43)
        at org.gradle.execution.taskgraph.DefaultTaskGraphExecuter$EventFiringTaskWorker.execute(DefaultTaskGraphExecuter.java:203)
        at org.gradle.execution.taskgraph.DefaultTaskGraphExecuter$EventFiringTaskWorker.execute(DefaultTaskGraphExecuter.java:185)
        at org.gradle.execution.taskgraph.AbstractTaskPlanExecutor$TaskExecutorWorker.processTask(AbstractTaskPlanExecutor.java:74)
        at org.gradle.execution.taskgraph.AbstractTaskPlanExecutor$TaskExecutorWorker.run(AbstractTaskPlanExecutor.java:55)
        at org.gradle.execution.taskgraph.DefaultTaskPlanExecutor.process(DefaultTaskPlanExecutor.java:32)
        at org.gradle.execution.taskgraph.DefaultTaskGraphExecuter.execute(DefaultTaskGraphExecuter.java:110)
        at org.gradle.execution.SelectedTaskExecutionAction.execute(SelectedTaskExecutionAction.java:37)
        at org.gradle.execution.DefaultBuildExecuter.execute(DefaultBuildExecuter.java:37)
        at org.gradle.execution.DefaultBuildExecuter.access$000(DefaultBuildExecuter.java:23)
        at org.gradle.execution.DefaultBuildExecuter$1.proceed(DefaultBuildExecuter.java:43)
        at org.gradle.execution.DryRunBuildExecutionAction.execute(DryRunBuildExecutionAction.java:32)
        at org.gradle.execution.DefaultBuildExecuter.execute(DefaultBuildExecuter.java:37)
        at org.gradle.execution.DefaultBuildExecuter.execute(DefaultBuildExecuter.java:30)
        at org.gradle.initialization.DefaultGradleLauncher$4.run(DefaultGradleLauncher.java:153)
        at org.gradle.internal.Factories$1.create(Factories.java:22)
        at org.gradle.internal.progress.DefaultBuildOperationExecutor.run(DefaultBuildOperationExecutor.java:91)
        at org.gradle.internal.progress.DefaultBuildOperationExecutor.run(DefaultBuildOperationExecutor.java:53)
        at org.gradle.initialization.DefaultGradleLauncher.doBuildStages(DefaultGradleLauncher.java:150)
        at org.gradle.initialization.DefaultGradleLauncher.access$200(DefaultGradleLauncher.java:32)
        at org.gradle.initialization.DefaultGradleLauncher$1.create(DefaultGradleLauncher.java:98)
        at org.gradle.initialization.DefaultGradleLauncher$1.create(DefaultGradleLauncher.java:92)
        at org.gradle.internal.progress.DefaultBuildOperationExecutor.run(DefaultBuildOperationExecutor.java:91)
        at org.gradle.internal.progress.DefaultBuildOperationExecutor.run(DefaultBuildOperationExecutor.java:63)
        at org.gradle.initialization.DefaultGradleLauncher.doBuild(DefaultGradleLauncher.java:92)
        at org.gradle.initialization.DefaultGradleLauncher.run(DefaultGradleLauncher.java:83)
        at org.gradle.launcher.exec.InProcessBuildActionExecuter$DefaultBuildController.run(InProcessBuildActionExecuter.java:94)
        at org.gradle.tooling.internal.provider.ExecuteBuildActionRunner.run(ExecuteBuildActionRunner.java:28)
        at org.gradle.launcher.exec.ChainingBuildActionRunner.run(ChainingBuildActionRunner.java:35)
        at org.gradle.launcher.exec.InProcessBuildActionExecuter.execute(InProcessBuildActionExecuter.java:43)
        at org.gradle.launcher.exec.InProcessBuildActionExecuter.execute(InProcessBuildActionExecuter.java:28)
        at org.gradle.launcher.exec.ContinuousBuildActionExecuter.execute(ContinuousBuildActionExecuter.java:82)
        at org.gradle.launcher.exec.ContinuousBuildActionExecuter.execute(ContinuousBuildActionExecuter.java:49)
        at org.gradle.launcher.cli.RunBuildAction.run(RunBuildAction.java:43)
        at org.gradle.internal.Actions$RunnableActionAdapter.execute(Actions.java:173)
        at org.gradle.launcher.cli.CommandLineActionFactory$ParseAndBuildAction.execute(CommandLineActionFactory.java:244)
        at org.gradle.launcher.cli.CommandLineActionFactory$ParseAndBuildAction.execute(CommandLineActionFactory.java:217)
        at org.gradle.launcher.cli.JavaRuntimeValidationAction.execute(JavaRuntimeValidationAction.java:33)
        at org.gradle.launcher.cli.JavaRuntimeValidationAction.execute(JavaRuntimeValidationAction.java:24)
        at org.gradle.launcher.cli.ExceptionReportingAction.execute(ExceptionReportingAction.java:33)
        at org.gradle.launcher.cli.ExceptionReportingAction.execute(ExceptionReportingAction.java:22)
        at org.gradle.launcher.cli.CommandLineActionFactory$WithLogging.execute(CommandLineActionFactory.java:210)
        at org.gradle.launcher.cli.CommandLineActionFactory$WithLogging.execute(CommandLineActionFactory.java:174)
        at org.gradle.launcher.Main.doAction(Main.java:33)
        at org.gradle.launcher.bootstrap.EntryPoint.run(EntryPoint.java:45)
        at org.gradle.launcher.bootstrap.ProcessBootstrap.runNoExit(ProcessBootstrap.java:60)
        at org.gradle.launcher.bootstrap.ProcessBootstrap.run(ProcessBootstrap.java:37)
        at org.gradle.launcher.GradleMain.main(GradleMain.java:23)
        at org.gradle.wrapper.BootstrapMainStarter.start(BootstrapMainStarter.java:30)
        at org.gradle.wrapper.WrapperExecutor.execute(WrapperExecutor.java:129)
        at org.gradle.wrapper.GradleWrapperMain.main(GradleWrapperMain.java:61)
Caused by: java.lang.RuntimeException: java.util.concurrent.ExecutionException: java.lang.NoClassDefFoundError: org/gradle/internal/concurrent/GradleThread
        at org.jfrog.gradle.plugin.artifactory.extractor.GradleBuildInfoExtractor.extract(GradleBuildInfoExtractor.java:159)
        at org.jfrog.gradle.plugin.artifactory.task.DeployTask.prepareAndDeploy(DeployTask.java:126)
        at org.jfrog.gradle.plugin.artifactory.task.DeployTask.collectProjectBuildInfo(DeployTask.java:59)
        at org.jfrog.gradle.plugin.artifactory.task.DeployTask.taskAction(DeployTask.java:53)
        at org.gradle.internal.reflect.JavaMethod.invoke(JavaMethod.java:75)
        at org.gradle.api.internal.project.taskfactory.DefaultTaskClassInfoStore$StandardTaskAction.doExecute(DefaultTaskClassInfoStore.java:133)
        at org.gradle.api.internal.project.taskfactory.DefaultTaskClassInfoStore$StandardTaskAction.execute(DefaultTaskClassInfoStore.java:126)
        at org.gradle.api.internal.project.taskfactory.DefaultTaskClassInfoStore$StandardTaskAction.execute(DefaultTaskClassInfoStore.java:115)
        at org.gradle.api.internal.AbstractTask$TaskActionWrapper.execute(AbstractTask.java:623)
        at org.gradle.api.internal.AbstractTask$TaskActionWrapper.execute(AbstractTask.java:606)
        at org.gradle.api.internal.tasks.execution.ExecuteActionsTaskExecuter.executeAction(ExecuteActionsTaskExecuter.java:80)
        at org.gradle.api.internal.tasks.execution.ExecuteActionsTaskExecuter.executeActions(ExecuteActionsTaskExecuter.java:61)
        ... 58 more
Caused by: java.util.concurrent.ExecutionException: java.lang.NoClassDefFoundError: org/gradle/internal/concurrent/GradleThread
        at org.jfrog.gradle.plugin.artifactory.extractor.GradleBuildInfoExtractor.extract(GradleBuildInfoExtractor.java:157)
        ... 69 more
Caused by: java.lang.NoClassDefFoundError: org/gradle/internal/concurrent/GradleThread
        at org.jfrog.gradle.plugin.artifactory.extractor.GradleBuildInfoExtractor.extractModuleInManagedThread(GradleBuildInfoExtractor.java:280)
        at org.jfrog.gradle.plugin.artifactory.extractor.GradleBuildInfoExtractor.addModule(GradleBuildInfoExtractor.java:288)
        at org.jfrog.gradle.plugin.artifactory.extractor.GradleBuildInfoExtractor.lambda$null$1(GradleBuildInfoExtractor.java:155)

2020-01-23 01:07:05.056:INFO::Shutdown hook executing
2020-01-23 01:07:05.057:INFO::Stopped SslSocketConnector@0.0.0.0:35403
2020-01-23 01:07:05.564:INFO:/cas:Closing Spring root WebApplicationContext
2020-01-23 01:07:05.583:INFO::Shutdown hook complete
2020-01-23 01:07:06.583:INFO::Stopped SslSocketConnector@0.0.0.0:39903
2020-01-23 01:07:06.584:INFO::Stopped SelectChannelConnector@0.0.0.0:36935
2020-01-23 01:07:07.088:INFO:/cas-sample:Closing Spring root WebApplicationContext
2020-01-23 01:07:07.204:INFO::Shutdown hook complete