Build: #25 failed

Job: Default Job failed

Stages & jobs

  1. Default Stage

Build log

The build generated 1,458 lines of output.The output is too long and has been truncated to the last 1,000 lines. Download or view full build log

14-Oct-2019 23:43:45         at redis.clients.jedis.Pipeline.sync(Pipeline.java:85)
14-Oct-2019 23:43:45         at org.springframework.data.redis.connection.jedis.JedisConnection.convertPipelineResults(JedisConnection.java:335)
14-Oct-2019 23:43:45         ... 33 more
14-Oct-2019 23:43:45
14-Oct-2019 23:43:45 testStoreAccessToken(org.springframework.security.oauth2.provider.token.store.redis.RedisTokenStorePrefixTests)  Time elapsed: 0.001 sec  <<< ERROR!
14-Oct-2019 23:43:45 org.springframework.data.redis.connection.RedisPipelineException: Pipeline contained one or more invalid commands; nested exception is org.springframework.dao.InvalidDataAccessApiUsageException: WRONGTYPE Operation against a key holding the wrong kind of value; nested exception is redis.clients.jedis.exceptions.JedisDataException: WRONGTYPE Operation against a key holding the wrong kind of value
14-Oct-2019 23:43:45         at org.springframework.data.redis.connection.jedis.JedisConnection.convertPipelineResults(JedisConnection.java:357)
14-Oct-2019 23:43:45         at org.springframework.data.redis.connection.jedis.JedisConnection.closePipeline(JedisConnection.java:324)
14-Oct-2019 23:43:45         at org.springframework.security.oauth2.provider.token.store.redis.RedisTokenStore.storeAccessToken(RedisTokenStore.java:191)
14-Oct-2019 23:43:45         at org.springframework.security.oauth2.provider.token.store.TokenStoreBaseTests.testStoreAccessToken(TokenStoreBaseTests.java:50)
14-Oct-2019 23:43:45         at sun.reflect.NativeMethodAccessorImpl.invoke0(Native Method)
14-Oct-2019 23:43:45         at sun.reflect.NativeMethodAccessorImpl.invoke(NativeMethodAccessorImpl.java:57)
14-Oct-2019 23:43:45         at sun.reflect.DelegatingMethodAccessorImpl.invoke(DelegatingMethodAccessorImpl.java:43)
14-Oct-2019 23:43:45         at java.lang.reflect.Method.invoke(Method.java:606)
14-Oct-2019 23:43:45         at org.junit.runners.model.FrameworkMethod$1.runReflectiveCall(FrameworkMethod.java:50)
14-Oct-2019 23:43:45         at org.junit.internal.runners.model.ReflectiveCallable.run(ReflectiveCallable.java:12)
14-Oct-2019 23:43:45         at org.junit.runners.model.FrameworkMethod.invokeExplosively(FrameworkMethod.java:47)
14-Oct-2019 23:43:45         at org.junit.internal.runners.statements.InvokeMethod.evaluate(InvokeMethod.java:17)
14-Oct-2019 23:43:45         at org.junit.internal.runners.statements.RunBefores.evaluate(RunBefores.java:26)
14-Oct-2019 23:43:45         at org.junit.runners.ParentRunner.runLeaf(ParentRunner.java:325)
14-Oct-2019 23:43:45         at org.junit.runners.BlockJUnit4ClassRunner.runChild(BlockJUnit4ClassRunner.java:78)
14-Oct-2019 23:43:45         at org.junit.runners.BlockJUnit4ClassRunner.runChild(BlockJUnit4ClassRunner.java:57)
14-Oct-2019 23:43:45         at org.junit.runners.ParentRunner$3.run(ParentRunner.java:290)
14-Oct-2019 23:43:45         at org.junit.runners.ParentRunner$1.schedule(ParentRunner.java:71)
14-Oct-2019 23:43:45         at org.junit.runners.ParentRunner.runChildren(ParentRunner.java:288)
14-Oct-2019 23:43:45         at org.junit.runners.ParentRunner.access$000(ParentRunner.java:58)
14-Oct-2019 23:43:45         at org.junit.runners.ParentRunner$2.evaluate(ParentRunner.java:268)
14-Oct-2019 23:43:45         at org.junit.runners.ParentRunner.run(ParentRunner.java:363)
14-Oct-2019 23:43:45         at org.apache.maven.surefire.junit4.JUnit4Provider.execute(JUnit4Provider.java:252)
14-Oct-2019 23:43:45         at org.apache.maven.surefire.junit4.JUnit4Provider.executeTestSet(JUnit4Provider.java:141)
14-Oct-2019 23:43:45         at org.apache.maven.surefire.junit4.JUnit4Provider.invoke(JUnit4Provider.java:112)
14-Oct-2019 23:43:45         at sun.reflect.NativeMethodAccessorImpl.invoke0(Native Method)
14-Oct-2019 23:43:45         at sun.reflect.NativeMethodAccessorImpl.invoke(NativeMethodAccessorImpl.java:57)
14-Oct-2019 23:43:45         at sun.reflect.DelegatingMethodAccessorImpl.invoke(DelegatingMethodAccessorImpl.java:43)
14-Oct-2019 23:43:45         at java.lang.reflect.Method.invoke(Method.java:606)
14-Oct-2019 23:43:45         at org.apache.maven.surefire.util.ReflectionUtils.invokeMethodWithArray(ReflectionUtils.java:189)
14-Oct-2019 23:43:45         at org.apache.maven.surefire.booter.ProviderFactory$ProviderProxy.invoke(ProviderFactory.java:165)
14-Oct-2019 23:43:45         at org.apache.maven.surefire.booter.ProviderFactory.invokeProvider(ProviderFactory.java:85)
14-Oct-2019 23:43:45         at org.apache.maven.surefire.booter.ForkedBooter.runSuitesInProcess(ForkedBooter.java:115)
14-Oct-2019 23:43:45         at org.apache.maven.surefire.booter.ForkedBooter.main(ForkedBooter.java:75)
14-Oct-2019 23:43:45 Caused by: org.springframework.dao.InvalidDataAccessApiUsageException: WRONGTYPE Operation against a key holding the wrong kind of value; nested exception is redis.clients.jedis.exceptions.JedisDataException: WRONGTYPE Operation against a key holding the wrong kind of value
14-Oct-2019 23:43:45         at org.springframework.data.redis.connection.jedis.JedisExceptionConverter.convert(JedisExceptionConverter.java:44)
14-Oct-2019 23:43:45         at org.springframework.data.redis.connection.jedis.JedisExceptionConverter.convert(JedisExceptionConverter.java:36)
14-Oct-2019 23:43:45         at org.springframework.data.redis.PassThroughExceptionTranslationStrategy.translate(PassThroughExceptionTranslationStrategy.java:37)
14-Oct-2019 23:43:45         at org.springframework.data.redis.FallbackExceptionTranslationStrategy.translate(FallbackExceptionTranslationStrategy.java:37)
14-Oct-2019 23:43:45         at org.springframework.data.redis.connection.jedis.JedisConnection.convertJedisAccessException(JedisConnection.java:196)
14-Oct-2019 23:43:45         at org.springframework.data.redis.connection.jedis.JedisConnection.convertPipelineResults(JedisConnection.java:344)
14-Oct-2019 23:43:45         ... 33 more
14-Oct-2019 23:43:45 Caused by: redis.clients.jedis.exceptions.JedisDataException: WRONGTYPE Operation against a key holding the wrong kind of value
14-Oct-2019 23:43:45         at redis.clients.jedis.Protocol.processError(Protocol.java:116)
14-Oct-2019 23:43:45         at redis.clients.jedis.Protocol.process(Protocol.java:141)
14-Oct-2019 23:43:45         at redis.clients.jedis.Protocol.read(Protocol.java:195)
14-Oct-2019 23:43:45         at redis.clients.jedis.Connection.readProtocolWithCheckingBroken(Connection.java:282)
14-Oct-2019 23:43:45         at redis.clients.jedis.Connection.getAll(Connection.java:252)
14-Oct-2019 23:43:45         at redis.clients.jedis.Connection.getAll(Connection.java:244)
14-Oct-2019 23:43:45         at redis.clients.jedis.Pipeline.sync(Pipeline.java:85)
14-Oct-2019 23:43:45         at org.springframework.data.redis.connection.jedis.JedisConnection.convertPipelineResults(JedisConnection.java:335)
14-Oct-2019 23:43:45         ... 33 more
14-Oct-2019 23:43:45
14-Oct-2019 23:43:45 testRemovedTokenCannotBeFoundByUsername(org.springframework.security.oauth2.provider.token.store.redis.RedisTokenStorePrefixTests)  Time elapsed: 0.002 sec  <<< ERROR!
14-Oct-2019 23:43:45 org.springframework.data.redis.connection.RedisPipelineException: Pipeline contained one or more invalid commands; nested exception is org.springframework.dao.InvalidDataAccessApiUsageException: WRONGTYPE Operation against a key holding the wrong kind of value; nested exception is redis.clients.jedis.exceptions.JedisDataException: WRONGTYPE Operation against a key holding the wrong kind of value
14-Oct-2019 23:43:45         at org.springframework.data.redis.connection.jedis.JedisConnection.convertPipelineResults(JedisConnection.java:357)
14-Oct-2019 23:43:45         at org.springframework.data.redis.connection.jedis.JedisConnection.closePipeline(JedisConnection.java:324)
14-Oct-2019 23:43:45         at org.springframework.security.oauth2.provider.token.store.redis.RedisTokenStore.storeAccessToken(RedisTokenStore.java:191)
14-Oct-2019 23:43:45         at org.springframework.security.oauth2.provider.token.store.TokenStoreBaseTests.testRemovedTokenCannotBeFoundByUsername(TokenStoreBaseTests.java:202)
14-Oct-2019 23:43:45         at sun.reflect.NativeMethodAccessorImpl.invoke0(Native Method)
14-Oct-2019 23:43:45         at sun.reflect.NativeMethodAccessorImpl.invoke(NativeMethodAccessorImpl.java:57)
14-Oct-2019 23:43:45         at sun.reflect.DelegatingMethodAccessorImpl.invoke(DelegatingMethodAccessorImpl.java:43)
14-Oct-2019 23:43:45         at java.lang.reflect.Method.invoke(Method.java:606)
14-Oct-2019 23:43:45         at org.junit.runners.model.FrameworkMethod$1.runReflectiveCall(FrameworkMethod.java:50)
14-Oct-2019 23:43:45         at org.junit.internal.runners.model.ReflectiveCallable.run(ReflectiveCallable.java:12)
14-Oct-2019 23:43:45         at org.junit.runners.model.FrameworkMethod.invokeExplosively(FrameworkMethod.java:47)
14-Oct-2019 23:43:45         at org.junit.internal.runners.statements.InvokeMethod.evaluate(InvokeMethod.java:17)
14-Oct-2019 23:43:45         at org.junit.internal.runners.statements.RunBefores.evaluate(RunBefores.java:26)
14-Oct-2019 23:43:45         at org.junit.runners.ParentRunner.runLeaf(ParentRunner.java:325)
14-Oct-2019 23:43:45         at org.junit.runners.BlockJUnit4ClassRunner.runChild(BlockJUnit4ClassRunner.java:78)
14-Oct-2019 23:43:45         at org.junit.runners.BlockJUnit4ClassRunner.runChild(BlockJUnit4ClassRunner.java:57)
14-Oct-2019 23:43:45         at org.junit.runners.ParentRunner$3.run(ParentRunner.java:290)
14-Oct-2019 23:43:45         at org.junit.runners.ParentRunner$1.schedule(ParentRunner.java:71)
14-Oct-2019 23:43:45         at org.junit.runners.ParentRunner.runChildren(ParentRunner.java:288)
14-Oct-2019 23:43:45         at org.junit.runners.ParentRunner.access$000(ParentRunner.java:58)
14-Oct-2019 23:43:45         at org.junit.runners.ParentRunner$2.evaluate(ParentRunner.java:268)
14-Oct-2019 23:43:45         at org.junit.runners.ParentRunner.run(ParentRunner.java:363)
14-Oct-2019 23:43:45         at org.apache.maven.surefire.junit4.JUnit4Provider.execute(JUnit4Provider.java:252)
14-Oct-2019 23:43:45         at org.apache.maven.surefire.junit4.JUnit4Provider.executeTestSet(JUnit4Provider.java:141)
14-Oct-2019 23:43:45         at org.apache.maven.surefire.junit4.JUnit4Provider.invoke(JUnit4Provider.java:112)
14-Oct-2019 23:43:45         at sun.reflect.NativeMethodAccessorImpl.invoke0(Native Method)
14-Oct-2019 23:43:45         at sun.reflect.NativeMethodAccessorImpl.invoke(NativeMethodAccessorImpl.java:57)
14-Oct-2019 23:43:45         at sun.reflect.DelegatingMethodAccessorImpl.invoke(DelegatingMethodAccessorImpl.java:43)
14-Oct-2019 23:43:45         at java.lang.reflect.Method.invoke(Method.java:606)
14-Oct-2019 23:43:45         at org.apache.maven.surefire.util.ReflectionUtils.invokeMethodWithArray(ReflectionUtils.java:189)
14-Oct-2019 23:43:45         at org.apache.maven.surefire.booter.ProviderFactory$ProviderProxy.invoke(ProviderFactory.java:165)
14-Oct-2019 23:43:45         at org.apache.maven.surefire.booter.ProviderFactory.invokeProvider(ProviderFactory.java:85)
14-Oct-2019 23:43:45         at org.apache.maven.surefire.booter.ForkedBooter.runSuitesInProcess(ForkedBooter.java:115)
14-Oct-2019 23:43:45         at org.apache.maven.surefire.booter.ForkedBooter.main(ForkedBooter.java:75)
14-Oct-2019 23:43:45 Caused by: org.springframework.dao.InvalidDataAccessApiUsageException: WRONGTYPE Operation against a key holding the wrong kind of value; nested exception is redis.clients.jedis.exceptions.JedisDataException: WRONGTYPE Operation against a key holding the wrong kind of value
14-Oct-2019 23:43:45         at org.springframework.data.redis.connection.jedis.JedisExceptionConverter.convert(JedisExceptionConverter.java:44)
14-Oct-2019 23:43:45         at org.springframework.data.redis.connection.jedis.JedisExceptionConverter.convert(JedisExceptionConverter.java:36)
14-Oct-2019 23:43:45         at org.springframework.data.redis.PassThroughExceptionTranslationStrategy.translate(PassThroughExceptionTranslationStrategy.java:37)
14-Oct-2019 23:43:45         at org.springframework.data.redis.FallbackExceptionTranslationStrategy.translate(FallbackExceptionTranslationStrategy.java:37)
14-Oct-2019 23:43:45         at org.springframework.data.redis.connection.jedis.JedisConnection.convertJedisAccessException(JedisConnection.java:196)
14-Oct-2019 23:43:45         at org.springframework.data.redis.connection.jedis.JedisConnection.convertPipelineResults(JedisConnection.java:344)
14-Oct-2019 23:43:45         ... 33 more
14-Oct-2019 23:43:45 Caused by: redis.clients.jedis.exceptions.JedisDataException: WRONGTYPE Operation against a key holding the wrong kind of value
14-Oct-2019 23:43:45         at redis.clients.jedis.Protocol.processError(Protocol.java:116)
14-Oct-2019 23:43:45         at redis.clients.jedis.Protocol.process(Protocol.java:141)
14-Oct-2019 23:43:45         at redis.clients.jedis.Protocol.read(Protocol.java:195)
14-Oct-2019 23:43:45         at redis.clients.jedis.Connection.readProtocolWithCheckingBroken(Connection.java:282)
14-Oct-2019 23:43:45         at redis.clients.jedis.Connection.getAll(Connection.java:252)
14-Oct-2019 23:43:45         at redis.clients.jedis.Connection.getAll(Connection.java:244)
14-Oct-2019 23:43:45         at redis.clients.jedis.Pipeline.sync(Pipeline.java:85)
14-Oct-2019 23:43:45         at org.springframework.data.redis.connection.jedis.JedisConnection.convertPipelineResults(JedisConnection.java:335)
14-Oct-2019 23:43:45         ... 33 more
14-Oct-2019 23:43:45
14-Oct-2019 23:43:45 testStoreAccessTokenTwice(org.springframework.security.oauth2.provider.token.store.redis.RedisTokenStorePrefixTests)  Time elapsed: 0.001 sec  <<< ERROR!
14-Oct-2019 23:43:45 org.springframework.data.redis.connection.RedisPipelineException: Pipeline contained one or more invalid commands; nested exception is org.springframework.dao.InvalidDataAccessApiUsageException: WRONGTYPE Operation against a key holding the wrong kind of value; nested exception is redis.clients.jedis.exceptions.JedisDataException: WRONGTYPE Operation against a key holding the wrong kind of value
14-Oct-2019 23:43:45         at org.springframework.data.redis.connection.jedis.JedisConnection.convertPipelineResults(JedisConnection.java:357)
14-Oct-2019 23:43:45         at org.springframework.data.redis.connection.jedis.JedisConnection.closePipeline(JedisConnection.java:324)
14-Oct-2019 23:43:45         at org.springframework.security.oauth2.provider.token.store.redis.RedisTokenStore.storeAccessToken(RedisTokenStore.java:191)
14-Oct-2019 23:43:45         at org.springframework.security.oauth2.provider.token.store.TokenStoreBaseTests.testStoreAccessTokenTwice(TokenStoreBaseTests.java:64)
14-Oct-2019 23:43:45         at sun.reflect.NativeMethodAccessorImpl.invoke0(Native Method)
14-Oct-2019 23:43:45         at sun.reflect.NativeMethodAccessorImpl.invoke(NativeMethodAccessorImpl.java:57)
14-Oct-2019 23:43:45         at sun.reflect.DelegatingMethodAccessorImpl.invoke(DelegatingMethodAccessorImpl.java:43)
14-Oct-2019 23:43:45         at java.lang.reflect.Method.invoke(Method.java:606)
14-Oct-2019 23:43:45         at org.junit.runners.model.FrameworkMethod$1.runReflectiveCall(FrameworkMethod.java:50)
14-Oct-2019 23:43:45         at org.junit.internal.runners.model.ReflectiveCallable.run(ReflectiveCallable.java:12)
14-Oct-2019 23:43:45         at org.junit.runners.model.FrameworkMethod.invokeExplosively(FrameworkMethod.java:47)
14-Oct-2019 23:43:45         at org.junit.internal.runners.statements.InvokeMethod.evaluate(InvokeMethod.java:17)
14-Oct-2019 23:43:45         at org.junit.internal.runners.statements.RunBefores.evaluate(RunBefores.java:26)
14-Oct-2019 23:43:45         at org.junit.runners.ParentRunner.runLeaf(ParentRunner.java:325)
14-Oct-2019 23:43:45         at org.junit.runners.BlockJUnit4ClassRunner.runChild(BlockJUnit4ClassRunner.java:78)
14-Oct-2019 23:43:45         at org.junit.runners.BlockJUnit4ClassRunner.runChild(BlockJUnit4ClassRunner.java:57)
14-Oct-2019 23:43:45         at org.junit.runners.ParentRunner$3.run(ParentRunner.java:290)
14-Oct-2019 23:43:45         at org.junit.runners.ParentRunner$1.schedule(ParentRunner.java:71)
14-Oct-2019 23:43:45         at org.junit.runners.ParentRunner.runChildren(ParentRunner.java:288)
14-Oct-2019 23:43:45         at org.junit.runners.ParentRunner.access$000(ParentRunner.java:58)
14-Oct-2019 23:43:45         at org.junit.runners.ParentRunner$2.evaluate(ParentRunner.java:268)
14-Oct-2019 23:43:45         at org.junit.runners.ParentRunner.run(ParentRunner.java:363)
14-Oct-2019 23:43:45         at org.apache.maven.surefire.junit4.JUnit4Provider.execute(JUnit4Provider.java:252)
14-Oct-2019 23:43:45         at org.apache.maven.surefire.junit4.JUnit4Provider.executeTestSet(JUnit4Provider.java:141)
14-Oct-2019 23:43:45         at org.apache.maven.surefire.junit4.JUnit4Provider.invoke(JUnit4Provider.java:112)
14-Oct-2019 23:43:45         at sun.reflect.NativeMethodAccessorImpl.invoke0(Native Method)
14-Oct-2019 23:43:45         at sun.reflect.NativeMethodAccessorImpl.invoke(NativeMethodAccessorImpl.java:57)
14-Oct-2019 23:43:45         at sun.reflect.DelegatingMethodAccessorImpl.invoke(DelegatingMethodAccessorImpl.java:43)
14-Oct-2019 23:43:45         at java.lang.reflect.Method.invoke(Method.java:606)
14-Oct-2019 23:43:45         at org.apache.maven.surefire.util.ReflectionUtils.invokeMethodWithArray(ReflectionUtils.java:189)
14-Oct-2019 23:43:45         at org.apache.maven.surefire.booter.ProviderFactory$ProviderProxy.invoke(ProviderFactory.java:165)
14-Oct-2019 23:43:45         at org.apache.maven.surefire.booter.ProviderFactory.invokeProvider(ProviderFactory.java:85)
14-Oct-2019 23:43:45         at org.apache.maven.surefire.booter.ForkedBooter.runSuitesInProcess(ForkedBooter.java:115)
14-Oct-2019 23:43:45         at org.apache.maven.surefire.booter.ForkedBooter.main(ForkedBooter.java:75)
14-Oct-2019 23:43:45 Caused by: org.springframework.dao.InvalidDataAccessApiUsageException: WRONGTYPE Operation against a key holding the wrong kind of value; nested exception is redis.clients.jedis.exceptions.JedisDataException: WRONGTYPE Operation against a key holding the wrong kind of value
14-Oct-2019 23:43:45         at org.springframework.data.redis.connection.jedis.JedisExceptionConverter.convert(JedisExceptionConverter.java:44)
14-Oct-2019 23:43:45         at org.springframework.data.redis.connection.jedis.JedisExceptionConverter.convert(JedisExceptionConverter.java:36)
14-Oct-2019 23:43:45         at org.springframework.data.redis.PassThroughExceptionTranslationStrategy.translate(PassThroughExceptionTranslationStrategy.java:37)
14-Oct-2019 23:43:45         at org.springframework.data.redis.FallbackExceptionTranslationStrategy.translate(FallbackExceptionTranslationStrategy.java:37)
14-Oct-2019 23:43:45         at org.springframework.data.redis.connection.jedis.JedisConnection.convertJedisAccessException(JedisConnection.java:196)
14-Oct-2019 23:43:45         at org.springframework.data.redis.connection.jedis.JedisConnection.convertPipelineResults(JedisConnection.java:344)
14-Oct-2019 23:43:45         ... 33 more
14-Oct-2019 23:43:45 Caused by: redis.clients.jedis.exceptions.JedisDataException: WRONGTYPE Operation against a key holding the wrong kind of value
14-Oct-2019 23:43:45         at redis.clients.jedis.Protocol.processError(Protocol.java:116)
14-Oct-2019 23:43:45         at redis.clients.jedis.Protocol.process(Protocol.java:141)
14-Oct-2019 23:43:45         at redis.clients.jedis.Protocol.read(Protocol.java:195)
14-Oct-2019 23:43:45         at redis.clients.jedis.Connection.readProtocolWithCheckingBroken(Connection.java:282)
14-Oct-2019 23:43:45         at redis.clients.jedis.Connection.getAll(Connection.java:252)
14-Oct-2019 23:43:45         at redis.clients.jedis.Connection.getAll(Connection.java:244)
14-Oct-2019 23:43:45         at redis.clients.jedis.Pipeline.sync(Pipeline.java:85)
14-Oct-2019 23:43:45         at org.springframework.data.redis.connection.jedis.JedisConnection.convertPipelineResults(JedisConnection.java:335)
14-Oct-2019 23:43:45         ... 33 more
14-Oct-2019 23:43:45
14-Oct-2019 23:43:45 testRefreshTokenIsNotStoredDuringAccessToken(org.springframework.security.oauth2.provider.token.store.redis.RedisTokenStorePrefixTests)  Time elapsed: 0.002 sec  <<< ERROR!
14-Oct-2019 23:43:45 org.springframework.data.redis.connection.RedisPipelineException: Pipeline contained one or more invalid commands; nested exception is org.springframework.dao.InvalidDataAccessApiUsageException: WRONGTYPE Operation against a key holding the wrong kind of value; nested exception is redis.clients.jedis.exceptions.JedisDataException: WRONGTYPE Operation against a key holding the wrong kind of value
14-Oct-2019 23:43:45         at org.springframework.data.redis.connection.jedis.JedisConnection.convertPipelineResults(JedisConnection.java:357)
14-Oct-2019 23:43:45         at org.springframework.data.redis.connection.jedis.JedisConnection.closePipeline(JedisConnection.java:324)
14-Oct-2019 23:43:45         at org.springframework.security.oauth2.provider.token.store.redis.RedisTokenStore.storeAccessToken(RedisTokenStore.java:191)
14-Oct-2019 23:43:45         at org.springframework.security.oauth2.provider.token.store.TokenStoreBaseTests.testRefreshTokenIsNotStoredDuringAccessToken(TokenStoreBaseTests.java:133)
14-Oct-2019 23:43:45         at sun.reflect.NativeMethodAccessorImpl.invoke0(Native Method)
14-Oct-2019 23:43:45         at sun.reflect.NativeMethodAccessorImpl.invoke(NativeMethodAccessorImpl.java:57)
14-Oct-2019 23:43:45         at sun.reflect.DelegatingMethodAccessorImpl.invoke(DelegatingMethodAccessorImpl.java:43)
14-Oct-2019 23:43:45         at java.lang.reflect.Method.invoke(Method.java:606)
14-Oct-2019 23:43:45         at org.junit.runners.model.FrameworkMethod$1.runReflectiveCall(FrameworkMethod.java:50)
14-Oct-2019 23:43:45         at org.junit.internal.runners.model.ReflectiveCallable.run(ReflectiveCallable.java:12)
14-Oct-2019 23:43:45         at org.junit.runners.model.FrameworkMethod.invokeExplosively(FrameworkMethod.java:47)
14-Oct-2019 23:43:45         at org.junit.internal.runners.statements.InvokeMethod.evaluate(InvokeMethod.java:17)
14-Oct-2019 23:43:45         at org.junit.internal.runners.statements.RunBefores.evaluate(RunBefores.java:26)
14-Oct-2019 23:43:45         at org.junit.runners.ParentRunner.runLeaf(ParentRunner.java:325)
14-Oct-2019 23:43:45         at org.junit.runners.BlockJUnit4ClassRunner.runChild(BlockJUnit4ClassRunner.java:78)
14-Oct-2019 23:43:45         at org.junit.runners.BlockJUnit4ClassRunner.runChild(BlockJUnit4ClassRunner.java:57)
14-Oct-2019 23:43:45         at org.junit.runners.ParentRunner$3.run(ParentRunner.java:290)
14-Oct-2019 23:43:45         at org.junit.runners.ParentRunner$1.schedule(ParentRunner.java:71)
14-Oct-2019 23:43:45         at org.junit.runners.ParentRunner.runChildren(ParentRunner.java:288)
14-Oct-2019 23:43:45         at org.junit.runners.ParentRunner.access$000(ParentRunner.java:58)
14-Oct-2019 23:43:45         at org.junit.runners.ParentRunner$2.evaluate(ParentRunner.java:268)
14-Oct-2019 23:43:45         at org.junit.runners.ParentRunner.run(ParentRunner.java:363)
14-Oct-2019 23:43:45         at org.apache.maven.surefire.junit4.JUnit4Provider.execute(JUnit4Provider.java:252)
14-Oct-2019 23:43:45         at org.apache.maven.surefire.junit4.JUnit4Provider.executeTestSet(JUnit4Provider.java:141)
14-Oct-2019 23:43:45         at org.apache.maven.surefire.junit4.JUnit4Provider.invoke(JUnit4Provider.java:112)
14-Oct-2019 23:43:45         at sun.reflect.NativeMethodAccessorImpl.invoke0(Native Method)
14-Oct-2019 23:43:45         at sun.reflect.NativeMethodAccessorImpl.invoke(NativeMethodAccessorImpl.java:57)
14-Oct-2019 23:43:45         at sun.reflect.DelegatingMethodAccessorImpl.invoke(DelegatingMethodAccessorImpl.java:43)
14-Oct-2019 23:43:45         at java.lang.reflect.Method.invoke(Method.java:606)
14-Oct-2019 23:43:45         at org.apache.maven.surefire.util.ReflectionUtils.invokeMethodWithArray(ReflectionUtils.java:189)
14-Oct-2019 23:43:45         at org.apache.maven.surefire.booter.ProviderFactory$ProviderProxy.invoke(ProviderFactory.java:165)
14-Oct-2019 23:43:45         at org.apache.maven.surefire.booter.ProviderFactory.invokeProvider(ProviderFactory.java:85)
14-Oct-2019 23:43:45         at org.apache.maven.surefire.booter.ForkedBooter.runSuitesInProcess(ForkedBooter.java:115)
14-Oct-2019 23:43:45         at org.apache.maven.surefire.booter.ForkedBooter.main(ForkedBooter.java:75)
14-Oct-2019 23:43:45 Caused by: org.springframework.dao.InvalidDataAccessApiUsageException: WRONGTYPE Operation against a key holding the wrong kind of value; nested exception is redis.clients.jedis.exceptions.JedisDataException: WRONGTYPE Operation against a key holding the wrong kind of value
14-Oct-2019 23:43:45         at org.springframework.data.redis.connection.jedis.JedisExceptionConverter.convert(JedisExceptionConverter.java:44)
14-Oct-2019 23:43:45         at org.springframework.data.redis.connection.jedis.JedisExceptionConverter.convert(JedisExceptionConverter.java:36)
14-Oct-2019 23:43:45         at org.springframework.data.redis.PassThroughExceptionTranslationStrategy.translate(PassThroughExceptionTranslationStrategy.java:37)
14-Oct-2019 23:43:45         at org.springframework.data.redis.FallbackExceptionTranslationStrategy.translate(FallbackExceptionTranslationStrategy.java:37)
14-Oct-2019 23:43:45         at org.springframework.data.redis.connection.jedis.JedisConnection.convertJedisAccessException(JedisConnection.java:196)
14-Oct-2019 23:43:45         at org.springframework.data.redis.connection.jedis.JedisConnection.convertPipelineResults(JedisConnection.java:344)
14-Oct-2019 23:43:45         ... 33 more
14-Oct-2019 23:43:45 Caused by: redis.clients.jedis.exceptions.JedisDataException: WRONGTYPE Operation against a key holding the wrong kind of value
14-Oct-2019 23:43:45         at redis.clients.jedis.Protocol.processError(Protocol.java:116)
14-Oct-2019 23:43:45         at redis.clients.jedis.Protocol.process(Protocol.java:141)
14-Oct-2019 23:43:45         at redis.clients.jedis.Protocol.read(Protocol.java:195)
14-Oct-2019 23:43:45         at redis.clients.jedis.Connection.readProtocolWithCheckingBroken(Connection.java:282)
14-Oct-2019 23:43:45         at redis.clients.jedis.Connection.getAll(Connection.java:252)
14-Oct-2019 23:43:45         at redis.clients.jedis.Connection.getAll(Connection.java:244)
14-Oct-2019 23:43:45         at redis.clients.jedis.Pipeline.sync(Pipeline.java:85)
14-Oct-2019 23:43:45         at org.springframework.data.redis.connection.jedis.JedisConnection.convertPipelineResults(JedisConnection.java:335)
14-Oct-2019 23:43:45         ... 33 more
14-Oct-2019 23:43:45
14-Oct-2019 23:43:45 testGetAccessTokenForDeletedUser(org.springframework.security.oauth2.provider.token.store.redis.RedisTokenStorePrefixTests)  Time elapsed: 0.001 sec  <<< ERROR!
14-Oct-2019 23:43:45 org.springframework.data.redis.connection.RedisPipelineException: Pipeline contained one or more invalid commands; nested exception is org.springframework.dao.InvalidDataAccessApiUsageException: WRONGTYPE Operation against a key holding the wrong kind of value; nested exception is redis.clients.jedis.exceptions.JedisDataException: WRONGTYPE Operation against a key holding the wrong kind of value
14-Oct-2019 23:43:45         at org.springframework.data.redis.connection.jedis.JedisConnection.convertPipelineResults(JedisConnection.java:357)
14-Oct-2019 23:43:45         at org.springframework.data.redis.connection.jedis.JedisConnection.closePipeline(JedisConnection.java:324)
14-Oct-2019 23:43:45         at org.springframework.security.oauth2.provider.token.store.redis.RedisTokenStore.storeAccessToken(RedisTokenStore.java:191)
14-Oct-2019 23:43:45         at org.springframework.security.oauth2.provider.token.store.TokenStoreBaseTests.testGetAccessTokenForDeletedUser(TokenStoreBaseTests.java:170)
14-Oct-2019 23:43:45         at sun.reflect.NativeMethodAccessorImpl.invoke0(Native Method)
14-Oct-2019 23:43:45         at sun.reflect.NativeMethodAccessorImpl.invoke(NativeMethodAccessorImpl.java:57)
14-Oct-2019 23:43:45         at sun.reflect.DelegatingMethodAccessorImpl.invoke(DelegatingMethodAccessorImpl.java:43)
14-Oct-2019 23:43:45         at java.lang.reflect.Method.invoke(Method.java:606)
14-Oct-2019 23:43:45         at org.junit.runners.model.FrameworkMethod$1.runReflectiveCall(FrameworkMethod.java:50)
14-Oct-2019 23:43:45         at org.junit.internal.runners.model.ReflectiveCallable.run(ReflectiveCallable.java:12)
14-Oct-2019 23:43:45         at org.junit.runners.model.FrameworkMethod.invokeExplosively(FrameworkMethod.java:47)
14-Oct-2019 23:43:45         at org.junit.internal.runners.statements.InvokeMethod.evaluate(InvokeMethod.java:17)
14-Oct-2019 23:43:45         at org.junit.internal.runners.statements.RunBefores.evaluate(RunBefores.java:26)
14-Oct-2019 23:43:45         at org.junit.runners.ParentRunner.runLeaf(ParentRunner.java:325)
14-Oct-2019 23:43:45         at org.junit.runners.BlockJUnit4ClassRunner.runChild(BlockJUnit4ClassRunner.java:78)
14-Oct-2019 23:43:45         at org.junit.runners.BlockJUnit4ClassRunner.runChild(BlockJUnit4ClassRunner.java:57)
14-Oct-2019 23:43:45         at org.junit.runners.ParentRunner$3.run(ParentRunner.java:290)
14-Oct-2019 23:43:45         at org.junit.runners.ParentRunner$1.schedule(ParentRunner.java:71)
14-Oct-2019 23:43:45         at org.junit.runners.ParentRunner.runChildren(ParentRunner.java:288)
14-Oct-2019 23:43:45         at org.junit.runners.ParentRunner.access$000(ParentRunner.java:58)
14-Oct-2019 23:43:45         at org.junit.runners.ParentRunner$2.evaluate(ParentRunner.java:268)
14-Oct-2019 23:43:45         at org.junit.runners.ParentRunner.run(ParentRunner.java:363)
14-Oct-2019 23:43:45         at org.apache.maven.surefire.junit4.JUnit4Provider.execute(JUnit4Provider.java:252)
14-Oct-2019 23:43:45         at org.apache.maven.surefire.junit4.JUnit4Provider.executeTestSet(JUnit4Provider.java:141)
14-Oct-2019 23:43:45         at org.apache.maven.surefire.junit4.JUnit4Provider.invoke(JUnit4Provider.java:112)
14-Oct-2019 23:43:45         at sun.reflect.NativeMethodAccessorImpl.invoke0(Native Method)
14-Oct-2019 23:43:45         at sun.reflect.NativeMethodAccessorImpl.invoke(NativeMethodAccessorImpl.java:57)
14-Oct-2019 23:43:45         at sun.reflect.DelegatingMethodAccessorImpl.invoke(DelegatingMethodAccessorImpl.java:43)
14-Oct-2019 23:43:45         at java.lang.reflect.Method.invoke(Method.java:606)
14-Oct-2019 23:43:45         at org.apache.maven.surefire.util.ReflectionUtils.invokeMethodWithArray(ReflectionUtils.java:189)
14-Oct-2019 23:43:45         at org.apache.maven.surefire.booter.ProviderFactory$ProviderProxy.invoke(ProviderFactory.java:165)
14-Oct-2019 23:43:45         at org.apache.maven.surefire.booter.ProviderFactory.invokeProvider(ProviderFactory.java:85)
14-Oct-2019 23:43:45         at org.apache.maven.surefire.booter.ForkedBooter.runSuitesInProcess(ForkedBooter.java:115)
14-Oct-2019 23:43:45         at org.apache.maven.surefire.booter.ForkedBooter.main(ForkedBooter.java:75)
14-Oct-2019 23:43:45 Caused by: org.springframework.dao.InvalidDataAccessApiUsageException: WRONGTYPE Operation against a key holding the wrong kind of value; nested exception is redis.clients.jedis.exceptions.JedisDataException: WRONGTYPE Operation against a key holding the wrong kind of value
14-Oct-2019 23:43:45         at org.springframework.data.redis.connection.jedis.JedisExceptionConverter.convert(JedisExceptionConverter.java:44)
14-Oct-2019 23:43:45         at org.springframework.data.redis.connection.jedis.JedisExceptionConverter.convert(JedisExceptionConverter.java:36)
14-Oct-2019 23:43:45         at org.springframework.data.redis.PassThroughExceptionTranslationStrategy.translate(PassThroughExceptionTranslationStrategy.java:37)
14-Oct-2019 23:43:45         at org.springframework.data.redis.FallbackExceptionTranslationStrategy.translate(FallbackExceptionTranslationStrategy.java:37)
14-Oct-2019 23:43:45         at org.springframework.data.redis.connection.jedis.JedisConnection.convertJedisAccessException(JedisConnection.java:196)
14-Oct-2019 23:43:45         at org.springframework.data.redis.connection.jedis.JedisConnection.convertPipelineResults(JedisConnection.java:344)
14-Oct-2019 23:43:45         ... 33 more
14-Oct-2019 23:43:45 Caused by: redis.clients.jedis.exceptions.JedisDataException: WRONGTYPE Operation against a key holding the wrong kind of value
14-Oct-2019 23:43:45         at redis.clients.jedis.Protocol.processError(Protocol.java:116)
14-Oct-2019 23:43:45         at redis.clients.jedis.Protocol.process(Protocol.java:141)
14-Oct-2019 23:43:45         at redis.clients.jedis.Protocol.read(Protocol.java:195)
14-Oct-2019 23:43:45         at redis.clients.jedis.Connection.readProtocolWithCheckingBroken(Connection.java:282)
14-Oct-2019 23:43:45         at redis.clients.jedis.Connection.getAll(Connection.java:252)
14-Oct-2019 23:43:45         at redis.clients.jedis.Connection.getAll(Connection.java:244)
14-Oct-2019 23:43:45         at redis.clients.jedis.Pipeline.sync(Pipeline.java:85)
14-Oct-2019 23:43:45         at org.springframework.data.redis.connection.jedis.JedisConnection.convertPipelineResults(JedisConnection.java:335)
14-Oct-2019 23:43:45         ... 33 more
14-Oct-2019 23:43:45
14-Oct-2019 23:43:45 Running org.springframework.security.oauth2.provider.token.store.redis.RedisTokenStoreMockTests
14-Oct-2019 23:43:45 Tests run: 2, Failures: 0, Errors: 0, Skipped: 0, Time elapsed: 0.061 sec
14-Oct-2019 23:43:45 Running org.springframework.security.oauth2.provider.token.store.redis.RedisTokenStoreTests
14-Oct-2019 23:43:46 Tests run: 16, Failures: 0, Errors: 7, Skipped: 0, Time elapsed: 1.527 sec <<< FAILURE!
14-Oct-2019 23:43:46 testExpiringAccessToken(org.springframework.security.oauth2.provider.token.store.redis.RedisTokenStoreTests)  Time elapsed: 0.001 sec  <<< ERROR!
14-Oct-2019 23:43:46 org.springframework.data.redis.connection.RedisPipelineException: Pipeline contained one or more invalid commands; nested exception is org.springframework.dao.InvalidDataAccessApiUsageException: WRONGTYPE Operation against a key holding the wrong kind of value; nested exception is redis.clients.jedis.exceptions.JedisDataException: WRONGTYPE Operation against a key holding the wrong kind of value
14-Oct-2019 23:43:46         at org.springframework.data.redis.connection.jedis.JedisConnection.convertPipelineResults(JedisConnection.java:357)
14-Oct-2019 23:43:46         at org.springframework.data.redis.connection.jedis.JedisConnection.closePipeline(JedisConnection.java:324)
14-Oct-2019 23:43:46         at org.springframework.security.oauth2.provider.token.store.redis.RedisTokenStore.storeAccessToken(RedisTokenStore.java:191)
14-Oct-2019 23:43:46         at org.springframework.security.oauth2.provider.token.store.redis.RedisTokenStoreTests.testExpiringAccessToken(RedisTokenStoreTests.java:68)
14-Oct-2019 23:43:46         at sun.reflect.NativeMethodAccessorImpl.invoke0(Native Method)
14-Oct-2019 23:43:46         at sun.reflect.NativeMethodAccessorImpl.invoke(NativeMethodAccessorImpl.java:57)
14-Oct-2019 23:43:46         at sun.reflect.DelegatingMethodAccessorImpl.invoke(DelegatingMethodAccessorImpl.java:43)
14-Oct-2019 23:43:46         at java.lang.reflect.Method.invoke(Method.java:606)
14-Oct-2019 23:43:46         at org.junit.runners.model.FrameworkMethod$1.runReflectiveCall(FrameworkMethod.java:50)
14-Oct-2019 23:43:46         at org.junit.internal.runners.model.ReflectiveCallable.run(ReflectiveCallable.java:12)
14-Oct-2019 23:43:46         at org.junit.runners.model.FrameworkMethod.invokeExplosively(FrameworkMethod.java:47)
14-Oct-2019 23:43:46         at org.junit.internal.runners.statements.InvokeMethod.evaluate(InvokeMethod.java:17)
14-Oct-2019 23:43:46         at org.junit.internal.runners.statements.RunBefores.evaluate(RunBefores.java:26)
14-Oct-2019 23:43:46         at org.junit.runners.ParentRunner.runLeaf(ParentRunner.java:325)
14-Oct-2019 23:43:46         at org.junit.runners.BlockJUnit4ClassRunner.runChild(BlockJUnit4ClassRunner.java:78)
14-Oct-2019 23:43:46         at org.junit.runners.BlockJUnit4ClassRunner.runChild(BlockJUnit4ClassRunner.java:57)
14-Oct-2019 23:43:46         at org.junit.runners.ParentRunner$3.run(ParentRunner.java:290)
14-Oct-2019 23:43:46         at org.junit.runners.ParentRunner$1.schedule(ParentRunner.java:71)
14-Oct-2019 23:43:46         at org.junit.runners.ParentRunner.runChildren(ParentRunner.java:288)
14-Oct-2019 23:43:46         at org.junit.runners.ParentRunner.access$000(ParentRunner.java:58)
14-Oct-2019 23:43:46         at org.junit.runners.ParentRunner$2.evaluate(ParentRunner.java:268)
14-Oct-2019 23:43:46         at org.junit.runners.ParentRunner.run(ParentRunner.java:363)
14-Oct-2019 23:43:46         at org.apache.maven.surefire.junit4.JUnit4Provider.execute(JUnit4Provider.java:252)
14-Oct-2019 23:43:46         at org.apache.maven.surefire.junit4.JUnit4Provider.executeTestSet(JUnit4Provider.java:141)
14-Oct-2019 23:43:46         at org.apache.maven.surefire.junit4.JUnit4Provider.invoke(JUnit4Provider.java:112)
14-Oct-2019 23:43:46         at sun.reflect.NativeMethodAccessorImpl.invoke0(Native Method)
14-Oct-2019 23:43:46         at sun.reflect.NativeMethodAccessorImpl.invoke(NativeMethodAccessorImpl.java:57)
14-Oct-2019 23:43:46         at sun.reflect.DelegatingMethodAccessorImpl.invoke(DelegatingMethodAccessorImpl.java:43)
14-Oct-2019 23:43:46         at java.lang.reflect.Method.invoke(Method.java:606)
14-Oct-2019 23:43:46         at org.apache.maven.surefire.util.ReflectionUtils.invokeMethodWithArray(ReflectionUtils.java:189)
14-Oct-2019 23:43:46         at org.apache.maven.surefire.booter.ProviderFactory$ProviderProxy.invoke(ProviderFactory.java:165)
14-Oct-2019 23:43:46         at org.apache.maven.surefire.booter.ProviderFactory.invokeProvider(ProviderFactory.java:85)
14-Oct-2019 23:43:46         at org.apache.maven.surefire.booter.ForkedBooter.runSuitesInProcess(ForkedBooter.java:115)
14-Oct-2019 23:43:46         at org.apache.maven.surefire.booter.ForkedBooter.main(ForkedBooter.java:75)
14-Oct-2019 23:43:46 Caused by: org.springframework.dao.InvalidDataAccessApiUsageException: WRONGTYPE Operation against a key holding the wrong kind of value; nested exception is redis.clients.jedis.exceptions.JedisDataException: WRONGTYPE Operation against a key holding the wrong kind of value
14-Oct-2019 23:43:46         at org.springframework.data.redis.connection.jedis.JedisExceptionConverter.convert(JedisExceptionConverter.java:44)
14-Oct-2019 23:43:46         at org.springframework.data.redis.connection.jedis.JedisExceptionConverter.convert(JedisExceptionConverter.java:36)
14-Oct-2019 23:43:46         at org.springframework.data.redis.PassThroughExceptionTranslationStrategy.translate(PassThroughExceptionTranslationStrategy.java:37)
14-Oct-2019 23:43:46         at org.springframework.data.redis.FallbackExceptionTranslationStrategy.translate(FallbackExceptionTranslationStrategy.java:37)
14-Oct-2019 23:43:46         at org.springframework.data.redis.connection.jedis.JedisConnection.convertJedisAccessException(JedisConnection.java:196)
14-Oct-2019 23:43:46         at org.springframework.data.redis.connection.jedis.JedisConnection.convertPipelineResults(JedisConnection.java:344)
14-Oct-2019 23:43:46         ... 33 more
14-Oct-2019 23:43:46 Caused by: redis.clients.jedis.exceptions.JedisDataException: WRONGTYPE Operation against a key holding the wrong kind of value
14-Oct-2019 23:43:46         at redis.clients.jedis.Protocol.processError(Protocol.java:116)
14-Oct-2019 23:43:46         at redis.clients.jedis.Protocol.process(Protocol.java:141)
14-Oct-2019 23:43:46         at redis.clients.jedis.Protocol.read(Protocol.java:195)
14-Oct-2019 23:43:46         at redis.clients.jedis.Connection.readProtocolWithCheckingBroken(Connection.java:282)
14-Oct-2019 23:43:46         at redis.clients.jedis.Connection.getAll(Connection.java:252)
14-Oct-2019 23:43:46         at redis.clients.jedis.Connection.getAll(Connection.java:244)
14-Oct-2019 23:43:46         at redis.clients.jedis.Pipeline.sync(Pipeline.java:85)
14-Oct-2019 23:43:46         at org.springframework.data.redis.connection.jedis.JedisConnection.convertPipelineResults(JedisConnection.java:335)
14-Oct-2019 23:43:46         ... 33 more
14-Oct-2019 23:43:46
14-Oct-2019 23:43:46 testRetrieveAccessToken(org.springframework.security.oauth2.provider.token.store.redis.RedisTokenStoreTests)  Time elapsed: 0.001 sec  <<< ERROR!
14-Oct-2019 23:43:46 org.springframework.data.redis.connection.RedisPipelineException: Pipeline contained one or more invalid commands; nested exception is org.springframework.dao.InvalidDataAccessApiUsageException: WRONGTYPE Operation against a key holding the wrong kind of value; nested exception is redis.clients.jedis.exceptions.JedisDataException: WRONGTYPE Operation against a key holding the wrong kind of value
14-Oct-2019 23:43:46         at org.springframework.data.redis.connection.jedis.JedisConnection.convertPipelineResults(JedisConnection.java:357)
14-Oct-2019 23:43:46         at org.springframework.data.redis.connection.jedis.JedisConnection.closePipeline(JedisConnection.java:324)
14-Oct-2019 23:43:46         at org.springframework.security.oauth2.provider.token.store.redis.RedisTokenStore.storeAccessToken(RedisTokenStore.java:191)
14-Oct-2019 23:43:46         at org.springframework.security.oauth2.provider.token.store.TokenStoreBaseTests.testRetrieveAccessToken(TokenStoreBaseTests.java:82)
14-Oct-2019 23:43:46         at sun.reflect.NativeMethodAccessorImpl.invoke0(Native Method)
14-Oct-2019 23:43:46         at sun.reflect.NativeMethodAccessorImpl.invoke(NativeMethodAccessorImpl.java:57)
14-Oct-2019 23:43:46         at sun.reflect.DelegatingMethodAccessorImpl.invoke(DelegatingMethodAccessorImpl.java:43)
14-Oct-2019 23:43:46         at java.lang.reflect.Method.invoke(Method.java:606)
14-Oct-2019 23:43:46         at org.junit.runners.model.FrameworkMethod$1.runReflectiveCall(FrameworkMethod.java:50)
14-Oct-2019 23:43:46         at org.junit.internal.runners.model.ReflectiveCallable.run(ReflectiveCallable.java:12)
14-Oct-2019 23:43:46         at org.junit.runners.model.FrameworkMethod.invokeExplosively(FrameworkMethod.java:47)
14-Oct-2019 23:43:46         at org.junit.internal.runners.statements.InvokeMethod.evaluate(InvokeMethod.java:17)
14-Oct-2019 23:43:46         at org.junit.internal.runners.statements.RunBefores.evaluate(RunBefores.java:26)
14-Oct-2019 23:43:46         at org.junit.runners.ParentRunner.runLeaf(ParentRunner.java:325)
14-Oct-2019 23:43:46         at org.junit.runners.BlockJUnit4ClassRunner.runChild(BlockJUnit4ClassRunner.java:78)
14-Oct-2019 23:43:46         at org.junit.runners.BlockJUnit4ClassRunner.runChild(BlockJUnit4ClassRunner.java:57)
14-Oct-2019 23:43:46         at org.junit.runners.ParentRunner$3.run(ParentRunner.java:290)
14-Oct-2019 23:43:46         at org.junit.runners.ParentRunner$1.schedule(ParentRunner.java:71)
14-Oct-2019 23:43:46         at org.junit.runners.ParentRunner.runChildren(ParentRunner.java:288)
14-Oct-2019 23:43:46         at org.junit.runners.ParentRunner.access$000(ParentRunner.java:58)
14-Oct-2019 23:43:46         at org.junit.runners.ParentRunner$2.evaluate(ParentRunner.java:268)
14-Oct-2019 23:43:46         at org.junit.runners.ParentRunner.run(ParentRunner.java:363)
14-Oct-2019 23:43:46         at org.apache.maven.surefire.junit4.JUnit4Provider.execute(JUnit4Provider.java:252)
14-Oct-2019 23:43:46         at org.apache.maven.surefire.junit4.JUnit4Provider.executeTestSet(JUnit4Provider.java:141)
14-Oct-2019 23:43:46         at org.apache.maven.surefire.junit4.JUnit4Provider.invoke(JUnit4Provider.java:112)
14-Oct-2019 23:43:46         at sun.reflect.NativeMethodAccessorImpl.invoke0(Native Method)
14-Oct-2019 23:43:46         at sun.reflect.NativeMethodAccessorImpl.invoke(NativeMethodAccessorImpl.java:57)
14-Oct-2019 23:43:46         at sun.reflect.DelegatingMethodAccessorImpl.invoke(DelegatingMethodAccessorImpl.java:43)
14-Oct-2019 23:43:46         at java.lang.reflect.Method.invoke(Method.java:606)
14-Oct-2019 23:43:46         at org.apache.maven.surefire.util.ReflectionUtils.invokeMethodWithArray(ReflectionUtils.java:189)
14-Oct-2019 23:43:46         at org.apache.maven.surefire.booter.ProviderFactory$ProviderProxy.invoke(ProviderFactory.java:165)
14-Oct-2019 23:43:46         at org.apache.maven.surefire.booter.ProviderFactory.invokeProvider(ProviderFactory.java:85)
14-Oct-2019 23:43:46         at org.apache.maven.surefire.booter.ForkedBooter.runSuitesInProcess(ForkedBooter.java:115)
14-Oct-2019 23:43:46         at org.apache.maven.surefire.booter.ForkedBooter.main(ForkedBooter.java:75)
14-Oct-2019 23:43:46 Caused by: org.springframework.dao.InvalidDataAccessApiUsageException: WRONGTYPE Operation against a key holding the wrong kind of value; nested exception is redis.clients.jedis.exceptions.JedisDataException: WRONGTYPE Operation against a key holding the wrong kind of value
14-Oct-2019 23:43:46         at org.springframework.data.redis.connection.jedis.JedisExceptionConverter.convert(JedisExceptionConverter.java:44)
14-Oct-2019 23:43:46         at org.springframework.data.redis.connection.jedis.JedisExceptionConverter.convert(JedisExceptionConverter.java:36)
14-Oct-2019 23:43:46         at org.springframework.data.redis.PassThroughExceptionTranslationStrategy.translate(PassThroughExceptionTranslationStrategy.java:37)
14-Oct-2019 23:43:46         at org.springframework.data.redis.FallbackExceptionTranslationStrategy.translate(FallbackExceptionTranslationStrategy.java:37)
14-Oct-2019 23:43:46         at org.springframework.data.redis.connection.jedis.JedisConnection.convertJedisAccessException(JedisConnection.java:196)
14-Oct-2019 23:43:46         at org.springframework.data.redis.connection.jedis.JedisConnection.convertPipelineResults(JedisConnection.java:344)
14-Oct-2019 23:43:46         ... 33 more
14-Oct-2019 23:43:46 Caused by: redis.clients.jedis.exceptions.JedisDataException: WRONGTYPE Operation against a key holding the wrong kind of value
14-Oct-2019 23:43:46         at redis.clients.jedis.Protocol.processError(Protocol.java:116)
14-Oct-2019 23:43:46         at redis.clients.jedis.Protocol.process(Protocol.java:141)
14-Oct-2019 23:43:46         at redis.clients.jedis.Protocol.read(Protocol.java:195)
14-Oct-2019 23:43:46         at redis.clients.jedis.Connection.readProtocolWithCheckingBroken(Connection.java:282)
14-Oct-2019 23:43:46         at redis.clients.jedis.Connection.getAll(Connection.java:252)
14-Oct-2019 23:43:46         at redis.clients.jedis.Connection.getAll(Connection.java:244)
14-Oct-2019 23:43:46         at redis.clients.jedis.Pipeline.sync(Pipeline.java:85)
14-Oct-2019 23:43:46         at org.springframework.data.redis.connection.jedis.JedisConnection.convertPipelineResults(JedisConnection.java:335)
14-Oct-2019 23:43:46         ... 33 more
14-Oct-2019 23:43:46
14-Oct-2019 23:43:46 testStoreAccessToken(org.springframework.security.oauth2.provider.token.store.redis.RedisTokenStoreTests)  Time elapsed: 0.001 sec  <<< ERROR!
14-Oct-2019 23:43:46 org.springframework.data.redis.connection.RedisPipelineException: Pipeline contained one or more invalid commands; nested exception is org.springframework.dao.InvalidDataAccessApiUsageException: WRONGTYPE Operation against a key holding the wrong kind of value; nested exception is redis.clients.jedis.exceptions.JedisDataException: WRONGTYPE Operation against a key holding the wrong kind of value
14-Oct-2019 23:43:46         at org.springframework.data.redis.connection.jedis.JedisConnection.convertPipelineResults(JedisConnection.java:357)
14-Oct-2019 23:43:46         at org.springframework.data.redis.connection.jedis.JedisConnection.closePipeline(JedisConnection.java:324)
14-Oct-2019 23:43:46         at org.springframework.security.oauth2.provider.token.store.redis.RedisTokenStore.storeAccessToken(RedisTokenStore.java:191)
14-Oct-2019 23:43:46         at org.springframework.security.oauth2.provider.token.store.TokenStoreBaseTests.testStoreAccessToken(TokenStoreBaseTests.java:50)
14-Oct-2019 23:43:46         at sun.reflect.NativeMethodAccessorImpl.invoke0(Native Method)
14-Oct-2019 23:43:46         at sun.reflect.NativeMethodAccessorImpl.invoke(NativeMethodAccessorImpl.java:57)
14-Oct-2019 23:43:46         at sun.reflect.DelegatingMethodAccessorImpl.invoke(DelegatingMethodAccessorImpl.java:43)
14-Oct-2019 23:43:46         at java.lang.reflect.Method.invoke(Method.java:606)
14-Oct-2019 23:43:46         at org.junit.runners.model.FrameworkMethod$1.runReflectiveCall(FrameworkMethod.java:50)
14-Oct-2019 23:43:46         at org.junit.internal.runners.model.ReflectiveCallable.run(ReflectiveCallable.java:12)
14-Oct-2019 23:43:46         at org.junit.runners.model.FrameworkMethod.invokeExplosively(FrameworkMethod.java:47)
14-Oct-2019 23:43:46         at org.junit.internal.runners.statements.InvokeMethod.evaluate(InvokeMethod.java:17)
14-Oct-2019 23:43:46         at org.junit.internal.runners.statements.RunBefores.evaluate(RunBefores.java:26)
14-Oct-2019 23:43:46         at org.junit.runners.ParentRunner.runLeaf(ParentRunner.java:325)
14-Oct-2019 23:43:46         at org.junit.runners.BlockJUnit4ClassRunner.runChild(BlockJUnit4ClassRunner.java:78)
14-Oct-2019 23:43:46         at org.junit.runners.BlockJUnit4ClassRunner.runChild(BlockJUnit4ClassRunner.java:57)
14-Oct-2019 23:43:46         at org.junit.runners.ParentRunner$3.run(ParentRunner.java:290)
14-Oct-2019 23:43:46         at org.junit.runners.ParentRunner$1.schedule(ParentRunner.java:71)
14-Oct-2019 23:43:46         at org.junit.runners.ParentRunner.runChildren(ParentRunner.java:288)
14-Oct-2019 23:43:46         at org.junit.runners.ParentRunner.access$000(ParentRunner.java:58)
14-Oct-2019 23:43:46         at org.junit.runners.ParentRunner$2.evaluate(ParentRunner.java:268)
14-Oct-2019 23:43:46         at org.junit.runners.ParentRunner.run(ParentRunner.java:363)
14-Oct-2019 23:43:46         at org.apache.maven.surefire.junit4.JUnit4Provider.execute(JUnit4Provider.java:252)
14-Oct-2019 23:43:46         at org.apache.maven.surefire.junit4.JUnit4Provider.executeTestSet(JUnit4Provider.java:141)
14-Oct-2019 23:43:46         at org.apache.maven.surefire.junit4.JUnit4Provider.invoke(JUnit4Provider.java:112)
14-Oct-2019 23:43:46         at sun.reflect.NativeMethodAccessorImpl.invoke0(Native Method)
14-Oct-2019 23:43:46         at sun.reflect.NativeMethodAccessorImpl.invoke(NativeMethodAccessorImpl.java:57)
14-Oct-2019 23:43:46         at sun.reflect.DelegatingMethodAccessorImpl.invoke(DelegatingMethodAccessorImpl.java:43)
14-Oct-2019 23:43:46         at java.lang.reflect.Method.invoke(Method.java:606)
14-Oct-2019 23:43:46         at org.apache.maven.surefire.util.ReflectionUtils.invokeMethodWithArray(ReflectionUtils.java:189)
14-Oct-2019 23:43:46         at org.apache.maven.surefire.booter.ProviderFactory$ProviderProxy.invoke(ProviderFactory.java:165)
14-Oct-2019 23:43:46         at org.apache.maven.surefire.booter.ProviderFactory.invokeProvider(ProviderFactory.java:85)
14-Oct-2019 23:43:46         at org.apache.maven.surefire.booter.ForkedBooter.runSuitesInProcess(ForkedBooter.java:115)
14-Oct-2019 23:43:46         at org.apache.maven.surefire.booter.ForkedBooter.main(ForkedBooter.java:75)
14-Oct-2019 23:43:46 Caused by: org.springframework.dao.InvalidDataAccessApiUsageException: WRONGTYPE Operation against a key holding the wrong kind of value; nested exception is redis.clients.jedis.exceptions.JedisDataException: WRONGTYPE Operation against a key holding the wrong kind of value
14-Oct-2019 23:43:46         at org.springframework.data.redis.connection.jedis.JedisExceptionConverter.convert(JedisExceptionConverter.java:44)
14-Oct-2019 23:43:46         at org.springframework.data.redis.connection.jedis.JedisExceptionConverter.convert(JedisExceptionConverter.java:36)
14-Oct-2019 23:43:46         at org.springframework.data.redis.PassThroughExceptionTranslationStrategy.translate(PassThroughExceptionTranslationStrategy.java:37)
14-Oct-2019 23:43:46         at org.springframework.data.redis.FallbackExceptionTranslationStrategy.translate(FallbackExceptionTranslationStrategy.java:37)
14-Oct-2019 23:43:46         at org.springframework.data.redis.connection.jedis.JedisConnection.convertJedisAccessException(JedisConnection.java:196)
14-Oct-2019 23:43:46         at org.springframework.data.redis.connection.jedis.JedisConnection.convertPipelineResults(JedisConnection.java:344)
14-Oct-2019 23:43:46         ... 33 more
14-Oct-2019 23:43:46 Caused by: redis.clients.jedis.exceptions.JedisDataException: WRONGTYPE Operation against a key holding the wrong kind of value
14-Oct-2019 23:43:46         at redis.clients.jedis.Protocol.processError(Protocol.java:116)
14-Oct-2019 23:43:46         at redis.clients.jedis.Protocol.process(Protocol.java:141)
14-Oct-2019 23:43:46         at redis.clients.jedis.Protocol.read(Protocol.java:195)
14-Oct-2019 23:43:46         at redis.clients.jedis.Connection.readProtocolWithCheckingBroken(Connection.java:282)
14-Oct-2019 23:43:46         at redis.clients.jedis.Connection.getAll(Connection.java:252)
14-Oct-2019 23:43:46         at redis.clients.jedis.Connection.getAll(Connection.java:244)
14-Oct-2019 23:43:46         at redis.clients.jedis.Pipeline.sync(Pipeline.java:85)
14-Oct-2019 23:43:46         at org.springframework.data.redis.connection.jedis.JedisConnection.convertPipelineResults(JedisConnection.java:335)
14-Oct-2019 23:43:46         ... 33 more
14-Oct-2019 23:43:46
14-Oct-2019 23:43:46 testRemovedTokenCannotBeFoundByUsername(org.springframework.security.oauth2.provider.token.store.redis.RedisTokenStoreTests)  Time elapsed: 0.002 sec  <<< ERROR!
14-Oct-2019 23:43:46 org.springframework.data.redis.connection.RedisPipelineException: Pipeline contained one or more invalid commands; nested exception is org.springframework.dao.InvalidDataAccessApiUsageException: WRONGTYPE Operation against a key holding the wrong kind of value; nested exception is redis.clients.jedis.exceptions.JedisDataException: WRONGTYPE Operation against a key holding the wrong kind of value
14-Oct-2019 23:43:46         at org.springframework.data.redis.connection.jedis.JedisConnection.convertPipelineResults(JedisConnection.java:357)
14-Oct-2019 23:43:46         at org.springframework.data.redis.connection.jedis.JedisConnection.closePipeline(JedisConnection.java:324)
14-Oct-2019 23:43:46         at org.springframework.security.oauth2.provider.token.store.redis.RedisTokenStore.storeAccessToken(RedisTokenStore.java:191)
14-Oct-2019 23:43:46         at org.springframework.security.oauth2.provider.token.store.TokenStoreBaseTests.testRemovedTokenCannotBeFoundByUsername(TokenStoreBaseTests.java:202)
14-Oct-2019 23:43:46         at sun.reflect.NativeMethodAccessorImpl.invoke0(Native Method)
14-Oct-2019 23:43:46         at sun.reflect.NativeMethodAccessorImpl.invoke(NativeMethodAccessorImpl.java:57)
14-Oct-2019 23:43:46         at sun.reflect.DelegatingMethodAccessorImpl.invoke(DelegatingMethodAccessorImpl.java:43)
14-Oct-2019 23:43:46         at java.lang.reflect.Method.invoke(Method.java:606)
14-Oct-2019 23:43:46         at org.junit.runners.model.FrameworkMethod$1.runReflectiveCall(FrameworkMethod.java:50)
14-Oct-2019 23:43:46         at org.junit.internal.runners.model.ReflectiveCallable.run(ReflectiveCallable.java:12)
14-Oct-2019 23:43:46         at org.junit.runners.model.FrameworkMethod.invokeExplosively(FrameworkMethod.java:47)
14-Oct-2019 23:43:46         at org.junit.internal.runners.statements.InvokeMethod.evaluate(InvokeMethod.java:17)
14-Oct-2019 23:43:46         at org.junit.internal.runners.statements.RunBefores.evaluate(RunBefores.java:26)
14-Oct-2019 23:43:46         at org.junit.runners.ParentRunner.runLeaf(ParentRunner.java:325)
14-Oct-2019 23:43:46         at org.junit.runners.BlockJUnit4ClassRunner.runChild(BlockJUnit4ClassRunner.java:78)
14-Oct-2019 23:43:46         at org.junit.runners.BlockJUnit4ClassRunner.runChild(BlockJUnit4ClassRunner.java:57)
14-Oct-2019 23:43:46         at org.junit.runners.ParentRunner$3.run(ParentRunner.java:290)
14-Oct-2019 23:43:46         at org.junit.runners.ParentRunner$1.schedule(ParentRunner.java:71)
14-Oct-2019 23:43:46         at org.junit.runners.ParentRunner.runChildren(ParentRunner.java:288)
14-Oct-2019 23:43:46         at org.junit.runners.ParentRunner.access$000(ParentRunner.java:58)
14-Oct-2019 23:43:46         at org.junit.runners.ParentRunner$2.evaluate(ParentRunner.java:268)
14-Oct-2019 23:43:46         at org.junit.runners.ParentRunner.run(ParentRunner.java:363)
14-Oct-2019 23:43:46         at org.apache.maven.surefire.junit4.JUnit4Provider.execute(JUnit4Provider.java:252)
14-Oct-2019 23:43:46         at org.apache.maven.surefire.junit4.JUnit4Provider.executeTestSet(JUnit4Provider.java:141)
14-Oct-2019 23:43:46         at org.apache.maven.surefire.junit4.JUnit4Provider.invoke(JUnit4Provider.java:112)
14-Oct-2019 23:43:46         at sun.reflect.NativeMethodAccessorImpl.invoke0(Native Method)
14-Oct-2019 23:43:46         at sun.reflect.NativeMethodAccessorImpl.invoke(NativeMethodAccessorImpl.java:57)
14-Oct-2019 23:43:46         at sun.reflect.DelegatingMethodAccessorImpl.invoke(DelegatingMethodAccessorImpl.java:43)
14-Oct-2019 23:43:46         at java.lang.reflect.Method.invoke(Method.java:606)
14-Oct-2019 23:43:46         at org.apache.maven.surefire.util.ReflectionUtils.invokeMethodWithArray(ReflectionUtils.java:189)
14-Oct-2019 23:43:46         at org.apache.maven.surefire.booter.ProviderFactory$ProviderProxy.invoke(ProviderFactory.java:165)
14-Oct-2019 23:43:46         at org.apache.maven.surefire.booter.ProviderFactory.invokeProvider(ProviderFactory.java:85)
14-Oct-2019 23:43:46         at org.apache.maven.surefire.booter.ForkedBooter.runSuitesInProcess(ForkedBooter.java:115)
14-Oct-2019 23:43:46         at org.apache.maven.surefire.booter.ForkedBooter.main(ForkedBooter.java:75)
14-Oct-2019 23:43:46 Caused by: org.springframework.dao.InvalidDataAccessApiUsageException: WRONGTYPE Operation against a key holding the wrong kind of value; nested exception is redis.clients.jedis.exceptions.JedisDataException: WRONGTYPE Operation against a key holding the wrong kind of value
14-Oct-2019 23:43:46         at org.springframework.data.redis.connection.jedis.JedisExceptionConverter.convert(JedisExceptionConverter.java:44)
14-Oct-2019 23:43:46         at org.springframework.data.redis.connection.jedis.JedisExceptionConverter.convert(JedisExceptionConverter.java:36)
14-Oct-2019 23:43:46         at org.springframework.data.redis.PassThroughExceptionTranslationStrategy.translate(PassThroughExceptionTranslationStrategy.java:37)
14-Oct-2019 23:43:46         at org.springframework.data.redis.FallbackExceptionTranslationStrategy.translate(FallbackExceptionTranslationStrategy.java:37)
14-Oct-2019 23:43:46         at org.springframework.data.redis.connection.jedis.JedisConnection.convertJedisAccessException(JedisConnection.java:196)
14-Oct-2019 23:43:46         at org.springframework.data.redis.connection.jedis.JedisConnection.convertPipelineResults(JedisConnection.java:344)
14-Oct-2019 23:43:46         ... 33 more
14-Oct-2019 23:43:46 Caused by: redis.clients.jedis.exceptions.JedisDataException: WRONGTYPE Operation against a key holding the wrong kind of value
14-Oct-2019 23:43:46         at redis.clients.jedis.Protocol.processError(Protocol.java:116)
14-Oct-2019 23:43:46         at redis.clients.jedis.Protocol.process(Protocol.java:141)
14-Oct-2019 23:43:46         at redis.clients.jedis.Protocol.read(Protocol.java:195)
14-Oct-2019 23:43:46         at redis.clients.jedis.Connection.readProtocolWithCheckingBroken(Connection.java:282)
14-Oct-2019 23:43:46         at redis.clients.jedis.Connection.getAll(Connection.java:252)
14-Oct-2019 23:43:46         at redis.clients.jedis.Connection.getAll(Connection.java:244)
14-Oct-2019 23:43:46         at redis.clients.jedis.Pipeline.sync(Pipeline.java:85)
14-Oct-2019 23:43:46         at org.springframework.data.redis.connection.jedis.JedisConnection.convertPipelineResults(JedisConnection.java:335)
14-Oct-2019 23:43:46         ... 33 more
14-Oct-2019 23:43:46
14-Oct-2019 23:43:46 testStoreAccessTokenTwice(org.springframework.security.oauth2.provider.token.store.redis.RedisTokenStoreTests)  Time elapsed: 0.001 sec  <<< ERROR!
14-Oct-2019 23:43:46 org.springframework.data.redis.connection.RedisPipelineException: Pipeline contained one or more invalid commands; nested exception is org.springframework.dao.InvalidDataAccessApiUsageException: WRONGTYPE Operation against a key holding the wrong kind of value; nested exception is redis.clients.jedis.exceptions.JedisDataException: WRONGTYPE Operation against a key holding the wrong kind of value
14-Oct-2019 23:43:46         at org.springframework.data.redis.connection.jedis.JedisConnection.convertPipelineResults(JedisConnection.java:357)
14-Oct-2019 23:43:46         at org.springframework.data.redis.connection.jedis.JedisConnection.closePipeline(JedisConnection.java:324)
14-Oct-2019 23:43:46         at org.springframework.security.oauth2.provider.token.store.redis.RedisTokenStore.storeAccessToken(RedisTokenStore.java:191)
14-Oct-2019 23:43:46         at org.springframework.security.oauth2.provider.token.store.TokenStoreBaseTests.testStoreAccessTokenTwice(TokenStoreBaseTests.java:64)
14-Oct-2019 23:43:46         at sun.reflect.NativeMethodAccessorImpl.invoke0(Native Method)
14-Oct-2019 23:43:46         at sun.reflect.NativeMethodAccessorImpl.invoke(NativeMethodAccessorImpl.java:57)
14-Oct-2019 23:43:46         at sun.reflect.DelegatingMethodAccessorImpl.invoke(DelegatingMethodAccessorImpl.java:43)
14-Oct-2019 23:43:46         at java.lang.reflect.Method.invoke(Method.java:606)
14-Oct-2019 23:43:46         at org.junit.runners.model.FrameworkMethod$1.runReflectiveCall(FrameworkMethod.java:50)
14-Oct-2019 23:43:46         at org.junit.internal.runners.model.ReflectiveCallable.run(ReflectiveCallable.java:12)
14-Oct-2019 23:43:46         at org.junit.runners.model.FrameworkMethod.invokeExplosively(FrameworkMethod.java:47)
14-Oct-2019 23:43:46         at org.junit.internal.runners.statements.InvokeMethod.evaluate(InvokeMethod.java:17)
14-Oct-2019 23:43:46         at org.junit.internal.runners.statements.RunBefores.evaluate(RunBefores.java:26)
14-Oct-2019 23:43:46         at org.junit.runners.ParentRunner.runLeaf(ParentRunner.java:325)
14-Oct-2019 23:43:46         at org.junit.runners.BlockJUnit4ClassRunner.runChild(BlockJUnit4ClassRunner.java:78)
14-Oct-2019 23:43:46         at org.junit.runners.BlockJUnit4ClassRunner.runChild(BlockJUnit4ClassRunner.java:57)
14-Oct-2019 23:43:46         at org.junit.runners.ParentRunner$3.run(ParentRunner.java:290)
14-Oct-2019 23:43:46         at org.junit.runners.ParentRunner$1.schedule(ParentRunner.java:71)
14-Oct-2019 23:43:46         at org.junit.runners.ParentRunner.runChildren(ParentRunner.java:288)
14-Oct-2019 23:43:46         at org.junit.runners.ParentRunner.access$000(ParentRunner.java:58)
14-Oct-2019 23:43:46         at org.junit.runners.ParentRunner$2.evaluate(ParentRunner.java:268)
14-Oct-2019 23:43:46         at org.junit.runners.ParentRunner.run(ParentRunner.java:363)
14-Oct-2019 23:43:46         at org.apache.maven.surefire.junit4.JUnit4Provider.execute(JUnit4Provider.java:252)
14-Oct-2019 23:43:46         at org.apache.maven.surefire.junit4.JUnit4Provider.executeTestSet(JUnit4Provider.java:141)
14-Oct-2019 23:43:46         at org.apache.maven.surefire.junit4.JUnit4Provider.invoke(JUnit4Provider.java:112)
14-Oct-2019 23:43:46         at sun.reflect.NativeMethodAccessorImpl.invoke0(Native Method)
14-Oct-2019 23:43:46         at sun.reflect.NativeMethodAccessorImpl.invoke(NativeMethodAccessorImpl.java:57)
14-Oct-2019 23:43:46         at sun.reflect.DelegatingMethodAccessorImpl.invoke(DelegatingMethodAccessorImpl.java:43)
14-Oct-2019 23:43:46         at java.lang.reflect.Method.invoke(Method.java:606)
14-Oct-2019 23:43:46         at org.apache.maven.surefire.util.ReflectionUtils.invokeMethodWithArray(ReflectionUtils.java:189)
14-Oct-2019 23:43:46         at org.apache.maven.surefire.booter.ProviderFactory$ProviderProxy.invoke(ProviderFactory.java:165)
14-Oct-2019 23:43:46         at org.apache.maven.surefire.booter.ProviderFactory.invokeProvider(ProviderFactory.java:85)
14-Oct-2019 23:43:46         at org.apache.maven.surefire.booter.ForkedBooter.runSuitesInProcess(ForkedBooter.java:115)
14-Oct-2019 23:43:46         at org.apache.maven.surefire.booter.ForkedBooter.main(ForkedBooter.java:75)
14-Oct-2019 23:43:46 Caused by: org.springframework.dao.InvalidDataAccessApiUsageException: WRONGTYPE Operation against a key holding the wrong kind of value; nested exception is redis.clients.jedis.exceptions.JedisDataException: WRONGTYPE Operation against a key holding the wrong kind of value
14-Oct-2019 23:43:46         at org.springframework.data.redis.connection.jedis.JedisExceptionConverter.convert(JedisExceptionConverter.java:44)
14-Oct-2019 23:43:46         at org.springframework.data.redis.connection.jedis.JedisExceptionConverter.convert(JedisExceptionConverter.java:36)
14-Oct-2019 23:43:46         at org.springframework.data.redis.PassThroughExceptionTranslationStrategy.translate(PassThroughExceptionTranslationStrategy.java:37)
14-Oct-2019 23:43:46         at org.springframework.data.redis.FallbackExceptionTranslationStrategy.translate(FallbackExceptionTranslationStrategy.java:37)
14-Oct-2019 23:43:46         at org.springframework.data.redis.connection.jedis.JedisConnection.convertJedisAccessException(JedisConnection.java:196)
14-Oct-2019 23:43:46         at org.springframework.data.redis.connection.jedis.JedisConnection.convertPipelineResults(JedisConnection.java:344)
14-Oct-2019 23:43:46         ... 33 more
14-Oct-2019 23:43:46 Caused by: redis.clients.jedis.exceptions.JedisDataException: WRONGTYPE Operation against a key holding the wrong kind of value
14-Oct-2019 23:43:46         at redis.clients.jedis.Protocol.processError(Protocol.java:116)
14-Oct-2019 23:43:46         at redis.clients.jedis.Protocol.process(Protocol.java:141)
14-Oct-2019 23:43:46         at redis.clients.jedis.Protocol.read(Protocol.java:195)
14-Oct-2019 23:43:46         at redis.clients.jedis.Connection.readProtocolWithCheckingBroken(Connection.java:282)
14-Oct-2019 23:43:46         at redis.clients.jedis.Connection.getAll(Connection.java:252)
14-Oct-2019 23:43:46         at redis.clients.jedis.Connection.getAll(Connection.java:244)
14-Oct-2019 23:43:46         at redis.clients.jedis.Pipeline.sync(Pipeline.java:85)
14-Oct-2019 23:43:46         at org.springframework.data.redis.connection.jedis.JedisConnection.convertPipelineResults(JedisConnection.java:335)
14-Oct-2019 23:43:46         ... 33 more
14-Oct-2019 23:43:46
14-Oct-2019 23:43:46 testRefreshTokenIsNotStoredDuringAccessToken(org.springframework.security.oauth2.provider.token.store.redis.RedisTokenStoreTests)  Time elapsed: 0.002 sec  <<< ERROR!
14-Oct-2019 23:43:46 org.springframework.data.redis.connection.RedisPipelineException: Pipeline contained one or more invalid commands; nested exception is org.springframework.dao.InvalidDataAccessApiUsageException: WRONGTYPE Operation against a key holding the wrong kind of value; nested exception is redis.clients.jedis.exceptions.JedisDataException: WRONGTYPE Operation against a key holding the wrong kind of value
14-Oct-2019 23:43:46         at org.springframework.data.redis.connection.jedis.JedisConnection.convertPipelineResults(JedisConnection.java:357)
14-Oct-2019 23:43:46         at org.springframework.data.redis.connection.jedis.JedisConnection.closePipeline(JedisConnection.java:324)
14-Oct-2019 23:43:46         at org.springframework.security.oauth2.provider.token.store.redis.RedisTokenStore.storeAccessToken(RedisTokenStore.java:191)
14-Oct-2019 23:43:46         at org.springframework.security.oauth2.provider.token.store.TokenStoreBaseTests.testRefreshTokenIsNotStoredDuringAccessToken(TokenStoreBaseTests.java:133)
14-Oct-2019 23:43:46         at sun.reflect.NativeMethodAccessorImpl.invoke0(Native Method)
14-Oct-2019 23:43:46         at sun.reflect.NativeMethodAccessorImpl.invoke(NativeMethodAccessorImpl.java:57)
14-Oct-2019 23:43:46         at sun.reflect.DelegatingMethodAccessorImpl.invoke(DelegatingMethodAccessorImpl.java:43)
14-Oct-2019 23:43:46         at java.lang.reflect.Method.invoke(Method.java:606)
14-Oct-2019 23:43:46         at org.junit.runners.model.FrameworkMethod$1.runReflectiveCall(FrameworkMethod.java:50)
14-Oct-2019 23:43:46         at org.junit.internal.runners.model.ReflectiveCallable.run(ReflectiveCallable.java:12)
14-Oct-2019 23:43:46         at org.junit.runners.model.FrameworkMethod.invokeExplosively(FrameworkMethod.java:47)
14-Oct-2019 23:43:46         at org.junit.internal.runners.statements.InvokeMethod.evaluate(InvokeMethod.java:17)
14-Oct-2019 23:43:46         at org.junit.internal.runners.statements.RunBefores.evaluate(RunBefores.java:26)
14-Oct-2019 23:43:46         at org.junit.runners.ParentRunner.runLeaf(ParentRunner.java:325)
14-Oct-2019 23:43:46         at org.junit.runners.BlockJUnit4ClassRunner.runChild(BlockJUnit4ClassRunner.java:78)
14-Oct-2019 23:43:46         at org.junit.runners.BlockJUnit4ClassRunner.runChild(BlockJUnit4ClassRunner.java:57)
14-Oct-2019 23:43:46         at org.junit.runners.ParentRunner$3.run(ParentRunner.java:290)
14-Oct-2019 23:43:46         at org.junit.runners.ParentRunner$1.schedule(ParentRunner.java:71)
14-Oct-2019 23:43:46         at org.junit.runners.ParentRunner.runChildren(ParentRunner.java:288)
14-Oct-2019 23:43:46         at org.junit.runners.ParentRunner.access$000(ParentRunner.java:58)
14-Oct-2019 23:43:46         at org.junit.runners.ParentRunner$2.evaluate(ParentRunner.java:268)
14-Oct-2019 23:43:46         at org.junit.runners.ParentRunner.run(ParentRunner.java:363)
14-Oct-2019 23:43:46         at org.apache.maven.surefire.junit4.JUnit4Provider.execute(JUnit4Provider.java:252)
14-Oct-2019 23:43:46         at org.apache.maven.surefire.junit4.JUnit4Provider.executeTestSet(JUnit4Provider.java:141)
14-Oct-2019 23:43:46         at org.apache.maven.surefire.junit4.JUnit4Provider.invoke(JUnit4Provider.java:112)
14-Oct-2019 23:43:46         at sun.reflect.NativeMethodAccessorImpl.invoke0(Native Method)
14-Oct-2019 23:43:46         at sun.reflect.NativeMethodAccessorImpl.invoke(NativeMethodAccessorImpl.java:57)
14-Oct-2019 23:43:46         at sun.reflect.DelegatingMethodAccessorImpl.invoke(DelegatingMethodAccessorImpl.java:43)
14-Oct-2019 23:43:46         at java.lang.reflect.Method.invoke(Method.java:606)
14-Oct-2019 23:43:46         at org.apache.maven.surefire.util.ReflectionUtils.invokeMethodWithArray(ReflectionUtils.java:189)
14-Oct-2019 23:43:46         at org.apache.maven.surefire.booter.ProviderFactory$ProviderProxy.invoke(ProviderFactory.java:165)
14-Oct-2019 23:43:46         at org.apache.maven.surefire.booter.ProviderFactory.invokeProvider(ProviderFactory.java:85)
14-Oct-2019 23:43:46         at org.apache.maven.surefire.booter.ForkedBooter.runSuitesInProcess(ForkedBooter.java:115)
14-Oct-2019 23:43:46         at org.apache.maven.surefire.booter.ForkedBooter.main(ForkedBooter.java:75)
14-Oct-2019 23:43:46 Caused by: org.springframework.dao.InvalidDataAccessApiUsageException: WRONGTYPE Operation against a key holding the wrong kind of value; nested exception is redis.clients.jedis.exceptions.JedisDataException: WRONGTYPE Operation against a key holding the wrong kind of value
14-Oct-2019 23:43:46         at org.springframework.data.redis.connection.jedis.JedisExceptionConverter.convert(JedisExceptionConverter.java:44)
14-Oct-2019 23:43:46         at org.springframework.data.redis.connection.jedis.JedisExceptionConverter.convert(JedisExceptionConverter.java:36)
14-Oct-2019 23:43:46         at org.springframework.data.redis.PassThroughExceptionTranslationStrategy.translate(PassThroughExceptionTranslationStrategy.java:37)
14-Oct-2019 23:43:46         at org.springframework.data.redis.FallbackExceptionTranslationStrategy.translate(FallbackExceptionTranslationStrategy.java:37)
14-Oct-2019 23:43:46         at org.springframework.data.redis.connection.jedis.JedisConnection.convertJedisAccessException(JedisConnection.java:196)
14-Oct-2019 23:43:46         at org.springframework.data.redis.connection.jedis.JedisConnection.convertPipelineResults(JedisConnection.java:344)
14-Oct-2019 23:43:46         ... 33 more
14-Oct-2019 23:43:46 Caused by: redis.clients.jedis.exceptions.JedisDataException: WRONGTYPE Operation against a key holding the wrong kind of value
14-Oct-2019 23:43:46         at redis.clients.jedis.Protocol.processError(Protocol.java:116)
14-Oct-2019 23:43:46         at redis.clients.jedis.Protocol.process(Protocol.java:141)
14-Oct-2019 23:43:46         at redis.clients.jedis.Protocol.read(Protocol.java:195)
14-Oct-2019 23:43:46         at redis.clients.jedis.Connection.readProtocolWithCheckingBroken(Connection.java:282)
14-Oct-2019 23:43:46         at redis.clients.jedis.Connection.getAll(Connection.java:252)
14-Oct-2019 23:43:46         at redis.clients.jedis.Connection.getAll(Connection.java:244)
14-Oct-2019 23:43:46         at redis.clients.jedis.Pipeline.sync(Pipeline.java:85)
14-Oct-2019 23:43:46         at org.springframework.data.redis.connection.jedis.JedisConnection.convertPipelineResults(JedisConnection.java:335)
14-Oct-2019 23:43:46         ... 33 more
14-Oct-2019 23:43:46
14-Oct-2019 23:43:46 testGetAccessTokenForDeletedUser(org.springframework.security.oauth2.provider.token.store.redis.RedisTokenStoreTests)  Time elapsed: 0.002 sec  <<< ERROR!
14-Oct-2019 23:43:46 org.springframework.data.redis.connection.RedisPipelineException: Pipeline contained one or more invalid commands; nested exception is org.springframework.dao.InvalidDataAccessApiUsageException: WRONGTYPE Operation against a key holding the wrong kind of value; nested exception is redis.clients.jedis.exceptions.JedisDataException: WRONGTYPE Operation against a key holding the wrong kind of value
14-Oct-2019 23:43:46         at org.springframework.data.redis.connection.jedis.JedisConnection.convertPipelineResults(JedisConnection.java:357)
14-Oct-2019 23:43:46         at org.springframework.data.redis.connection.jedis.JedisConnection.closePipeline(JedisConnection.java:324)
14-Oct-2019 23:43:46         at org.springframework.security.oauth2.provider.token.store.redis.RedisTokenStore.storeAccessToken(RedisTokenStore.java:191)
14-Oct-2019 23:43:46         at org.springframework.security.oauth2.provider.token.store.TokenStoreBaseTests.testGetAccessTokenForDeletedUser(TokenStoreBaseTests.java:170)
14-Oct-2019 23:43:46         at sun.reflect.NativeMethodAccessorImpl.invoke0(Native Method)
14-Oct-2019 23:43:46         at sun.reflect.NativeMethodAccessorImpl.invoke(NativeMethodAccessorImpl.java:57)
14-Oct-2019 23:43:46         at sun.reflect.DelegatingMethodAccessorImpl.invoke(DelegatingMethodAccessorImpl.java:43)
14-Oct-2019 23:43:46         at java.lang.reflect.Method.invoke(Method.java:606)
14-Oct-2019 23:43:46         at org.junit.runners.model.FrameworkMethod$1.runReflectiveCall(FrameworkMethod.java:50)
14-Oct-2019 23:43:46         at org.junit.internal.runners.model.ReflectiveCallable.run(ReflectiveCallable.java:12)
14-Oct-2019 23:43:46         at org.junit.runners.model.FrameworkMethod.invokeExplosively(FrameworkMethod.java:47)
14-Oct-2019 23:43:46         at org.junit.internal.runners.statements.InvokeMethod.evaluate(InvokeMethod.java:17)
14-Oct-2019 23:43:46         at org.junit.internal.runners.statements.RunBefores.evaluate(RunBefores.java:26)
14-Oct-2019 23:43:46         at org.junit.runners.ParentRunner.runLeaf(ParentRunner.java:325)
14-Oct-2019 23:43:46         at org.junit.runners.BlockJUnit4ClassRunner.runChild(BlockJUnit4ClassRunner.java:78)
14-Oct-2019 23:43:46         at org.junit.runners.BlockJUnit4ClassRunner.runChild(BlockJUnit4ClassRunner.java:57)
14-Oct-2019 23:43:46         at org.junit.runners.ParentRunner$3.run(ParentRunner.java:290)
14-Oct-2019 23:43:46         at org.junit.runners.ParentRunner$1.schedule(ParentRunner.java:71)
14-Oct-2019 23:43:46         at org.junit.runners.ParentRunner.runChildren(ParentRunner.java:288)
14-Oct-2019 23:43:46         at org.junit.runners.ParentRunner.access$000(ParentRunner.java:58)
14-Oct-2019 23:43:46         at org.junit.runners.ParentRunner$2.evaluate(ParentRunner.java:268)
14-Oct-2019 23:43:46         at org.junit.runners.ParentRunner.run(ParentRunner.java:363)
14-Oct-2019 23:43:46         at org.apache.maven.surefire.junit4.JUnit4Provider.execute(JUnit4Provider.java:252)
14-Oct-2019 23:43:46         at org.apache.maven.surefire.junit4.JUnit4Provider.executeTestSet(JUnit4Provider.java:141)
14-Oct-2019 23:43:46         at org.apache.maven.surefire.junit4.JUnit4Provider.invoke(JUnit4Provider.java:112)
14-Oct-2019 23:43:46         at sun.reflect.NativeMethodAccessorImpl.invoke0(Native Method)
14-Oct-2019 23:43:46         at sun.reflect.NativeMethodAccessorImpl.invoke(NativeMethodAccessorImpl.java:57)
14-Oct-2019 23:43:46         at sun.reflect.DelegatingMethodAccessorImpl.invoke(DelegatingMethodAccessorImpl.java:43)
14-Oct-2019 23:43:46         at java.lang.reflect.Method.invoke(Method.java:606)
14-Oct-2019 23:43:46         at org.apache.maven.surefire.util.ReflectionUtils.invokeMethodWithArray(ReflectionUtils.java:189)
14-Oct-2019 23:43:46         at org.apache.maven.surefire.booter.ProviderFactory$ProviderProxy.invoke(ProviderFactory.java:165)
14-Oct-2019 23:43:46         at org.apache.maven.surefire.booter.ProviderFactory.invokeProvider(ProviderFactory.java:85)
14-Oct-2019 23:43:46         at org.apache.maven.surefire.booter.ForkedBooter.runSuitesInProcess(ForkedBooter.java:115)
14-Oct-2019 23:43:46         at org.apache.maven.surefire.booter.ForkedBooter.main(ForkedBooter.java:75)
14-Oct-2019 23:43:46 Caused by: org.springframework.dao.InvalidDataAccessApiUsageException: WRONGTYPE Operation against a key holding the wrong kind of value; nested exception is redis.clients.jedis.exceptions.JedisDataException: WRONGTYPE Operation against a key holding the wrong kind of value
14-Oct-2019 23:43:46         at org.springframework.data.redis.connection.jedis.JedisExceptionConverter.convert(JedisExceptionConverter.java:44)
14-Oct-2019 23:43:46         at org.springframework.data.redis.connection.jedis.JedisExceptionConverter.convert(JedisExceptionConverter.java:36)
14-Oct-2019 23:43:46         at org.springframework.data.redis.PassThroughExceptionTranslationStrategy.translate(PassThroughExceptionTranslationStrategy.java:37)
14-Oct-2019 23:43:46         at org.springframework.data.redis.FallbackExceptionTranslationStrategy.translate(FallbackExceptionTranslationStrategy.java:37)
14-Oct-2019 23:43:46         at org.springframework.data.redis.connection.jedis.JedisConnection.convertJedisAccessException(JedisConnection.java:196)
14-Oct-2019 23:43:46         at org.springframework.data.redis.connection.jedis.JedisConnection.convertPipelineResults(JedisConnection.java:344)
14-Oct-2019 23:43:46         ... 33 more
14-Oct-2019 23:43:46 Caused by: redis.clients.jedis.exceptions.JedisDataException: WRONGTYPE Operation against a key holding the wrong kind of value
14-Oct-2019 23:43:46         at redis.clients.jedis.Protocol.processError(Protocol.java:116)
14-Oct-2019 23:43:46         at redis.clients.jedis.Protocol.process(Protocol.java:141)
14-Oct-2019 23:43:46         at redis.clients.jedis.Protocol.read(Protocol.java:195)
14-Oct-2019 23:43:46         at redis.clients.jedis.Connection.readProtocolWithCheckingBroken(Connection.java:282)
14-Oct-2019 23:43:46         at redis.clients.jedis.Connection.getAll(Connection.java:252)
14-Oct-2019 23:43:46         at redis.clients.jedis.Connection.getAll(Connection.java:244)
14-Oct-2019 23:43:46         at redis.clients.jedis.Pipeline.sync(Pipeline.java:85)
14-Oct-2019 23:43:46         at org.springframework.data.redis.connection.jedis.JedisConnection.convertPipelineResults(JedisConnection.java:335)
14-Oct-2019 23:43:46         ... 33 more
14-Oct-2019 23:43:46
14-Oct-2019 23:43:46 Running org.springframework.security.oauth2.provider.token.store.JdbcTokenStoreTests
14-Oct-2019 23:43:46 Tests run: 14, Failures: 0, Errors: 0, Skipped: 0, Time elapsed: 0.157 sec
14-Oct-2019 23:43:46 Running org.springframework.security.oauth2.provider.token.DefaultTokenServicesAuthoritiesChangeTests
14-Oct-2019 23:43:46 Tests run: 1, Failures: 0, Errors: 0, Skipped: 0, Time elapsed: 0 sec
14-Oct-2019 23:43:46 Running org.springframework.security.oauth2.provider.token.DefaultUserAuthenticationConverterTests
14-Oct-2019 23:43:46 Tests run: 3, Failures: 0, Errors: 0, Skipped: 0, Time elapsed: 0.001 sec
14-Oct-2019 23:43:46 Running org.springframework.security.oauth2.provider.token.TokenServicesWithTokenEnhancerTests
14-Oct-2019 23:43:46 [WARN] JwtAccessTokenConverter - Unable to create an RSA verifier from verifierKey (ignoreable if using MAC)
14-Oct-2019 23:43:46 [WARN] JwtAccessTokenConverter - Unable to create an RSA verifier from verifierKey (ignoreable if using MAC)
14-Oct-2019 23:43:46 [WARN] JwtAccessTokenConverter - Unable to create an RSA verifier from verifierKey (ignoreable if using MAC)
14-Oct-2019 23:43:46 [WARN] JwtAccessTokenConverter - Unable to create an RSA verifier from verifierKey (ignoreable if using MAC)
14-Oct-2019 23:43:46 [WARN] JwtAccessTokenConverter - Unable to create an RSA verifier from verifierKey (ignoreable if using MAC)
14-Oct-2019 23:43:46 Tests run: 5, Failures: 0, Errors: 0, Skipped: 0, Time elapsed: 0.018 sec
14-Oct-2019 23:43:46 Running org.springframework.security.oauth2.provider.token.DefaultTokenServicesWithJwtTests
14-Oct-2019 23:43:46 [WARN] JwtAccessTokenConverter - Unable to create an RSA verifier from verifierKey (ignoreable if using MAC)
14-Oct-2019 23:43:46 [WARN] JwtAccessTokenConverter - Unable to create an RSA verifier from verifierKey (ignoreable if using MAC)
14-Oct-2019 23:43:46 [WARN] JwtAccessTokenConverter - Unable to create an RSA verifier from verifierKey (ignoreable if using MAC)
14-Oct-2019 23:43:46 [WARN] JwtAccessTokenConverter - Unable to create an RSA verifier from verifierKey (ignoreable if using MAC)
14-Oct-2019 23:43:46 [WARN] JwtAccessTokenConverter - Unable to create an RSA verifier from verifierKey (ignoreable if using MAC)
14-Oct-2019 23:43:46 [WARN] JwtAccessTokenConverter - Unable to create an RSA verifier from verifierKey (ignoreable if using MAC)
14-Oct-2019 23:43:46 [WARN] JwtAccessTokenConverter - Unable to create an RSA verifier from verifierKey (ignoreable if using MAC)
14-Oct-2019 23:43:46 [WARN] JwtAccessTokenConverter - Unable to create an RSA verifier from verifierKey (ignoreable if using MAC)
14-Oct-2019 23:43:46 [WARN] JwtAccessTokenConverter - Unable to create an RSA verifier from verifierKey (ignoreable if using MAC)
14-Oct-2019 23:43:46 [WARN] JwtAccessTokenConverter - Unable to create an RSA verifier from verifierKey (ignoreable if using MAC)
14-Oct-2019 23:43:46 [WARN] JwtAccessTokenConverter - Unable to create an RSA verifier from verifierKey (ignoreable if using MAC)
14-Oct-2019 23:43:46 [WARN] JwtAccessTokenConverter - Unable to create an RSA verifier from verifierKey (ignoreable if using MAC)
14-Oct-2019 23:43:46 [WARN] JwtAccessTokenConverter - Unable to create an RSA verifier from verifierKey (ignoreable if using MAC)
14-Oct-2019 23:43:46 [WARN] JwtAccessTokenConverter - Unable to create an RSA verifier from verifierKey (ignoreable if using MAC)
14-Oct-2019 23:43:46 [WARN] JwtAccessTokenConverter - Unable to create an RSA verifier from verifierKey (ignoreable if using MAC)
14-Oct-2019 23:43:46 Tests run: 15, Failures: 0, Errors: 0, Skipped: 0, Time elapsed: 0.043 sec
14-Oct-2019 23:43:46 Running org.springframework.security.oauth2.provider.token.DefaultTokenServicesTests
14-Oct-2019 23:43:46 Tests run: 1, Failures: 0, Errors: 0, Skipped: 0, Time elapsed: 0.004 sec
14-Oct-2019 23:43:46 Running org.springframework.security.oauth2.provider.token.DefaultTokenServicesWithInMemoryTests
14-Oct-2019 23:43:46 Tests run: 25, Failures: 0, Errors: 0, Skipped: 0, Time elapsed: 0.018 sec
14-Oct-2019 23:43:46 Running org.springframework.security.oauth2.provider.token.DefaultAccessTokenConverterTests
14-Oct-2019 23:43:46 Tests run: 9, Failures: 0, Errors: 0, Skipped: 0, Time elapsed: 0.002 sec
14-Oct-2019 23:43:46 Running org.springframework.security.oauth2.provider.implicit.InMemoryImplicitGrantServiceTests
14-Oct-2019 23:43:46 Tests run: 2, Failures: 0, Errors: 0, Skipped: 0, Time elapsed: 0 sec
14-Oct-2019 23:43:46 Running org.springframework.security.oauth2.provider.error.OAuth2AuthenticationEntryPointTests
14-Oct-2019 23:43:46 [WARN] DefaultHandlerExceptionResolver - Resolved exception caused by handler execution: org.springframework.web.HttpMediaTypeNotAcceptableException: Could not find acceptable representation
14-Oct-2019 23:43:46 Tests run: 7, Failures: 0, Errors: 0, Skipped: 0, Time elapsed: 0.033 sec
14-Oct-2019 23:43:46 Running org.springframework.security.oauth2.provider.error.OAuth2AccessDeniedHandlerTests
14-Oct-2019 23:43:46 Tests run: 1, Failures: 0, Errors: 0, Skipped: 0, Time elapsed: 0.004 sec
14-Oct-2019 23:43:46 Running org.springframework.security.oauth2.provider.authentication.OAuth2AuthenticationProcessingFilterTests
14-Oct-2019 23:43:47 Tests run: 8, Failures: 0, Errors: 0, Skipped: 0, Time elapsed: 0.04 sec
14-Oct-2019 23:43:47 Running org.springframework.security.oauth2.provider.authentication.OAuth2AuthenticationDetailsTests
14-Oct-2019 23:43:47 Tests run: 1, Failures: 0, Errors: 0, Skipped: 0, Time elapsed: 0.001 sec
14-Oct-2019 23:43:47 Running org.springframework.security.oauth2.provider.authentication.OAuth2AuthenticationManagerTests
14-Oct-2019 23:43:47 Tests run: 3, Failures: 0, Errors: 0, Skipped: 0, Time elapsed: 0.001 sec
14-Oct-2019 23:43:47 Running org.springframework.security.oauth2.provider.endpoint.FrameworkEndpointHandlerMappingTests
14-Oct-2019 23:43:47 Tests run: 4, Failures: 0, Errors: 0, Skipped: 0, Time elapsed: 0.001 sec
14-Oct-2019 23:43:47 Running org.springframework.security.oauth2.provider.endpoint.WhitelabelApprovalEndpointTests
14-Oct-2019 23:43:47 Tests run: 6, Failures: 0, Errors: 0, Skipped: 0, Time elapsed: 0.003 sec
14-Oct-2019 23:43:47 Running org.springframework.security.oauth2.provider.endpoint.ExactMatchRedirectResolverTests
14-Oct-2019 23:43:47 Tests run: 3, Failures: 0, Errors: 0, Skipped: 0, Time elapsed: 0 sec
14-Oct-2019 23:43:47 Running org.springframework.security.oauth2.provider.endpoint.AuthorizationEndpointTests
14-Oct-2019 23:43:47 Tests run: 34, Failures: 0, Errors: 0, Skipped: 0, Time elapsed: 0.022 sec
14-Oct-2019 23:43:47 Running org.springframework.security.oauth2.provider.endpoint.TokenEndpointTests
14-Oct-2019 23:43:47 Tests run: 5, Failures: 0, Errors: 0, Skipped: 0, Time elapsed: 0.008 sec
14-Oct-2019 23:43:47 Running org.springframework.security.oauth2.provider.endpoint.DefaultRedirectResolverTests
14-Oct-2019 23:43:47 Tests run: 30, Failures: 0, Errors: 0, Skipped: 0, Time elapsed: 0.008 sec
14-Oct-2019 23:43:47 Running org.springframework.security.oauth2.provider.endpoint.WhitelabelErrorEndpointTests
14-Oct-2019 23:43:47 Tests run: 3, Failures: 0, Errors: 0, Skipped: 0, Time elapsed: 0.001 sec
14-Oct-2019 23:43:47 Running org.springframework.security.oauth2.provider.endpoint.TokenEndpointAuthenticationFilterTests
14-Oct-2019 23:43:47 Tests run: 3, Failures: 0, Errors: 0, Skipped: 0, Time elapsed: 0.014 sec
14-Oct-2019 23:43:47 Running org.springframework.security.oauth2.provider.AuthorizationRequestTests
14-Oct-2019 23:43:47 Tests run: 9, Failures: 0, Errors: 0, Skipped: 0, Time elapsed: 0.004 sec
14-Oct-2019 23:43:47 Running org.springframework.security.oauth2.provider.OAuth2AuthenticationTests
14-Oct-2019 23:43:47 {"authorities":[{"authority":"ROLE_USER"}],"details":null,"authenticated":false,"userAuthentication":{"authorities":[{"authority":"ROLE_USER"}],"details":null,"authenticated":true,"principal":"foo","credentials":"bar","name":"foo"},"clientOnly":false,"oauth2Request":{"clientId":"id","scope":["read"],"requestParameters":{},"resourceIds":[],"authorities":[],"approved":false,"refresh":false,"redirectUri":null,"responseTypes":[],"extensions":{},"grantType":null,"refreshTokenRequest":null},"credentials":"","principal":"foo","name":"foo"}
14-Oct-2019 23:43:47 Tests run: 8, Failures: 0, Errors: 0, Skipped: 0, Time elapsed: 0.015 sec
14-Oct-2019 23:43:47 Running org.springframework.security.oauth2.provider.expression.OAuth2MethodSecurityExpressionHandlerTests
14-Oct-2019 23:43:47 Tests run: 9, Failures: 0, Errors: 0, Skipped: 0, Time elapsed: 0.008 sec
14-Oct-2019 23:43:47 Running org.springframework.security.oauth2.provider.expression.OAuth2SecurityExpressionMethodsTests
14-Oct-2019 23:43:47 Tests run: 10, Failures: 0, Errors: 0, Skipped: 0, Time elapsed: 0.002 sec
14-Oct-2019 23:43:47 Running org.springframework.security.oauth2.provider.expression.OAuth2WebSecurityExpressionHandlerTests
14-Oct-2019 23:43:47 Tests run: 6, Failures: 0, Errors: 0, Skipped: 0, Time elapsed: 0.002 sec
14-Oct-2019 23:43:47 Running org.springframework.security.oauth2.provider.expression.OAuth2ExpressionParserTests
14-Oct-2019 23:43:47 Tests run: 3, Failures: 0, Errors: 0, Skipped: 0, Time elapsed: 0.006 sec
14-Oct-2019 23:43:47 Running org.springframework.security.oauth2.provider.OAuth2RequestTests
14-Oct-2019 23:43:47 Tests run: 4, Failures: 0, Errors: 0, Skipped: 0, Time elapsed: 0.001 sec
14-Oct-2019 23:43:47 Running org.springframework.security.oauth2.provider.code.AuthorizationCodeTokenGranterTests
14-Oct-2019 23:43:47 Tests run: 5, Failures: 0, Errors: 0, Skipped: 0, Time elapsed: 0.007 sec
14-Oct-2019 23:43:47 Running org.springframework.security.oauth2.provider.code.InMemoryAuthorizationCodeServicesTests
14-Oct-2019 23:43:47 Tests run: 3, Failures: 0, Errors: 0, Skipped: 0, Time elapsed: 0.001 sec
14-Oct-2019 23:43:47 Running org.springframework.security.oauth2.provider.code.JdbcAuthorizationCodeServicesTests
14-Oct-2019 23:43:47 Tests run: 3, Failures: 0, Errors: 0, Skipped: 0, Time elapsed: 0.029 sec
14-Oct-2019 23:43:47 Running org.springframework.security.oauth2.provider.code.SubdomainRedirectResolverTests
14-Oct-2019 23:43:47 Tests run: 2, Failures: 0, Errors: 0, Skipped: 0, Time elapsed: 0 sec
14-Oct-2019 23:43:47 Running org.springframework.security.oauth2.common.OAuth2AccessTokenJackson1DeserializerTests
14-Oct-2019 23:43:48 Tests run: 8, Failures: 0, Errors: 0, Skipped: 0, Time elapsed: 1.24 sec
14-Oct-2019 23:43:48 Running org.springframework.security.oauth2.common.OAuth2AccessTokenJackson2DeserializerTests
14-Oct-2019 23:43:49 Tests run: 9, Failures: 0, Errors: 0, Skipped: 0, Time elapsed: 0.978 sec
14-Oct-2019 23:43:49 Running org.springframework.security.oauth2.common.exception.OAuth2ExceptionDeserializerTests
14-Oct-2019 23:43:49 Tests run: 13, Failures: 0, Errors: 0, Skipped: 0, Time elapsed: 0.008 sec
14-Oct-2019 23:43:49 Running org.springframework.security.oauth2.common.exception.OAuth2ExceptionSerializerTests
14-Oct-2019 23:43:49 Tests run: 11, Failures: 0, Errors: 0, Skipped: 0, Time elapsed: 0.009 sec
14-Oct-2019 23:43:49 Running org.springframework.security.oauth2.common.exception.OAuth2ExceptionJackson2DeserializerTests
14-Oct-2019 23:43:49 Tests run: 14, Failures: 0, Errors: 0, Skipped: 0, Time elapsed: 0.005 sec
14-Oct-2019 23:43:49 Running org.springframework.security.oauth2.common.OAuth2AccessTokenJackson2SerializerTests
14-Oct-2019 23:43:50 Tests run: 10, Failures: 0, Errors: 0, Skipped: 0, Time elapsed: 0.851 sec
14-Oct-2019 23:43:50 Running org.springframework.security.oauth2.common.OAuth2AccessTokenJackson1SerializerTests
14-Oct-2019 23:56:01 Tests run: 10, Failures: 0, Errors: 10, Skipped: 0, Time elapsed: 731.619 sec <<< FAILURE!
14-Oct-2019 23:56:01 writeValueAsStringWithEmptyScope(org.springframework.security.oauth2.common.OAuth2AccessTokenJackson1SerializerTests)  Time elapsed: 1.742 sec  <<< ERROR!
14-Oct-2019 23:56:01 java.lang.OutOfMemoryError: PermGen space
14-Oct-2019 23:56:01         at java.lang.ClassLoader.defineClass1(Native Method)
14-Oct-2019 23:56:01         at java.lang.ClassLoader.defineClass(ClassLoader.java:808)
14-Oct-2019 23:56:01         at org.powermock.core.classloader.MockClassLoader.loadUnmockedClass(MockClassLoader.java:262)
14-Oct-2019 23:56:01         at org.powermock.core.classloader.MockClassLoader.loadModifiedClass(MockClassLoader.java:206)
14-Oct-2019 23:56:01         at org.powermock.core.classloader.DeferSupportingClassLoader.loadClass1(DeferSupportingClassLoader.java:89)
14-Oct-2019 23:56:01         at org.powermock.core.classloader.DeferSupportingClassLoader.loadClass(DeferSupportingClassLoader.java:79)
14-Oct-2019 23:56:01         at java.lang.ClassLoader.loadClass(ClassLoader.java:363)
14-Oct-2019 23:56:01         at java.lang.ClassLoader.defineClass1(Native Method)
14-Oct-2019 23:56:01         at java.lang.ClassLoader.defineClass(ClassLoader.java:808)
14-Oct-2019 23:56:01         at org.powermock.core.classloader.MockClassLoader.loadUnmockedClass(MockClassLoader.java:262)
14-Oct-2019 23:56:01         at org.powermock.core.classloader.MockClassLoader.loadModifiedClass(MockClassLoader.java:206)
14-Oct-2019 23:56:01         at org.powermock.core.classloader.DeferSupportingClassLoader.loadClass1(DeferSupportingClassLoader.java:89)
14-Oct-2019 23:56:01         at org.powermock.core.classloader.DeferSupportingClassLoader.loadClass(DeferSupportingClassLoader.java:79)
14-Oct-2019 23:56:01         at java.lang.ClassLoader.loadClass(ClassLoader.java:363)
14-Oct-2019 23:56:01         at java.lang.Class.forName0(Native Method)
14-Oct-2019 23:56:01         at java.lang.Class.forName(Class.java:278)
14-Oct-2019 23:56:01         at sun.reflect.generics.factory.CoreReflectionFactory.makeNamedType(CoreReflectionFactory.java:114)
14-Oct-2019 23:56:01         at sun.reflect.generics.visitor.Reifier.visitClassTypeSignature(Reifier.java:125)
14-Oct-2019 23:56:01         at sun.reflect.generics.tree.ClassTypeSignature.accept(ClassTypeSignature.java:49)
14-Oct-2019 23:56:01         at sun.reflect.annotation.AnnotationParser.parseSig(AnnotationParser.java:432)
14-Oct-2019 23:56:01         at sun.reflect.annotation.AnnotationParser.parseClassValue(AnnotationParser.java:413)
14-Oct-2019 23:56:01         at sun.reflect.annotation.AnnotationParser.parseMemberValue(AnnotationParser.java:342)
14-Oct-2019 23:56:01         at sun.reflect.annotation.AnnotationParser.parseAnnotation2(AnnotationParser.java:283)
14-Oct-2019 23:56:01         at sun.reflect.annotation.AnnotationParser.parseAnnotations2(AnnotationParser.java:117)
14-Oct-2019 23:56:01         at sun.reflect.annotation.AnnotationParser.parseAnnotations(AnnotationParser.java:70)
14-Oct-2019 23:56:01         at java.lang.Class.initAnnotationsIfNecessary(Class.java:3281)
14-Oct-2019 23:56:01         at java.lang.Class.getDeclaredAnnotations(Class.java:3258)
14-Oct-2019 23:56:01         at org.codehaus.jackson.map.introspect.AnnotatedClass.resolveClassAnnotations(AnnotatedClass.java:286)
14-Oct-2019 23:56:01         at org.codehaus.jackson.map.introspect.AnnotatedClass.construct(AnnotatedClass.java:134)
14-Oct-2019 23:56:01         at org.codehaus.jackson.map.introspect.BasicClassIntrospector.classWithCreators(BasicClassIntrospector.java:184)
14-Oct-2019 23:56:01         at org.codehaus.jackson.map.introspect.BasicClassIntrospector.collectProperties(BasicClassIntrospector.java:157)
14-Oct-2019 23:56:01         at org.codehaus.jackson.map.introspect.BasicClassIntrospector.forSerialization(BasicClassIntrospector.java:96)
14-Oct-2019 23:56:01
14-Oct-2019 23:56:01 writeValueAsStringWithSingleScopes(org.springframework.security.oauth2.common.OAuth2AccessTokenJackson1SerializerTests)  Time elapsed: 0.815 sec  <<< ERROR!
14-Oct-2019 23:56:01 java.lang.OutOfMemoryError: PermGen space
14-Oct-2019 23:56:01         at java.lang.ClassLoader.defineClass1(Native Method)
14-Oct-2019 23:56:01         at java.lang.ClassLoader.defineClass(ClassLoader.java:808)
14-Oct-2019 23:56:01         at org.powermock.core.classloader.MockClassLoader.loadUnmockedClass(MockClassLoader.java:262)
14-Oct-2019 23:56:01         at org.powermock.core.classloader.MockClassLoader.loadModifiedClass(MockClassLoader.java:206)
14-Oct-2019 23:56:01         at org.powermock.core.classloader.DeferSupportingClassLoader.loadClass1(DeferSupportingClassLoader.java:89)
14-Oct-2019 23:56:01         at org.powermock.core.classloader.DeferSupportingClassLoader.loadClass(DeferSupportingClassLoader.java:79)
14-Oct-2019 23:56:01         at java.lang.ClassLoader.loadClass(ClassLoader.java:363)
14-Oct-2019 23:56:01         at org.mockito.exceptions.base.MockitoException.filterStackTrace(MockitoException.java:41)
14-Oct-2019 23:56:01         at org.mockito.exceptions.base.MockitoException.<init>(MockitoException.java:30)
14-Oct-2019 23:56:01         at org.powermock.api.mockito.repackaged.ClassImposterizer.createProxyClass(ClassImposterizer.java:137)
14-Oct-2019 23:56:01         at org.powermock.api.mockito.repackaged.ClassImposterizer.imposterise(ClassImposterizer.java:63)
14-Oct-2019 23:56:01         at org.powermock.api.mockito.internal.mockcreation.DefaultMockCreator.createMethodInvocationControl(DefaultMockCreator.java:121)
14-Oct-2019 23:56:01         at org.powermock.api.mockito.internal.mockcreation.DefaultMockCreator.createMock(DefaultMockCreator.java:69)
14-Oct-2019 23:56:01         at org.powermock.api.mockito.internal.mockcreation.DefaultMockCreator.mock(DefaultMockCreator.java:46)
14-Oct-2019 23:56:01         at org.powermock.api.mockito.PowerMockito.mockStatic(PowerMockito.java:71)
14-Oct-2019 23:56:01         at org.springframework.security.oauth2.common.BaseOAuth2AccessTokenJacksonTest.setUp(BaseOAuth2AccessTokenJacksonTest.java:74)
14-Oct-2019 23:56:01         at org.springframework.security.oauth2.common.OAuth2AccessTokenJackson1SerializerTests.setUp(OAuth2AccessTokenJackson1SerializerTests.java:19)
14-Oct-2019 23:56:01         at sun.reflect.NativeMethodAccessorImpl.invoke0(Native Method)
14-Oct-2019 23:56:01         at sun.reflect.NativeMethodAccessorImpl.invoke(NativeMethodAccessorImpl.java:57)
14-Oct-2019 23:56:01         at sun.reflect.DelegatingMethodAccessorImpl.invoke(DelegatingMethodAccessorImpl.java:43)
14-Oct-2019 23:56:01         at java.lang.reflect.Method.invoke(Method.java:606)
14-Oct-2019 23:56:01         at org.junit.internal.runners.MethodRoadie.runBefores(MethodRoadie.java:133)
14-Oct-2019 23:56:01         at org.junit.internal.runners.MethodRoadie.runBeforesThenTestThenAfters(MethodRoadie.java:96)
14-Oct-2019 23:56:01         at org.powermock.modules.junit4.internal.impl.PowerMockJUnit44RunnerDelegateImpl$PowerMockJUnit44MethodRunner.executeTest(PowerMockJUnit44RunnerDelegateImpl.java:310)
14-Oct-2019 23:56:01         at org.powermock.modules.junit4.internal.impl.PowerMockJUnit47RunnerDelegateImpl$PowerMockJUnit47MethodRunner.executeTestInSuper(PowerMockJUnit47RunnerDelegateImpl.java:131)
14-Oct-2019 23:56:01         at org.powermock.modules.junit4.internal.impl.PowerMockJUnit47RunnerDelegateImpl$PowerMockJUnit47MethodRunner.access$100(PowerMockJUnit47RunnerDelegateImpl.java:59)
14-Oct-2019 23:56:01         at org.powermock.modules.junit4.internal.impl.PowerMockJUnit47RunnerDelegateImpl$PowerMockJUnit47MethodRunner$TestExecutorStatement.evaluate(PowerMockJUnit47RunnerDelegateImpl.java:147)
14-Oct-2019 23:56:01         at org.junit.rules.ExpectedException$ExpectedExceptionStatement.evaluate(ExpectedException.java:239)
14-Oct-2019 23:56:01         at org.powermock.modules.junit4.internal.impl.PowerMockJUnit47RunnerDelegateImpl$PowerMockJUnit47MethodRunner.evaluateStatement(PowerMockJUnit47RunnerDelegateImpl.java:107)
14-Oct-2019 23:56:01         at org.powermock.modules.junit4.internal.impl.PowerMockJUnit47RunnerDelegateImpl$PowerMockJUnit47MethodRunner.executeTest(PowerMockJUnit47RunnerDelegateImpl.java:82)
14-Oct-2019 23:56:01         at org.powermock.modules.junit4.internal.impl.PowerMockJUnit44RunnerDelegateImpl$PowerMockJUnit44MethodRunner.runBeforesThenTestThenAfters(PowerMockJUnit44RunnerDelegateImpl.java:298)
14-Oct-2019 23:56:01         at org.junit.internal.runners.MethodRoadie.runTest(MethodRoadie.java:87)
14-Oct-2019 23:56:01
14-Oct-2019 23:56:01 writeValueAsStringWithNullScope(org.springframework.security.oauth2.common.OAuth2AccessTokenJackson1SerializerTests)  Time elapsed: 34.655 sec  <<< ERROR!
14-Oct-2019 23:56:01 java.lang.OutOfMemoryError: PermGen space
14-Oct-2019 23:56:01
14-Oct-2019 23:56:01 writeValueAsStringWithEmptyStringScope(org.springframework.security.oauth2.common.OAuth2AccessTokenJackson1SerializerTests)  Time elapsed: 0.212 sec  <<< ERROR!
14-Oct-2019 23:56:01 java.lang.OutOfMemoryError: PermGen space
14-Oct-2019 23:56:01
14-Oct-2019 23:56:01 writeValueAsStringWithQuoteInScope(org.springframework.security.oauth2.common.OAuth2AccessTokenJackson1SerializerTests)  Time elapsed: 62.291 sec  <<< ERROR!
14-Oct-2019 23:56:01 java.lang.OutOfMemoryError: PermGen space
14-Oct-2019 23:56:01
14-Oct-2019 23:56:01 writeValueAsStringWithMultiScopes(org.springframework.security.oauth2.common.OAuth2AccessTokenJackson1SerializerTests)  Time elapsed: 0.232 sec  <<< ERROR!
14-Oct-2019 23:56:01 java.lang.OutOfMemoryError: PermGen space
14-Oct-2019 23:56:01
14-Oct-2019 23:56:01 writeValueWithAdditionalInformation(org.springframework.security.oauth2.common.OAuth2AccessTokenJackson1SerializerTests)  Time elapsed: 195.434 sec  <<< ERROR!
14-Oct-2019 23:56:01 java.lang.OutOfMemoryError: PermGen space
14-Oct-2019 23:56:01
14-Oct-2019 23:56:01 writeValueAsStringWithRefresh(org.springframework.security.oauth2.common.OAuth2AccessTokenJackson1SerializerTests)  Time elapsed: 0.224 sec  <<< ERROR!
14-Oct-2019 23:56:01 java.lang.OutOfMemoryError: PermGen space
14-Oct-2019 23:56:01
14-Oct-2019 23:56:01 writeValueAsStringNoRefresh(org.springframework.security.oauth2.common.OAuth2AccessTokenJackson1SerializerTests)  Time elapsed: 433.817 sec  <<< ERROR!
14-Oct-2019 23:56:01 java.lang.OutOfMemoryError: PermGen space
14-Oct-2019 23:56:01
14-Oct-2019 23:56:01 writeValueAsStringWithMac(org.springframework.security.oauth2.common.OAuth2AccessTokenJackson1SerializerTests)  Time elapsed: 0.21 sec  <<< ERROR!
14-Oct-2019 23:56:01 java.lang.OutOfMemoryError: PermGen space
14-Oct-2019 23:56:01
14-Oct-2019 23:56:01 Running org.springframework.security.oauth2.common.JsonSerializationTests
14-Oct-2019 23:56:02 Tests run: 5, Failures: 0, Errors: 3, Skipped: 0, Time elapsed: 0.967 sec <<< FAILURE!
14-Oct-2019 23:56:02 testRefreshSerialization(org.springframework.security.oauth2.common.JsonSerializationTests)  Time elapsed: 0.274 sec  <<< ERROR!
14-Oct-2019 23:56:02 java.lang.OutOfMemoryError: PermGen space
14-Oct-2019 23:56:02
14-Oct-2019 23:56:02 testDefaultSerialization(org.springframework.security.oauth2.common.JsonSerializationTests)  Time elapsed: 0.256 sec  <<< ERROR!
14-Oct-2019 23:56:02 java.lang.OutOfMemoryError: PermGen space
14-Oct-2019 23:56:02
14-Oct-2019 23:56:02 testDefaultDeserialization(org.springframework.security.oauth2.common.JsonSerializationTests)  Time elapsed: 0.212 sec  <<< ERROR!
14-Oct-2019 23:56:02 java.lang.OutOfMemoryError: PermGen space
14-Oct-2019 23:56:02
14-Oct-2019 23:56:02 Running org.springframework.security.oauth2.common.DefaultOAuth2SerializationServiceTests
14-Oct-2019 23:56:03 Tests run: 2, Failures: 0, Errors: 2, Skipped: 0, Time elapsed: 0.516 sec <<< FAILURE!
14-Oct-2019 23:56:03 testDefaultDeserialization(org.springframework.security.oauth2.common.DefaultOAuth2SerializationServiceTests)  Time elapsed: 0.29 sec  <<< ERROR!
14-Oct-2019 23:56:03 java.lang.OutOfMemoryError: PermGen space
14-Oct-2019 23:56:03
14-Oct-2019 23:56:03 testExceptionDeserialization(org.springframework.security.oauth2.common.DefaultOAuth2SerializationServiceTests)  Time elapsed: 0.226 sec  <<< ERROR!
14-Oct-2019 23:56:03 java.lang.OutOfMemoryError: PermGen space
14-Oct-2019 23:56:03
14-Oct-2019 23:56:04 Exception: java.lang.OutOfMemoryError thrown from the UncaughtExceptionHandler in thread "main"
14-Oct-2019 23:56:04
14-Oct-2019 23:56:04 Results :
14-Oct-2019 23:56:04
14-Oct-2019 23:56:04 Tests in error:
14-Oct-2019 23:56:04   testExpiringAccessToken(org.springframework.security.oauth2.provider.token.store.redis.RedisTokenStorePrefixTests): Pipeline contained one or more invalid commands; nested exception is org.springframework.dao.InvalidDataAccessApiUsageException: WRONGTYPE Operation against a key holding the wrong kind of value; nested exception is redis.clients.jedis.exceptions.JedisDataException: WRONGTYPE Operation against a key holding the wrong kind of value
14-Oct-2019 23:56:04   testRetrieveAccessToken(org.springframework.security.oauth2.provider.token.store.redis.RedisTokenStorePrefixTests): Pipeline contained one or more invalid commands; nested exception is org.springframework.dao.InvalidDataAccessApiUsageException: WRONGTYPE Operation against a key holding the wrong kind of value; nested exception is redis.clients.jedis.exceptions.JedisDataException: WRONGTYPE Operation against a key holding the wrong kind of value
14-Oct-2019 23:56:04   testStoreAccessToken(org.springframework.security.oauth2.provider.token.store.redis.RedisTokenStorePrefixTests): Pipeline contained one or more invalid commands; nested exception is org.springframework.dao.InvalidDataAccessApiUsageException: WRONGTYPE Operation against a key holding the wrong kind of value; nested exception is redis.clients.jedis.exceptions.JedisDataException: WRONGTYPE Operation against a key holding the wrong kind of value
14-Oct-2019 23:56:04   testRemovedTokenCannotBeFoundByUsername(org.springframework.security.oauth2.provider.token.store.redis.RedisTokenStorePrefixTests): Pipeline contained one or more invalid commands; nested exception is org.springframework.dao.InvalidDataAccessApiUsageException: WRONGTYPE Operation against a key holding the wrong kind of value; nested exception is redis.clients.jedis.exceptions.JedisDataException: WRONGTYPE Operation against a key holding the wrong kind of value
14-Oct-2019 23:56:04   testStoreAccessTokenTwice(org.springframework.security.oauth2.provider.token.store.redis.RedisTokenStorePrefixTests): Pipeline contained one or more invalid commands; nested exception is org.springframework.dao.InvalidDataAccessApiUsageException: WRONGTYPE Operation against a key holding the wrong kind of value; nested exception is redis.clients.jedis.exceptions.JedisDataException: WRONGTYPE Operation against a key holding the wrong kind of value
14-Oct-2019 23:56:04   testRefreshTokenIsNotStoredDuringAccessToken(org.springframework.security.oauth2.provider.token.store.redis.RedisTokenStorePrefixTests): Pipeline contained one or more invalid commands; nested exception is org.springframework.dao.InvalidDataAccessApiUsageException: WRONGTYPE Operation against a key holding the wrong kind of value; nested exception is redis.clients.jedis.exceptions.JedisDataException: WRONGTYPE Operation against a key holding the wrong kind of value
14-Oct-2019 23:56:04   testGetAccessTokenForDeletedUser(org.springframework.security.oauth2.provider.token.store.redis.RedisTokenStorePrefixTests): Pipeline contained one or more invalid commands; nested exception is org.springframework.dao.InvalidDataAccessApiUsageException: WRONGTYPE Operation against a key holding the wrong kind of value; nested exception is redis.clients.jedis.exceptions.JedisDataException: WRONGTYPE Operation against a key holding the wrong kind of value
14-Oct-2019 23:56:04   testExpiringAccessToken(org.springframework.security.oauth2.provider.token.store.redis.RedisTokenStoreTests): Pipeline contained one or more invalid commands; nested exception is org.springframework.dao.InvalidDataAccessApiUsageException: WRONGTYPE Operation against a key holding the wrong kind of value; nested exception is redis.clients.jedis.exceptions.JedisDataException: WRONGTYPE Operation against a key holding the wrong kind of value
14-Oct-2019 23:56:04   testRetrieveAccessToken(org.springframework.security.oauth2.provider.token.store.redis.RedisTokenStoreTests): Pipeline contained one or more invalid commands; nested exception is org.springframework.dao.InvalidDataAccessApiUsageException: WRONGTYPE Operation against a key holding the wrong kind of value; nested exception is redis.clients.jedis.exceptions.JedisDataException: WRONGTYPE Operation against a key holding the wrong kind of value
14-Oct-2019 23:56:04   testStoreAccessToken(org.springframework.security.oauth2.provider.token.store.redis.RedisTokenStoreTests): Pipeline contained one or more invalid commands; nested exception is org.springframework.dao.InvalidDataAccessApiUsageException: WRONGTYPE Operation against a key holding the wrong kind of value; nested exception is redis.clients.jedis.exceptions.JedisDataException: WRONGTYPE Operation against a key holding the wrong kind of value
14-Oct-2019 23:56:04   testRemovedTokenCannotBeFoundByUsername(org.springframework.security.oauth2.provider.token.store.redis.RedisTokenStoreTests): Pipeline contained one or more invalid commands; nested exception is org.springframework.dao.InvalidDataAccessApiUsageException: WRONGTYPE Operation against a key holding the wrong kind of value; nested exception is redis.clients.jedis.exceptions.JedisDataException: WRONGTYPE Operation against a key holding the wrong kind of value
14-Oct-2019 23:56:04   testStoreAccessTokenTwice(org.springframework.security.oauth2.provider.token.store.redis.RedisTokenStoreTests): Pipeline contained one or more invalid commands; nested exception is org.springframework.dao.InvalidDataAccessApiUsageException: WRONGTYPE Operation against a key holding the wrong kind of value; nested exception is redis.clients.jedis.exceptions.JedisDataException: WRONGTYPE Operation against a key holding the wrong kind of value
14-Oct-2019 23:56:04   testRefreshTokenIsNotStoredDuringAccessToken(org.springframework.security.oauth2.provider.token.store.redis.RedisTokenStoreTests): Pipeline contained one or more invalid commands; nested exception is org.springframework.dao.InvalidDataAccessApiUsageException: WRONGTYPE Operation against a key holding the wrong kind of value; nested exception is redis.clients.jedis.exceptions.JedisDataException: WRONGTYPE Operation against a key holding the wrong kind of value
14-Oct-2019 23:56:04   testGetAccessTokenForDeletedUser(org.springframework.security.oauth2.provider.token.store.redis.RedisTokenStoreTests): Pipeline contained one or more invalid commands; nested exception is org.springframework.dao.InvalidDataAccessApiUsageException: WRONGTYPE Operation against a key holding the wrong kind of value; nested exception is redis.clients.jedis.exceptions.JedisDataException: WRONGTYPE Operation against a key holding the wrong kind of value
14-Oct-2019 23:56:04   writeValueAsStringWithEmptyScope(org.springframework.security.oauth2.common.OAuth2AccessTokenJackson1SerializerTests): PermGen space
14-Oct-2019 23:56:04   writeValueAsStringWithSingleScopes(org.springframework.security.oauth2.common.OAuth2AccessTokenJackson1SerializerTests): PermGen space
14-Oct-2019 23:56:04   writeValueAsStringWithNullScope(org.springframework.security.oauth2.common.OAuth2AccessTokenJackson1SerializerTests): PermGen space
14-Oct-2019 23:56:04   writeValueAsStringWithEmptyStringScope(org.springframework.security.oauth2.common.OAuth2AccessTokenJackson1SerializerTests): PermGen space
14-Oct-2019 23:56:04   writeValueAsStringWithQuoteInScope(org.springframework.security.oauth2.common.OAuth2AccessTokenJackson1SerializerTests): PermGen space
14-Oct-2019 23:56:04   writeValueAsStringWithMultiScopes(org.springframework.security.oauth2.common.OAuth2AccessTokenJackson1SerializerTests): PermGen space
14-Oct-2019 23:56:04   writeValueWithAdditionalInformation(org.springframework.security.oauth2.common.OAuth2AccessTokenJackson1SerializerTests): PermGen space
14-Oct-2019 23:56:04   writeValueAsStringWithRefresh(org.springframework.security.oauth2.common.OAuth2AccessTokenJackson1SerializerTests): PermGen space
14-Oct-2019 23:56:04   writeValueAsStringNoRefresh(org.springframework.security.oauth2.common.OAuth2AccessTokenJackson1SerializerTests): PermGen space
14-Oct-2019 23:56:04   writeValueAsStringWithMac(org.springframework.security.oauth2.common.OAuth2AccessTokenJackson1SerializerTests): PermGen space
14-Oct-2019 23:56:04   testRefreshSerialization(org.springframework.security.oauth2.common.JsonSerializationTests): PermGen space
14-Oct-2019 23:56:04   testDefaultSerialization(org.springframework.security.oauth2.common.JsonSerializationTests): PermGen space
14-Oct-2019 23:56:04   testDefaultDeserialization(org.springframework.security.oauth2.common.JsonSerializationTests): PermGen space
14-Oct-2019 23:56:04   testDefaultDeserialization(org.springframework.security.oauth2.common.DefaultOAuth2SerializationServiceTests): PermGen space
14-Oct-2019 23:56:04   testExceptionDeserialization(org.springframework.security.oauth2.common.DefaultOAuth2SerializationServiceTests): PermGen space
14-Oct-2019 23:56:04
14-Oct-2019 23:56:04 Tests run: 694, Failures: 0, Errors: 29, Skipped: 0
14-Oct-2019 23:56:04
14-Oct-2019 23:56:04 [INFO] ------------------------------------------------------------------------
14-Oct-2019 23:56:04 [INFO] Reactor Summary:
14-Oct-2019 23:56:04 [INFO]
14-Oct-2019 23:56:04 [INFO] OAuth for Spring Security .......................... SUCCESS [  1.598 s]
14-Oct-2019 23:56:04 [INFO] OAuth 1(a) for Spring Security ..................... SUCCESS [ 11.570 s]
14-Oct-2019 23:56:04 [INFO] OAuth2 for Spring Security ......................... FAILURE [12:36 min]
14-Oct-2019 23:56:04 [INFO] spring-oauth2-tests ................................ SKIPPED
14-Oct-2019 23:56:04 [INFO] spring-oauth2-tests-common ......................... SKIPPED
14-Oct-2019 23:56:04 [INFO] spring-oauth2-tests-vanilla ........................ SKIPPED
14-Oct-2019 23:56:04 [INFO] spring-oauth2-tests-mappings ....................... SKIPPED
14-Oct-2019 23:56:04 [INFO] spring-oauth2-tests-form ........................... SKIPPED
14-Oct-2019 23:56:04 [INFO] spring-oauth2-tests-jwt ............................ SKIPPED
14-Oct-2019 23:56:04 [INFO] spring-oauth2-tests-approval ....................... SKIPPED
14-Oct-2019 23:56:04 [INFO] spring-oauth2-tests-jdbc ........................... SKIPPED
14-Oct-2019 23:56:04 [INFO] spring-oauth2-tests-jpa ............................ SKIPPED
14-Oct-2019 23:56:04 [INFO] spring-oauth2-tests-jaxb ........................... SKIPPED
14-Oct-2019 23:56:04 [INFO] spring-oauth-tests-custom-grant .................... SKIPPED
14-Oct-2019 23:56:04 [INFO] spring-oauth2-tests-multi .......................... SKIPPED
14-Oct-2019 23:56:04 [INFO] spring-oauth2-tests-client ......................... SKIPPED
14-Oct-2019 23:56:04 [INFO] spring-oauth2-tests-resource ....................... SKIPPED
14-Oct-2019 23:56:04 [INFO] spring-oauth2-tests-custom-authentication .......... SKIPPED
14-Oct-2019 23:56:04 [INFO] spring-oauth2-tests-xml ............................ SKIPPED
14-Oct-2019 23:56:04 [INFO] spring-oauth2-tests-xml-common ..................... SKIPPED
14-Oct-2019 23:56:04 [INFO] spring-oauth2-tests-xml-vanilla .................... SKIPPED
14-Oct-2019 23:56:04 [INFO] spring-oauth2-tests-xml-mappings ................... SKIPPED
14-Oct-2019 23:56:04 [INFO] spring-oauth2-tests-xml-form ....................... SKIPPED
14-Oct-2019 23:56:04 [INFO] spring-oauth2-tests-xml-jwt ........................ SKIPPED
14-Oct-2019 23:56:04 [INFO] spring-oauth2-tests-xml-approval ................... SKIPPED
14-Oct-2019 23:56:04 [INFO] spring-oauth2-tests-xml-jdbc ....................... SKIPPED
14-Oct-2019 23:56:04 [INFO] spring-oauth2-tests-xml-client ..................... SKIPPED
14-Oct-2019 23:56:04 [INFO] OAuth for Spring Security - Integration Tests ...... SKIPPED
14-Oct-2019 23:56:04 [INFO] OAuth for Spring Security - Sparklr (OAuth 1 Provider Example) SKIPPED
14-Oct-2019 23:56:04 [INFO] OAuth for Spring Security - Tonr (OAuth 1 Consumer Example) SKIPPED
14-Oct-2019 23:56:04 [INFO] OAuth for Spring Security - Sparklr2 (OAuth 2 Provider Example) SKIPPED
14-Oct-2019 23:56:04 [INFO] OAuth for Spring Security - Tonr2 (OAuth 2 Client Example) SKIPPED
14-Oct-2019 23:56:04 [INFO] OAuth for Spring Security - Samples ................ SKIPPED
14-Oct-2019 23:56:04 [INFO] ------------------------------------------------------------------------
14-Oct-2019 23:56:04 [INFO] BUILD FAILURE
14-Oct-2019 23:56:04 [INFO] ------------------------------------------------------------------------
14-Oct-2019 23:56:04 [INFO] Total time: 12:51 min
14-Oct-2019 23:56:04 [INFO] Finished at: 2019-10-14T23:56:04+00:00
14-Oct-2019 23:56:05 [INFO] Final Memory: 75M/527M
14-Oct-2019 23:56:05 [INFO] ------------------------------------------------------------------------
14-Oct-2019 23:56:05 [ERROR] Failed to execute goal org.apache.maven.plugins:maven-surefire-plugin:2.12.4:test (default-test) on project spring-security-oauth2: Execution default-test of goal org.apache.maven.plugins:maven-surefire-plugin:2.12.4:test failed: The forked VM terminated without saying properly goodbye. VM crash or System.exit called ? -> [Help 1]
14-Oct-2019 23:56:05 [ERROR]
14-Oct-2019 23:56:05 [ERROR] To see the full stack trace of the errors, re-run Maven with the -e switch.
14-Oct-2019 23:56:05 [ERROR] Re-run Maven using the -X switch to enable full debug logging.
14-Oct-2019 23:56:05 [ERROR]
14-Oct-2019 23:56:05 [ERROR] For more information about the errors and possible solutions, please read the following articles:
14-Oct-2019 23:56:05 [ERROR] [Help 1] http://cwiki.apache.org/confluence/display/MAVEN/PluginExecutionException
14-Oct-2019 23:56:05 [ERROR]
14-Oct-2019 23:56:05 [ERROR] After correcting the problems, you can resume the build with the command
14-Oct-2019 23:56:05 [ERROR]   mvn <goals> -rf :spring-security-oauth2
14-Oct-2019 23:56:05 Exception in thread "main"
14-Oct-2019 23:56:05
14-Oct-2019 23:56:05 Failing task since return code of [/opt/jdk-7/bin/java -cp /opt/maven-3.3/boot/plexus-classworlds-2.5.2.jar -Dclassworlds.conf=/tmp/artifactoryM27845713594516116612conf -DbuildInfoConfig.propertiesFile=/tmp/buildInfo236165223146988550.properties -Xmx1256m -Xms128m -Dmaven.home=/opt/maven-3.3 -Dmaven.multiModuleProjectDirectory=/opt/bamboo-home/xml-data/build-dir/SECOAUTH-B20X-JOB1 org.codehaus.plexus.classworlds.launcher.Launcher clean install -P bootstrap -Dartifactory.publish.password=********] was 1 while expected 0
14-Oct-2019 23:56:05 Finished task 'Artifactory Maven 3' with result: Failed
14-Oct-2019 23:56:05 Running post build plugin 'Docker Container Cleanup'
14-Oct-2019 23:56:05 Running post build plugin 'NCover Results Collector'
14-Oct-2019 23:56:05 Running post build plugin 'Artifactory Release Management Staging'
14-Oct-2019 23:56:05 Running post build plugin 'Artifactory Build Info Copier'
14-Oct-2019 23:56:05 Running post build plugin 'Artifactory Gradle Properties Info Copier'
14-Oct-2019 23:56:05 Running post build plugin 'Clover Results Collector'
14-Oct-2019 23:56:05 Running post build plugin 'npm Cache Cleanup'
14-Oct-2019 23:56:05 Running post build plugin 'Artifact Copier'
14-Oct-2019 23:56:05 Successfully removed working directory at '/opt/bamboo-home/xml-data/build-dir/SECOAUTH-B20X-JOB1'
14-Oct-2019 23:56:05 Finalising the build...
14-Oct-2019 23:56:05 Stopping timer.
14-Oct-2019 23:56:05 Build SECOAUTH-B20X-JOB1-25 completed.
14-Oct-2019 23:56:05 Running on server: post build plugin 'NCover Results Collector'
14-Oct-2019 23:56:05 Running on server: post build plugin 'Build Hanging Detection Configuration'
14-Oct-2019 23:56:05 Running on server: post build plugin 'Bamboo project link creator'
14-Oct-2019 23:56:05 Running on server: post build plugin 'Clover Delta Calculator'
14-Oct-2019 23:56:05 Running on server: post build plugin 'Maven Dependencies Postprocessor'
14-Oct-2019 23:56:05 All post build plugins have finished
14-Oct-2019 23:56:05 Generating build results summary...
14-Oct-2019 23:56:05 Saving build results to disk...
14-Oct-2019 23:56:05 Logging substituted variables...
14-Oct-2019 23:56:05 Indexing build results...
14-Oct-2019 23:56:05 Finished building SECOAUTH-B20X-JOB1-25.