Build: #612 failed Scheduled

Logs

The following logs have been generated by the jobs in this plan.
  • Expand all
  • Collapse all
Job Logs
Collapse Default Job Default Stage Download or View
14-Jan-2019 00:00:06 [INFO] Finished at: 2019-01-14T00:00:06+00:00
14-Jan-2019 00:00:06 [INFO] Final Memory: 56M/394M
14-Jan-2019 00:00:06 [INFO] ------------------------------------------------------------------------
14-Jan-2019 00:00:06 [ERROR] Failed to execute goal org.apache.maven.plugins:maven-compiler-plugin:2.3.2:compile (default-compile) on project spring-security-oauth: Compilation failure: Compilation failure:
14-Jan-2019 00:00:06 [ERROR] /opt/bamboo-home/xml-data/build-dir/SECOAUTH-B21XS5C-JOB1/spring-security-oauth/src/main/java/org/springframework/security/oauth/common/signature/CoreOAuthSignatureMethodFactory.java:[19,59] error: package org.springframework.security.authentication.encoding does not exist
14-Jan-2019 00:00:06 [ERROR] /opt/bamboo-home/xml-data/build-dir/SECOAUTH-B21XS5C-JOB1/spring-security-oauth/src/main/java/org/springframework/security/oauth/common/signature/CoreOAuthSignatureMethodFactory.java:[40,10] error: cannot find symbol
14-Jan-2019 00:00:06 [ERROR] class CoreOAuthSignatureMethodFactory
14-Jan-2019 00:00:06 [ERROR] /opt/bamboo-home/xml-data/build-dir/SECOAUTH-B21XS5C-JOB1/spring-security-oauth/src/main/java/org/springframework/security/oauth/common/signature/CoreOAuthSignatureMethodFactory.java:[174,9] error: cannot find symbol
14-Jan-2019 00:00:06 [ERROR] class CoreOAuthSignatureMethodFactory
14-Jan-2019 00:00:06 [ERROR] /opt/bamboo-home/xml-data/build-dir/SECOAUTH-B21XS5C-JOB1/spring-security-oauth/src/main/java/org/springframework/security/oauth/common/signature/CoreOAuthSignatureMethodFactory.java:[183,42] error: cannot find symbol
14-Jan-2019 00:00:06 [ERROR] class CoreOAuthSignatureMethodFactory
14-Jan-2019 00:00:06 [ERROR] /opt/bamboo-home/xml-data/build-dir/SECOAUTH-B21XS5C-JOB1/spring-security-oauth/src/main/java/org/springframework/security/oauth/common/signature/PlainTextSignatureMethod.java:[19,59] error: package org.springframework.security.authentication.encoding does not exist
14-Jan-2019 00:00:06 [ERROR] /opt/bamboo-home/xml-data/build-dir/SECOAUTH-B21XS5C-JOB1/spring-security-oauth/src/main/java/org/springframework/security/oauth/common/signature/PlainTextSignatureMethod.java:[34,16] error: cannot find symbol
14-Jan-2019 00:00:06 [ERROR] class PlainTextSignatureMethod
14-Jan-2019 00:00:06 [ERROR] /opt/bamboo-home/xml-data/build-dir/SECOAUTH-B21XS5C-JOB1/spring-security-oauth/src/main/java/org/springframework/security/oauth/common/signature/PlainTextSignatureMethod.java:[53,49] error: cannot find symbol
14-Jan-2019 00:00:06 [ERROR] -> [Help 1]
14-Jan-2019 00:00:06 [ERROR]
14-Jan-2019 00:00:06 [ERROR] To see the full stack trace of the errors, re-run Maven with the -e switch.
14-Jan-2019 00:00:06 [ERROR] Re-run Maven using the -X switch to enable full debug logging.
14-Jan-2019 00:00:06 [ERROR]
14-Jan-2019 00:00:06 [ERROR] For more information about the errors and possible solutions, please read the following articles:
14-Jan-2019 00:00:06 [ERROR] [Help 1] http://cwiki.apache.org/confluence/display/MAVEN/MojoFailureException
14-Jan-2019 00:00:06 [ERROR]
14-Jan-2019 00:00:06 [ERROR] After correcting the problems, you can resume the build with the command
14-Jan-2019 00:00:06 [ERROR]   mvn <goals> -rf :spring-security-oauth