Build: #956 failed Changes by Joe Grandja <jgrandja@pivotal.io>

Logs

The following logs have been generated by the jobs in this plan.
  • Expand all
  • Collapse all
Job Logs
Collapse Default Job Default Stage Download or View
07-Nov-2019 19:06:15 [INFO] Finished at: 2019-11-07T19:06:15+00:00
07-Nov-2019 19:06:15 [INFO] Final Memory: 57M/493M
07-Nov-2019 19:06:15 [INFO] ------------------------------------------------------------------------
07-Nov-2019 19:06:15 [ERROR] Failed to execute goal org.apache.maven.plugins:maven-compiler-plugin:2.3.2:compile (default-compile) on project spring-security-oauth: Compilation failure: Compilation failure:
07-Nov-2019 19:06:15 [ERROR] /opt/bamboo-home/xml-data/build-dir/SECOAUTH-B21XS5C-JOB1/spring-security-oauth/src/main/java/org/springframework/security/oauth/common/signature/CoreOAuthSignatureMethodFactory.java:[19,59] error: package org.springframework.security.authentication.encoding does not exist
07-Nov-2019 19:06:15 [ERROR] /opt/bamboo-home/xml-data/build-dir/SECOAUTH-B21XS5C-JOB1/spring-security-oauth/src/main/java/org/springframework/security/oauth/common/signature/CoreOAuthSignatureMethodFactory.java:[40,10] error: cannot find symbol
07-Nov-2019 19:06:15 [ERROR] class CoreOAuthSignatureMethodFactory
07-Nov-2019 19:06:15 [ERROR] /opt/bamboo-home/xml-data/build-dir/SECOAUTH-B21XS5C-JOB1/spring-security-oauth/src/main/java/org/springframework/security/oauth/common/signature/CoreOAuthSignatureMethodFactory.java:[174,9] error: cannot find symbol
07-Nov-2019 19:06:15 [ERROR] class CoreOAuthSignatureMethodFactory
07-Nov-2019 19:06:15 [ERROR] /opt/bamboo-home/xml-data/build-dir/SECOAUTH-B21XS5C-JOB1/spring-security-oauth/src/main/java/org/springframework/security/oauth/common/signature/CoreOAuthSignatureMethodFactory.java:[183,42] error: cannot find symbol
07-Nov-2019 19:06:15 [ERROR] class CoreOAuthSignatureMethodFactory
07-Nov-2019 19:06:15 [ERROR] /opt/bamboo-home/xml-data/build-dir/SECOAUTH-B21XS5C-JOB1/spring-security-oauth/src/main/java/org/springframework/security/oauth/common/signature/PlainTextSignatureMethod.java:[19,59] error: package org.springframework.security.authentication.encoding does not exist
07-Nov-2019 19:06:15 [ERROR] /opt/bamboo-home/xml-data/build-dir/SECOAUTH-B21XS5C-JOB1/spring-security-oauth/src/main/java/org/springframework/security/oauth/common/signature/PlainTextSignatureMethod.java:[34,16] error: cannot find symbol
07-Nov-2019 19:06:15 [ERROR] class PlainTextSignatureMethod
07-Nov-2019 19:06:15 [ERROR] /opt/bamboo-home/xml-data/build-dir/SECOAUTH-B21XS5C-JOB1/spring-security-oauth/src/main/java/org/springframework/security/oauth/common/signature/PlainTextSignatureMethod.java:[53,49] error: cannot find symbol
07-Nov-2019 19:06:15 [ERROR] -> [Help 1]
07-Nov-2019 19:06:15 [ERROR]
07-Nov-2019 19:06:15 [ERROR] To see the full stack trace of the errors, re-run Maven with the -e switch.
07-Nov-2019 19:06:15 [ERROR] Re-run Maven using the -X switch to enable full debug logging.
07-Nov-2019 19:06:15 [ERROR]
07-Nov-2019 19:06:15 [ERROR] For more information about the errors and possible solutions, please read the following articles:
07-Nov-2019 19:06:15 [ERROR] [Help 1] http://cwiki.apache.org/confluence/display/MAVEN/MojoFailureException
07-Nov-2019 19:06:15 [ERROR]
07-Nov-2019 19:06:15 [ERROR] After correcting the problems, you can resume the build with the command
07-Nov-2019 19:06:15 [ERROR]   mvn <goals> -rf :spring-security-oauth