Build: #612 failed

Job: Default Job failed

Stages & jobs

  1. Default Stage

Build log

The build generated 205 lines of output. Download or view full build log

14-Jan-2019 00:00:00 Build Spring Security OAuth - 2.1.x Spring 5x Compat - Default Job #612 (SECOAUTH-B21XS5C-JOB1-612) started building on agent bamboo-00.af.pivotal.io
14-Jan-2019 00:00:00 Remote agent on host bamboo-00.af.pivotal.io
14-Jan-2019 00:00:00 Build working directory is /opt/bamboo-home/xml-data/build-dir/SECOAUTH-B21XS5C-JOB1
14-Jan-2019 00:00:00 Executing build Spring Security OAuth - 2.1.x Spring 5x Compat - Default Job #612 (SECOAUTH-B21XS5C-JOB1-612)
14-Jan-2019 00:00:00 Starting task 'Checkout Default Repository' of type 'com.atlassian.bamboo.plugins.vcs:task.vcs.checkout'
14-Jan-2019 00:00:00 Build always requires a clean checkout
14-Jan-2019 00:00:00 Cleaning build directory '/opt/bamboo-home/xml-data/build-dir/SECOAUTH-B21XS5C-JOB1'
14-Jan-2019 00:00:00 Checking out into /opt/bamboo-home/xml-data/build-dir/SECOAUTH-B21XS5C-JOB1
14-Jan-2019 00:00:00 Updating source code to revision: 4aa19ade695214257c2c1c2263c99750bc56df2a
14-Jan-2019 00:00:00 Creating local git repository in '/opt/bamboo-home/xml-data/build-dir/SECOAUTH-B21XS5C-JOB1/.git'.
14-Jan-2019 00:00:00 Initialized empty Git repository in /opt/bamboo-home/xml-data/build-dir/SECOAUTH-B21XS5C-JOB1/.git/
14-Jan-2019 00:00:01 Fetching 'refs/heads/master' from 'git://github.com/SpringSource/spring-security-oauth.git'. Will try to do a shallow fetch.
14-Jan-2019 00:00:02 From git://github.com/SpringSource/spring-security-oauth
14-Jan-2019 00:00:02 * [new branch]      master     -> master
14-Jan-2019 00:00:02 Checking out revision 4aa19ade695214257c2c1c2263c99750bc56df2a.
14-Jan-2019 00:00:02 Already on 'master'
14-Jan-2019 00:00:02 Updated source code to revision: 4aa19ade695214257c2c1c2263c99750bc56df2a
14-Jan-2019 00:00:02 Finished task 'Checkout Default Repository' with result: Success
14-Jan-2019 00:00:02 Running pre-build action: Artifactory Release Staging
14-Jan-2019 00:00:02 Running pre-build action: VCS Version Collector
14-Jan-2019 00:00:02 Starting task 'Build' of type 'com.atlassian.bamboo.plugins.maven:task.builder.mvn3'
14-Jan-2019 00:00:02
Beginning to execute external process for build 'Spring Security OAuth - 2.1.x Spring 5x Compat - Default Job #612 (SECOAUTH-B21XS5C-JOB1-612)'
... running command line:
/opt/maven-3.3/bin/mvn --batch-mode -Djava.io.tmpdir=/tmp/SECOAUTH-B21XS5C-JOB1 -U clean verify -P spring5
... in: /opt/bamboo-home/xml-data/build-dir/SECOAUTH-B21XS5C-JOB1
... using extra environment variables:
bamboo_planRepository_1_branch=master
bamboo_********_username_password=********
bamboo_signing_store_password=********
bamboo_capability_system_builder_ant_Ant_1_9=/opt/ant-1.9
bamboo_capability_system_builder_ant_Ant_1_8=/opt/ant-1.8
bamboo_planRepository_1_branchDisplayName=master
bamboo_capability_system_jdk_OpenJDK_7u181=/opt/openjdk-7
bamboo_repository_250445851_revision_number=4aa19ade695214257c2c1c2263c99750bc56df2a
bamboo_repository_revision_number=4aa19ade695214257c2c1c2263c99750bc56df2a
MAVEN2_HOME=/opt/maven-3.3
bamboo_repository_250445851_git_username=
bamboo_capability_system_builder_node_Node_js_6=/usr/bin/node
bamboo_RIAK_BIN=/usr/sbin/riak
bamboo_buildKey=SECOAUTH-B21XS5C-JOB1
bamboo_sonar_token_password=********
bamboo_shortJobName=Default Job
bamboo_capability_system_builder_gradle___gradlew=./gradlew
bamboo_buildResultsUrl=https://build.spring.io/browse/SECOAUTH-B21XS5C-JOB1-612
bamboo_capability_system_builder_mvn3_Maven_3_3=/opt/maven-3.3
bamboo_capability_system_builder_mvn3_Maven_3_2=/opt/maven-3.2
bamboo_capability_system_builder_mvn3_Maven_3_1=/opt/maven-3.1
bamboo_planRepository_repositoryUrl=git://github.com/SpringSource/spring-security-oauth.git
bamboo_agentId=208568321
bamboo_capability_system_builder_mvn3_Maven_3_5=/opt/maven-3.5
bamboo_repository_250445851_previous_revision_number=4aa19ade695214257c2c1c2263c99750bc56df2a
bamboo_capability_system_builder_mvn3_Maven_3_0=/opt/maven-3.0
bamboo_planRepository_revision=4aa19ade695214257c2c1c2263c99750bc56df2a
bamboo_planRepository_previousRevision=4aa19ade695214257c2c1c2263c99750bc56df2a
bamboo_capability_remote_build=true
bamboo_repository_branch_name=master
bamboo_repository_250445851_git_branch=master
bamboo_scdf_acceptance_tests_password=********
JAVA_HOME=/opt/jdk-8
bamboo_capability_Agent=bamboo-00.af.pivotal.io
bamboo_planRepository_branch=master
bamboo_planRepository_1_type=gitv2
bamboo_planRepository_branchName=master
bamboo_sonar_password=********
bamboo_hg_cache_directory=/opt/bamboo-home/xml-data/build-dir/_hg-repositories-cache
bamboo_planRepository_1_username=
bamboo_planRepository_type=gitv2
bamboo_git_cache_directory=/opt/bamboo-home/xml-data/build-dir/_git-repositories-cache
useMavenReturnCode=false
bamboo_artifactory_username=buildmaster
bamboo_repository_250445851_git_repositoryUrl=git://github.com/SpringSource/spring-security-oauth.git
bamboo_tmp_directory=/opt/bamboo-home/temp
bamboo_planKey=SECOAUTH-B21XS5C
bamboo_planRepository_username=
bamboo_JDK8_HOME=/opt/jdk-8
bamboo_planRepository_1_branchName=master
bamboo_sonar_version=5.6.3
bamboo_capability_system_jdk_JDK_1_11=/opt/jdk-11
bamboo_resultsUrl=https://build.spring.io/browse/SECOAUTH-B21XS5C-JOB1-612
bamboo_capability_system_jdk_JDK_1_10=/opt/jdk-10
bamboo_build_working_directory=/opt/bamboo-home/xml-data/build-dir/SECOAUTH-B21XS5C-JOB1
bamboo_planRepository_1_name=Plan Repository
bamboo_capability_system_os=ubuntu1604
bamboo_nexusPush_stagingProfile=buildmaster
bamboo_shortPlanName=2.1.x Spring 5x Compat
bamboo_planRepository_name=Plan Repository
bamboo_buildNumber=612
bamboo_planName=Spring Security OAuth - 2.1.x Spring 5x Compat
bamboo_JDK7_HOME=/opt/jdk-7
bamboo_shortPlanKey=B21XS5C
bamboo_shortJobKey=JOB1
bamboo_artifactory_password=********
bamboo_buildTimeStamp=2019-01-14T00:00:00.584Z
bamboo_repository_previous_revision_number=4aa19ade695214257c2c1c2263c99750bc56df2a
bamboo_sonar_username=buildmaster
bamboo_********_password=********
M2_HOME=/opt/maven-3.3
bamboo_repository_git_branch=master
bamboo_buildResultKey=SECOAUTH-B21XS5C-JOB1-612
bamboo_nexusPush_close=true
bamboo_buildPlanName=Spring Security OAuth - 2.1.x Spring 5x Compat - Default Job
bamboo_repository_250445851_name=Plan Repository
bamboo_planRepository_1_revision=4aa19ade695214257c2c1c2263c99750bc56df2a
bamboo_repository_name=Plan Repository
bamboo_signing_key_password=********
bamboo_buildFailed=false
bamboo_capability_system_docker_executable=/usr/bin/docker
MAVEN_OPTS=-Xmx1256m -Xms128m
bamboo_capability_system_builder_groovy_Groovy_2_4=/opt/groovy-2.4
bamboo_capability_system_builder_command_Bash=/bin/bash
bamboo_agentWorkingDirectory=/opt/bamboo-home/xml-data/build-dir
bamboo_capability_system_git_executable=/usr/bin/git
bamboo_repository_git_username=
bamboo_planRepository_1_previousRevision=4aa19ade695214257c2c1c2263c99750bc56df2a
bamboo_capability_os_family=unix
bamboo_planRepository_branchDisplayName=master
bamboo_capability_system_builder_maven_Artifactory_Maven_3_5=/opt/maven-3.5
bamboo_capability_system_builder_maven_Artifactory_Maven_3_3=/opt/maven-3.3
bamboo_capability_system_builder_maven_Artifactory_Maven_3_2=/opt/maven-3.2
bamboo_repository_250445851_branch_name=master
bamboo_s3_properties=/home/bamboo/tools/s3.properties
bamboo_capability_system_builder_maven_Artifactory_Maven_3_1=/opt/maven-3.1
bamboo_capability_system_builder_maven_Artifactory_Maven_3_0=/opt/maven-3.0
bamboo_plan_storageTag=plan-250249269
bamboo_repository_git_repositoryUrl=git://github.com/SpringSource/spring-security-oauth.git
bamboo_working_directory=/opt/bamboo-home/xml-data/build-dir/SECOAUTH-B21XS5C-JOB1
bamboo_planRepository_1_repositoryUrl=git://github.com/SpringSource/spring-security-oauth.git
bamboo_capability_system_jdk_JDK_1_8=/opt/jdk-8
bamboo_capability_system_jdk_JDK_1_9=/opt/jdk-9
bamboo_capability_system_jdk_JDK_1_6=/opt/jdk-6
bamboo_capability_system_jdk_JDK_1_7=/opt/jdk-7
bamboo_sonar_ip=10.194.6.9
PATH=/opt/jdk-8/bin:/bin:/home/bamboo/.rvm/gems/ruby-2.3.0/bin:/home/bamboo/.rvm/gems/ruby-2.3.0@global/bin:/home/bamboo/.rvm/rubies/ruby-2.3.0/bin:/home/bamboo/bin:/usr/local/bin:/usr/bin:/bin:/usr/local/games:/usr/games:/snap/bin:/home/bamboo/bin:/usr/local/bin:/opt/ec2-api-tools/bin:/home/bamboo/.rvm/bin
14-Jan-2019 00:00:03 [INFO] Scanning for projects...
14-Jan-2019 00:00:04 [INFO] Downloading: https://repo.maven.apache.org/maven2/joda-time/joda-time/maven-metadata.xml
14-Jan-2019 00:00:04 [INFO] Downloaded: https://repo.maven.apache.org/maven2/joda-time/joda-time/maven-metadata.xml (2 KB at 8.2 KB/sec)
14-Jan-2019 00:00:04 [INFO] ------------------------------------------------------------------------
14-Jan-2019 00:00:04 [INFO] Reactor Build Order:
14-Jan-2019 00:00:04 [INFO]
14-Jan-2019 00:00:04 [INFO] OAuth for Spring Security
14-Jan-2019 00:00:04 [INFO] OAuth 1(a) for Spring Security
14-Jan-2019 00:00:04 [INFO] OAuth2 for Spring Security
14-Jan-2019 00:00:04 [INFO] spring-oauth2-tests
14-Jan-2019 00:00:04 [INFO] spring-oauth2-tests-common
14-Jan-2019 00:00:04 [INFO] spring-oauth2-tests-vanilla
14-Jan-2019 00:00:04 [INFO] spring-oauth2-tests-mappings
14-Jan-2019 00:00:04 [INFO] spring-oauth2-tests-form
14-Jan-2019 00:00:04 [INFO] spring-oauth2-tests-jwt
14-Jan-2019 00:00:04 [INFO] spring-oauth2-tests-approval
14-Jan-2019 00:00:04 [INFO] spring-oauth2-tests-jdbc
14-Jan-2019 00:00:04 [INFO] spring-oauth2-tests-jpa
14-Jan-2019 00:00:04 [INFO] spring-oauth2-tests-jaxb
14-Jan-2019 00:00:04 [INFO] spring-oauth-tests-custom-grant
14-Jan-2019 00:00:04 [INFO] spring-oauth2-tests-multi
14-Jan-2019 00:00:04 [INFO] spring-oauth2-tests-client
14-Jan-2019 00:00:04 [INFO] spring-oauth2-tests-resource
14-Jan-2019 00:00:04 [INFO] spring-oauth2-tests-custom-authentication
14-Jan-2019 00:00:04 [INFO] spring-oauth2-tests-xml
14-Jan-2019 00:00:04 [INFO] spring-oauth2-tests-xml-common
14-Jan-2019 00:00:04 [INFO] spring-oauth2-tests-xml-vanilla
14-Jan-2019 00:00:04 [INFO] spring-oauth2-tests-xml-mappings
14-Jan-2019 00:00:04 [INFO] spring-oauth2-tests-xml-form
14-Jan-2019 00:00:04 [INFO] spring-oauth2-tests-xml-jwt
14-Jan-2019 00:00:04 [INFO] spring-oauth2-tests-xml-approval
14-Jan-2019 00:00:04 [INFO] spring-oauth2-tests-xml-jdbc
14-Jan-2019 00:00:04 [INFO] spring-oauth2-tests-xml-client
14-Jan-2019 00:00:04 [INFO] OAuth for Spring Security - Integration Tests
14-Jan-2019 00:00:04 [INFO] OAuth for Spring Security - Sparklr (OAuth 1 Provider Example)
14-Jan-2019 00:00:04 [INFO] OAuth for Spring Security - Tonr (OAuth 1 Consumer Example)
14-Jan-2019 00:00:04 [INFO] OAuth for Spring Security - Sparklr2 (OAuth 2 Provider Example)
14-Jan-2019 00:00:04 [INFO] OAuth for Spring Security - Tonr2 (OAuth 2 Client Example)
14-Jan-2019 00:00:04 [INFO] OAuth for Spring Security - Samples
14-Jan-2019 00:00:04 [INFO]                                                                         
14-Jan-2019 00:00:04 [INFO] ------------------------------------------------------------------------
14-Jan-2019 00:00:04 [INFO] Building OAuth for Spring Security 2.3.5.BUILD-SNAPSHOT
14-Jan-2019 00:00:04 [INFO] ------------------------------------------------------------------------
14-Jan-2019 00:00:04 [INFO] Downloading: https://repo.maven.apache.org/maven2/org/apache/maven/plugins/maven-surefire-plugin/maven-metadata.xml
14-Jan-2019 00:00:04 [INFO] Downloaded: https://repo.maven.apache.org/maven2/org/apache/maven/plugins/maven-surefire-plugin/maven-metadata.xml (2 KB at 170.6 KB/sec)
14-Jan-2019 00:00:04 [INFO]
14-Jan-2019 00:00:04 [INFO] --- maven-clean-plugin:2.5:clean (default-clean) @ spring-security-oauth-parent ---
14-Jan-2019 00:00:05 [INFO]
14-Jan-2019 00:00:05 [INFO] >>> maven-source-plugin:2.1.2:jar (attach-sources) > generate-sources @ spring-security-oauth-parent >>>
14-Jan-2019 00:00:05 [INFO]
14-Jan-2019 00:00:05 [INFO] <<< maven-source-plugin:2.1.2:jar (attach-sources) < generate-sources @ spring-security-oauth-parent <<<
14-Jan-2019 00:00:05 [INFO]
14-Jan-2019 00:00:05 [INFO] --- maven-source-plugin:2.1.2:jar (attach-sources) @ spring-security-oauth-parent ---
14-Jan-2019 00:00:05 [INFO]
14-Jan-2019 00:00:05 [INFO] --- maven-javadoc-plugin:2.9.1:jar (javadoc) @ spring-security-oauth-parent ---
14-Jan-2019 00:00:05 [INFO] Not executing Javadoc as the project is not a Java classpath-capable package
14-Jan-2019 00:00:05 [INFO]                                                                         
14-Jan-2019 00:00:05 [INFO] ------------------------------------------------------------------------
14-Jan-2019 00:00:05 [INFO] Building OAuth 1(a) for Spring Security 2.3.5.BUILD-SNAPSHOT
14-Jan-2019 00:00:05 [INFO] ------------------------------------------------------------------------
14-Jan-2019 00:00:05 [INFO]
14-Jan-2019 00:00:05 [INFO] --- maven-clean-plugin:2.5:clean (default-clean) @ spring-security-oauth ---
14-Jan-2019 00:00:05 [INFO]
14-Jan-2019 00:00:05 [INFO] --- maven-resources-plugin:2.6:resources (default-resources) @ spring-security-oauth ---
14-Jan-2019 00:00:05 [INFO] Using 'UTF-8' encoding to copy filtered resources.
14-Jan-2019 00:00:05 [INFO] Copying 3 resources
14-Jan-2019 00:00:05 [INFO]
14-Jan-2019 00:00:05 [INFO] --- maven-compiler-plugin:2.3.2:compile (default-compile) @ spring-security-oauth ---
14-Jan-2019 00:00:05 [INFO] Compiling 108 source files to /opt/bamboo-home/xml-data/build-dir/SECOAUTH-B21XS5C-JOB1/spring-security-oauth/target/classes
14-Jan-2019 00:00:06 [INFO] -------------------------------------------------------------
14-Jan-2019 00:00:06 [WARNING] COMPILATION WARNING :
14-Jan-2019 00:00:06 [INFO] -------------------------------------------------------------
14-Jan-2019 00:00:06 [WARNING]  class PlainTextSignatureMethod
14-Jan-2019 00:00:06 /opt/bamboo-home/xml-data/build-dir/SECOAUTH-B21XS5C-JOB1/spring-security-oauth/src/main/java/org/springframework/security/oauth/consumer/net/OAuthOverHttpURLStreamHandler.java:[36,76] Handler is internal proprietary API and may be removed in a future release
14-Jan-2019 00:00:06 [WARNING] /opt/bamboo-home/xml-data/build-dir/SECOAUTH-B21XS5C-JOB1/spring-security-oauth/src/main/java/org/springframework/security/oauth/consumer/net/OAuthOverHttpsURLStreamHandler.java:[36,78] Handler is internal proprietary API and may be removed in a future release
14-Jan-2019 00:00:06 [INFO] 2 warnings
14-Jan-2019 00:00:06 [INFO] -------------------------------------------------------------
14-Jan-2019 00:00:06 [INFO] -------------------------------------------------------------
14-Jan-2019 00:00:06 [ERROR] COMPILATION ERROR :
14-Jan-2019 00:00:06 [INFO] -------------------------------------------------------------
14-Jan-2019 00:00:06 [ERROR] /opt/bamboo-home/xml-data/build-dir/SECOAUTH-B21XS5C-JOB1/spring-security-oauth/src/main/java/org/springframework/security/oauth/common/signature/CoreOAuthSignatureMethodFactory.java:[19,59] error: package org.springframework.security.authentication.encoding does not exist
14-Jan-2019 00:00:06 [ERROR] /opt/bamboo-home/xml-data/build-dir/SECOAUTH-B21XS5C-JOB1/spring-security-oauth/src/main/java/org/springframework/security/oauth/common/signature/CoreOAuthSignatureMethodFactory.java:[40,10] error: cannot find symbol
14-Jan-2019 00:00:06 [ERROR]  class CoreOAuthSignatureMethodFactory
14-Jan-2019 00:00:06 /opt/bamboo-home/xml-data/build-dir/SECOAUTH-B21XS5C-JOB1/spring-security-oauth/src/main/java/org/springframework/security/oauth/common/signature/CoreOAuthSignatureMethodFactory.java:[174,9] error: cannot find symbol
14-Jan-2019 00:00:06 [ERROR]  class CoreOAuthSignatureMethodFactory
14-Jan-2019 00:00:06 /opt/bamboo-home/xml-data/build-dir/SECOAUTH-B21XS5C-JOB1/spring-security-oauth/src/main/java/org/springframework/security/oauth/common/signature/CoreOAuthSignatureMethodFactory.java:[183,42] error: cannot find symbol
14-Jan-2019 00:00:06 [ERROR]  class CoreOAuthSignatureMethodFactory
14-Jan-2019 00:00:06 /opt/bamboo-home/xml-data/build-dir/SECOAUTH-B21XS5C-JOB1/spring-security-oauth/src/main/java/org/springframework/security/oauth/common/signature/PlainTextSignatureMethod.java:[19,59] error: package org.springframework.security.authentication.encoding does not exist
14-Jan-2019 00:00:06 [ERROR] /opt/bamboo-home/xml-data/build-dir/SECOAUTH-B21XS5C-JOB1/spring-security-oauth/src/main/java/org/springframework/security/oauth/common/signature/PlainTextSignatureMethod.java:[34,16] error: cannot find symbol
14-Jan-2019 00:00:06 [ERROR]  class PlainTextSignatureMethod
14-Jan-2019 00:00:06 /opt/bamboo-home/xml-data/build-dir/SECOAUTH-B21XS5C-JOB1/spring-security-oauth/src/main/java/org/springframework/security/oauth/common/signature/PlainTextSignatureMethod.java:[53,49] error: cannot find symbol
14-Jan-2019 00:00:06 [INFO] 7 errors
14-Jan-2019 00:00:06 [INFO] -------------------------------------------------------------
14-Jan-2019 00:00:06 [INFO] ------------------------------------------------------------------------
14-Jan-2019 00:00:06 [INFO] Reactor Summary:
14-Jan-2019 00:00:06 [INFO]
14-Jan-2019 00:00:06 [INFO] OAuth for Spring Security .......................... SUCCESS [  0.620 s]
14-Jan-2019 00:00:06 [INFO] OAuth 1(a) for Spring Security ..................... FAILURE [  0.695 s]
14-Jan-2019 00:00:06 [INFO] OAuth2 for Spring Security ......................... SKIPPED
14-Jan-2019 00:00:06 [INFO] spring-oauth2-tests ................................ SKIPPED
14-Jan-2019 00:00:06 [INFO] spring-oauth2-tests-common ......................... SKIPPED
14-Jan-2019 00:00:06 [INFO] spring-oauth2-tests-vanilla ........................ SKIPPED
14-Jan-2019 00:00:06 [INFO] spring-oauth2-tests-mappings ....................... SKIPPED
14-Jan-2019 00:00:06 [INFO] spring-oauth2-tests-form ........................... SKIPPED
14-Jan-2019 00:00:06 [INFO] spring-oauth2-tests-jwt ............................ SKIPPED
14-Jan-2019 00:00:06 [INFO] spring-oauth2-tests-approval ....................... SKIPPED
14-Jan-2019 00:00:06 [INFO] spring-oauth2-tests-jdbc ........................... SKIPPED
14-Jan-2019 00:00:06 [INFO] spring-oauth2-tests-jpa ............................ SKIPPED
14-Jan-2019 00:00:06 [INFO] spring-oauth2-tests-jaxb ........................... SKIPPED
14-Jan-2019 00:00:06 [INFO] spring-oauth-tests-custom-grant .................... SKIPPED
14-Jan-2019 00:00:06 [INFO] spring-oauth2-tests-multi .......................... SKIPPED
14-Jan-2019 00:00:06 [INFO] spring-oauth2-tests-client ......................... SKIPPED
14-Jan-2019 00:00:06 [INFO] spring-oauth2-tests-resource ....................... SKIPPED
14-Jan-2019 00:00:06 [INFO] spring-oauth2-tests-custom-authentication .......... SKIPPED
14-Jan-2019 00:00:06 [INFO] spring-oauth2-tests-xml ............................ SKIPPED
14-Jan-2019 00:00:06 [INFO] spring-oauth2-tests-xml-common ..................... SKIPPED
14-Jan-2019 00:00:06 [INFO] spring-oauth2-tests-xml-vanilla .................... SKIPPED
14-Jan-2019 00:00:06 [INFO] spring-oauth2-tests-xml-mappings ................... SKIPPED
14-Jan-2019 00:00:06 [INFO] spring-oauth2-tests-xml-form ....................... SKIPPED
14-Jan-2019 00:00:06 [INFO] spring-oauth2-tests-xml-jwt ........................ SKIPPED
14-Jan-2019 00:00:06 [INFO] spring-oauth2-tests-xml-approval ................... SKIPPED
14-Jan-2019 00:00:06 [INFO] spring-oauth2-tests-xml-jdbc ....................... SKIPPED
14-Jan-2019 00:00:06 [INFO] spring-oauth2-tests-xml-client ..................... SKIPPED
14-Jan-2019 00:00:06 [INFO] OAuth for Spring Security - Integration Tests ...... SKIPPED
14-Jan-2019 00:00:06 [INFO] OAuth for Spring Security - Sparklr (OAuth 1 Provider Example) SKIPPED
14-Jan-2019 00:00:06 [INFO] OAuth for Spring Security - Tonr (OAuth 1 Consumer Example) SKIPPED
14-Jan-2019 00:00:06 [INFO] OAuth for Spring Security - Sparklr2 (OAuth 2 Provider Example) SKIPPED
14-Jan-2019 00:00:06 [INFO] OAuth for Spring Security - Tonr2 (OAuth 2 Client Example) SKIPPED
14-Jan-2019 00:00:06 [INFO] OAuth for Spring Security - Samples ................ SKIPPED
14-Jan-2019 00:00:06 [INFO] ------------------------------------------------------------------------
14-Jan-2019 00:00:06 [INFO] BUILD FAILURE
14-Jan-2019 00:00:06 [INFO] ------------------------------------------------------------------------
14-Jan-2019 00:00:06 [INFO] Total time: 2.727 s
14-Jan-2019 00:00:06 [INFO] Finished at: 2019-01-14T00:00:06+00:00
14-Jan-2019 00:00:06 [INFO] Final Memory: 56M/394M
14-Jan-2019 00:00:06 [INFO] ------------------------------------------------------------------------
14-Jan-2019 00:00:06 [ERROR] Failed to execute goal org.apache.maven.plugins:maven-compiler-plugin:2.3.2:compile (default-compile) on project spring-security-oauth: Compilation failure: Compilation failure:
14-Jan-2019 00:00:06 [ERROR] /opt/bamboo-home/xml-data/build-dir/SECOAUTH-B21XS5C-JOB1/spring-security-oauth/src/main/java/org/springframework/security/oauth/common/signature/CoreOAuthSignatureMethodFactory.java:[19,59] error: package org.springframework.security.authentication.encoding does not exist
14-Jan-2019 00:00:06 [ERROR] /opt/bamboo-home/xml-data/build-dir/SECOAUTH-B21XS5C-JOB1/spring-security-oauth/src/main/java/org/springframework/security/oauth/common/signature/CoreOAuthSignatureMethodFactory.java:[40,10] error: cannot find symbol
14-Jan-2019 00:00:06 [ERROR] class CoreOAuthSignatureMethodFactory
14-Jan-2019 00:00:06 [ERROR] /opt/bamboo-home/xml-data/build-dir/SECOAUTH-B21XS5C-JOB1/spring-security-oauth/src/main/java/org/springframework/security/oauth/common/signature/CoreOAuthSignatureMethodFactory.java:[174,9] error: cannot find symbol
14-Jan-2019 00:00:06 [ERROR] class CoreOAuthSignatureMethodFactory
14-Jan-2019 00:00:06 [ERROR] /opt/bamboo-home/xml-data/build-dir/SECOAUTH-B21XS5C-JOB1/spring-security-oauth/src/main/java/org/springframework/security/oauth/common/signature/CoreOAuthSignatureMethodFactory.java:[183,42] error: cannot find symbol
14-Jan-2019 00:00:06 [ERROR] class CoreOAuthSignatureMethodFactory
14-Jan-2019 00:00:06 [ERROR] /opt/bamboo-home/xml-data/build-dir/SECOAUTH-B21XS5C-JOB1/spring-security-oauth/src/main/java/org/springframework/security/oauth/common/signature/PlainTextSignatureMethod.java:[19,59] error: package org.springframework.security.authentication.encoding does not exist
14-Jan-2019 00:00:06 [ERROR] /opt/bamboo-home/xml-data/build-dir/SECOAUTH-B21XS5C-JOB1/spring-security-oauth/src/main/java/org/springframework/security/oauth/common/signature/PlainTextSignatureMethod.java:[34,16] error: cannot find symbol
14-Jan-2019 00:00:06 [ERROR] class PlainTextSignatureMethod
14-Jan-2019 00:00:06 [ERROR] /opt/bamboo-home/xml-data/build-dir/SECOAUTH-B21XS5C-JOB1/spring-security-oauth/src/main/java/org/springframework/security/oauth/common/signature/PlainTextSignatureMethod.java:[53,49] error: cannot find symbol
14-Jan-2019 00:00:06 [ERROR] -> [Help 1]
14-Jan-2019 00:00:06 [ERROR]
14-Jan-2019 00:00:06 [ERROR] To see the full stack trace of the errors, re-run Maven with the -e switch.
14-Jan-2019 00:00:06 [ERROR] Re-run Maven using the -X switch to enable full debug logging.
14-Jan-2019 00:00:06 [ERROR]
14-Jan-2019 00:00:06 [ERROR] For more information about the errors and possible solutions, please read the following articles:
14-Jan-2019 00:00:06 [ERROR] [Help 1] http://cwiki.apache.org/confluence/display/MAVEN/MojoFailureException
14-Jan-2019 00:00:06 [ERROR]
14-Jan-2019 00:00:06 [ERROR] After correcting the problems, you can resume the build with the command
14-Jan-2019 00:00:06 [ERROR]   mvn <goals> -rf :spring-security-oauth
14-Jan-2019 00:00:06 Failing task since return code of [/opt/maven-3.3/bin/mvn --batch-mode -Djava.io.tmpdir=/tmp/SECOAUTH-B21XS5C-JOB1 -U clean verify -P spring5] was 1 while expected 0
14-Jan-2019 00:00:06 Parsing test results under /opt/bamboo-home/xml-data/build-dir/SECOAUTH-B21XS5C-JOB1...
14-Jan-2019 00:00:06 Finished task 'Build' with result: Failed
14-Jan-2019 00:00:06 Running post build plugin 'Docker Container Cleanup'
14-Jan-2019 00:00:06 Running post build plugin 'NCover Results Collector'
14-Jan-2019 00:00:06 Running post build plugin 'Artifactory Release Management Staging'
14-Jan-2019 00:00:06 Running post build plugin 'Artifactory Build Info Copier'
14-Jan-2019 00:00:06 Running post build plugin 'Artifactory Gradle Properties Info Copier'
14-Jan-2019 00:00:06 Running post build plugin 'Clover Results Collector'
14-Jan-2019 00:00:06 Running post build plugin 'npm Cache Cleanup'
14-Jan-2019 00:00:06 Running post build plugin 'Artifact Copier'
14-Jan-2019 00:00:06 Successfully removed working directory at '/opt/bamboo-home/xml-data/build-dir/SECOAUTH-B21XS5C-JOB1'
14-Jan-2019 00:00:06 Finalising the build...
14-Jan-2019 00:00:06 Stopping timer.
14-Jan-2019 00:00:06 Build SECOAUTH-B21XS5C-JOB1-612 completed.
14-Jan-2019 00:00:09 Running on server: post build plugin 'NCover Results Collector'
14-Jan-2019 00:00:09 Running on server: post build plugin 'Build Hanging Detection Configuration'
14-Jan-2019 00:00:09 Running on server: post build plugin 'Clover Delta Calculator'
14-Jan-2019 00:00:09 Running on server: post build plugin 'Maven Dependencies Postprocessor'
14-Jan-2019 00:00:09 All post build plugins have finished
14-Jan-2019 00:00:09 Generating build results summary...
14-Jan-2019 00:00:09 Saving build results to disk...
14-Jan-2019 00:00:09 Logging substituted variables...
14-Jan-2019 00:00:09 Indexing build results...
14-Jan-2019 00:00:09 Finished building SECOAUTH-B21XS5C-JOB1-612.