Build: #956 failed

Job: Default Job failed

Stages & jobs

  1. Default Stage

Build log

The build generated 208 lines of output. Download or view full build log

07-Nov-2019 19:06:07 Build Spring Security OAuth - 2.1.x Spring 5x Compat - Default Job #956 (SECOAUTH-B21XS5C-JOB1-956) started building on agent bamboo-17.af.pivotal.io
07-Nov-2019 19:06:07 Remote agent on host bamboo-17.af.pivotal.io
07-Nov-2019 19:06:07 Build working directory is /opt/bamboo-home/xml-data/build-dir/SECOAUTH-B21XS5C-JOB1
07-Nov-2019 19:06:07 Executing build Spring Security OAuth - 2.1.x Spring 5x Compat - Default Job #956 (SECOAUTH-B21XS5C-JOB1-956)
07-Nov-2019 19:06:07 Starting task 'Checkout Default Repository' of type 'com.atlassian.bamboo.plugins.vcs:task.vcs.checkout'
07-Nov-2019 19:06:07 Build always requires a clean checkout
07-Nov-2019 19:06:07 Cleaning build directory '/opt/bamboo-home/xml-data/build-dir/SECOAUTH-B21XS5C-JOB1'
07-Nov-2019 19:06:07 Checking out into /opt/bamboo-home/xml-data/build-dir/SECOAUTH-B21XS5C-JOB1
07-Nov-2019 19:06:07 Updating source code to revision: 9e32274ad163b56c362fa523d7e64f41a755e07a
07-Nov-2019 19:06:08 Creating local git repository in '/opt/bamboo-home/xml-data/build-dir/SECOAUTH-B21XS5C-JOB1/.git'.
07-Nov-2019 19:06:08 Initialized empty Git repository in /opt/bamboo-home/xml-data/build-dir/SECOAUTH-B21XS5C-JOB1/.git/
07-Nov-2019 19:06:08 Fetching 'refs/heads/master' from 'git://github.com/SpringSource/spring-security-oauth.git'. Will try to do a shallow fetch.
07-Nov-2019 19:06:11 From git://github.com/SpringSource/spring-security-oauth
07-Nov-2019 19:06:11 * [new branch]      master     -> master
07-Nov-2019 19:06:11 Checking out revision 9e32274ad163b56c362fa523d7e64f41a755e07a.
07-Nov-2019 19:06:11 Already on 'master'
07-Nov-2019 19:06:11 Updated source code to revision: 9e32274ad163b56c362fa523d7e64f41a755e07a
07-Nov-2019 19:06:11 Finished task 'Checkout Default Repository' with result: Success
07-Nov-2019 19:06:11 Running pre-build action: Artifactory Release Staging
07-Nov-2019 19:06:11 Running pre-build action: VCS Version Collector
07-Nov-2019 19:06:11 Starting task 'Build' of type 'com.atlassian.bamboo.plugins.maven:task.builder.mvn3'
07-Nov-2019 19:06:11
Beginning to execute external process for build 'Spring Security OAuth - 2.1.x Spring 5x Compat - Default Job #956 (SECOAUTH-B21XS5C-JOB1-956)'
... running command line:
/opt/maven-3.3/bin/mvn --batch-mode -Djava.io.tmpdir=/tmp/SECOAUTH-B21XS5C-JOB1 -U clean verify -P spring5
... in: /opt/bamboo-home/xml-data/build-dir/SECOAUTH-B21XS5C-JOB1
... using extra environment variables:
bamboo_planRepository_1_branch=master
bamboo_********_username_password=********
bamboo_signing_store_password=********
bamboo_capability_system_builder_ant_Ant_1_9=/opt/ant-1.9
bamboo_capability_system_builder_ant_Ant_1_8=/opt/ant-1.8
bamboo_planRepository_1_branchDisplayName=master
bamboo_artifactory_override_resolve_repo=libs-milestone
bamboo_capability_system_builder_node_Node_js_10_16=/opt/node-10.16/bin/node
bamboo_repository_250445851_revision_number=9e32274ad163b56c362fa523d7e64f41a755e07a
bamboo_repository_revision_number=9e32274ad163b56c362fa523d7e64f41a755e07a
MAVEN2_HOME=/opt/maven-3.3
bamboo_repository_250445851_git_username=
bamboo_RIAK_BIN=/usr/sbin/riak
bamboo_buildKey=SECOAUTH-B21XS5C-JOB1
bamboo_ge_cache_username=ci
bamboo_bintray_password=********
bamboo_sonar_token_password=********
bamboo_shortJobName=Default Job
bamboo_artifactory_override_resolver_password=********
bamboo_sonatype_token=RSJChaox
bamboo_capability_system_builder_gradle___gradlew=./gradlew
bamboo_buildResultsUrl=https://build.spring.io/browse/SECOAUTH-B21XS5C-JOB1-956
bamboo_capability_system_builder_mvn3_Maven_3_3=/opt/maven-3.3
bamboo_capability_system_builder_mvn3_Maven_3_2=/opt/maven-3.2
bamboo_capability_system_builder_mvn3_Maven_3_1=/opt/maven-3.1
bamboo_planRepository_repositoryUrl=git://github.com/SpringSource/spring-security-oauth.git
bamboo_capability_system_builder_mvn3_Maven_3_6=/opt/maven-3.6
bamboo_agentId=286195718
bamboo_capability_system_builder_mvn3_Maven_3_5=/opt/maven-3.5
bamboo_repository_250445851_previous_revision_number=788a0846a3b6b7af4df59eebcd259d6fba661e9e
bamboo_capability_system_builder_mvn3_Maven_3_0=/opt/maven-3.0
bamboo_planRepository_revision=9e32274ad163b56c362fa523d7e64f41a755e07a
bamboo_planRepository_previousRevision=788a0846a3b6b7af4df59eebcd259d6fba661e9e
bamboo_capability_remote_build=true
bamboo_repository_branch_name=master
bamboo_sonatype_token_password=********
bamboo_sonatype_user=springsource
bamboo_repository_250445851_git_branch=master
bamboo_scdf_acceptance_tests_password=********
bamboo_APPLE_AC_PASSWORD=********
JAVA_HOME=/opt/jdk-8
bamboo_planRepository_branch=master
bamboo_capability_system_jdk_JDK_13=/opt/jdk-13
bamboo_planRepository_1_type=gitv2
bamboo_planRepository_branchName=master
bamboo_capability_system_jdk_JDK_12=/opt/jdk-12
bamboo_capability_system_builder_gradlew_gradlew=./
bamboo_capability_system_builder_ant_Ant_1_10=/opt/ant-1.10
bamboo_sonar_password=********
bamboo_hg_cache_directory=/opt/bamboo-home/xml-data/build-dir/_hg-repositories-cache
bamboo_planRepository_1_username=
bamboo_planRepository_type=gitv2
bamboo_git_cache_directory=/opt/bamboo-home/xml-data/build-dir/_git-repositories-cache
useMavenReturnCode=false
bamboo_artifactory_username=buildmaster
bamboo_repository_250445851_git_repositoryUrl=git://github.com/SpringSource/spring-security-oauth.git
bamboo_tmp_directory=/opt/bamboo-home/temp
bamboo_planKey=SECOAUTH-B21XS5C
bamboo_planRepository_username=
bamboo_JDK8_HOME=/opt/jdk-8
bamboo_planRepository_1_branchName=master
bamboo_sonar_version=6.7.7
bamboo_sonar_jdbc_password=********
bamboo_bintray_api_key_password=********
bamboo_capability_system_jdk_JDK_1_11=/opt/jdk-11
bamboo_resultsUrl=https://build.spring.io/browse/SECOAUTH-B21XS5C-JOB1-956
bamboo_APPLE_AC_USERNAME_PASSWORD=********
bamboo_capability_system_jdk_JDK_1_10=/opt/jdk-10
bamboo_build_working_directory=/opt/bamboo-home/xml-data/build-dir/SECOAUTH-B21XS5C-JOB1
bamboo_planRepository_1_name=Plan Repository
bamboo_capability_system_os=ubuntu1804
bamboo_nexusPush_stagingProfile=buildmaster
bamboo_shortPlanName=2.1.x Spring 5x Compat
bamboo_planRepository_name=Plan Repository
bamboo_buildNumber=956
bamboo_planName=Spring Security OAuth - 2.1.x Spring 5x Compat
bamboo_JDK7_HOME=/opt/jdk-7
bamboo_shortPlanKey=B21XS5C
bamboo_shortJobKey=JOB1
bamboo_artifactory_password=********
bamboo_buildTimeStamp=2019-11-07T19:06:07.700Z
bamboo_repository_previous_revision_number=788a0846a3b6b7af4df59eebcd259d6fba661e9e
bamboo_sonar_username=buildmaster
bamboo_********_password=********
M2_HOME=/opt/maven-3.3
bamboo_repository_git_branch=master
bamboo_buildResultKey=SECOAUTH-B21XS5C-JOB1-956
bamboo_nexusPush_close=true
bamboo_artifactory_override_resolver_username=buildmaster
bamboo_buildPlanName=Spring Security OAuth - 2.1.x Spring 5x Compat - Default Job
bamboo_repository_250445851_name=Plan Repository
bamboo_planRepository_1_revision=9e32274ad163b56c362fa523d7e64f41a755e07a
bamboo_repository_name=Plan Repository
bamboo_signing_key_password=********
bamboo_capability_system_builder_groovy_Groovy_2_5=/opt/groovy-2.5
bamboo_buildFailed=false
bamboo_capability_system_docker_executable=/usr/bin/docker
MAVEN_OPTS=-Xmx1256m -Xms128m
bamboo_capability_system_jdk_OpenJDK_7=/opt/jdk-7
bamboo_capability_system_builder_groovy_Groovy_2_4=/opt/groovy-2.4
bamboo_artifactory_override_deployer_username=buildmaster
bamboo_capability_system_builder_command_Bash=/bin/bash
bamboo_agentWorkingDirectory=/opt/bamboo-home/xml-data/build-dir
bamboo_capability_system_git_executable=/usr/bin/git
bamboo_repository_git_username=
bamboo_planRepository_1_previousRevision=788a0846a3b6b7af4df59eebcd259d6fba661e9e
bamboo_capability_os_family=unix
bamboo_planRepository_branchDisplayName=master
bamboo_capability_system_builder_maven_Artifactory_Maven_3_6=/opt/maven-3.6
bamboo_capability_system_builder_maven_Artifactory_Maven_3_5=/opt/maven-3.5
bamboo_capability_system_builder_maven_Artifactory_Maven_3_3=/opt/maven-3.3
bamboo_capability_system_builder_maven_Artifactory_Maven_3_2=/opt/maven-3.2
bamboo_repository_250445851_branch_name=master
bamboo_s3_properties=/home/bamboo/tools/s3.properties
bamboo_capability_system_builder_maven_Artifactory_Maven_3_1=/opt/maven-3.1
bamboo_artifactory_override_deploy_repo=libs-snapshot-local
bamboo_capability_system_builder_maven_Artifactory_Maven_3_0=/opt/maven-3.0
bamboo_plan_storageTag=plan-250249269
bamboo_bintray_username_password=********
bamboo_repository_git_repositoryUrl=git://github.com/SpringSource/spring-security-oauth.git
bamboo_working_directory=/opt/bamboo-home/xml-data/build-dir/SECOAUTH-B21XS5C-JOB1
bamboo_planRepository_1_repositoryUrl=git://github.com/SpringSource/spring-security-oauth.git
bamboo_capability_system_jdk_JDK_1_8=/opt/jdk-8
bamboo_artifactory_override_deployer_password=********
bamboo_capability_system_jdk_JDK_1_9=/opt/jdk-9
bamboo_capability_system_jdk_JDK_1_6=/opt/jdk-6
bamboo_sonatype_password=********
bamboo_capability_system_jdk_JDK_1_7=/opt/jdk-7
bamboo_sonar_ip=10.194.6.9
bamboo_ge_cache_password=********
PATH=/opt/jdk-8/bin:/bin:/home/bamboo/bin:/usr/local/sbin:/usr/local/bin:/usr/sbin:/usr/bin:/sbin:/bin:/usr/games:/usr/local/games:/snap/bin:/home/bamboo/bin:/usr/local/bin
07-Nov-2019 19:06:12 [INFO] Scanning for projects...
07-Nov-2019 19:06:12 [INFO] Downloading: https://repo.maven.apache.org/maven2/joda-time/joda-time/maven-metadata.xml
07-Nov-2019 19:06:12 [INFO] Downloaded: https://repo.maven.apache.org/maven2/joda-time/joda-time/maven-metadata.xml (2 KB at 7.7 KB/sec)
07-Nov-2019 19:06:13 [INFO] ------------------------------------------------------------------------
07-Nov-2019 19:06:13 [INFO] Reactor Build Order:
07-Nov-2019 19:06:13 [INFO]
07-Nov-2019 19:06:13 [INFO] OAuth for Spring Security
07-Nov-2019 19:06:13 [INFO] OAuth 1(a) for Spring Security
07-Nov-2019 19:06:13 [INFO] OAuth2 for Spring Security
07-Nov-2019 19:06:13 [INFO] spring-oauth2-tests
07-Nov-2019 19:06:13 [INFO] spring-oauth2-tests-common
07-Nov-2019 19:06:13 [INFO] spring-oauth2-tests-vanilla
07-Nov-2019 19:06:13 [INFO] spring-oauth2-tests-mappings
07-Nov-2019 19:06:13 [INFO] spring-oauth2-tests-form
07-Nov-2019 19:06:13 [INFO] spring-oauth2-tests-jwt
07-Nov-2019 19:06:13 [INFO] spring-oauth2-tests-approval
07-Nov-2019 19:06:13 [INFO] spring-oauth2-tests-jdbc
07-Nov-2019 19:06:13 [INFO] spring-oauth2-tests-jpa
07-Nov-2019 19:06:13 [INFO] spring-oauth2-tests-jaxb
07-Nov-2019 19:06:13 [INFO] spring-oauth-tests-custom-grant
07-Nov-2019 19:06:13 [INFO] spring-oauth2-tests-multi
07-Nov-2019 19:06:13 [INFO] spring-oauth2-tests-client
07-Nov-2019 19:06:13 [INFO] spring-oauth2-tests-resource
07-Nov-2019 19:06:13 [INFO] spring-oauth2-tests-custom-authentication
07-Nov-2019 19:06:13 [INFO] spring-oauth2-tests-xml
07-Nov-2019 19:06:13 [INFO] spring-oauth2-tests-xml-common
07-Nov-2019 19:06:13 [INFO] spring-oauth2-tests-xml-vanilla
07-Nov-2019 19:06:13 [INFO] spring-oauth2-tests-xml-mappings
07-Nov-2019 19:06:13 [INFO] spring-oauth2-tests-xml-form
07-Nov-2019 19:06:13 [INFO] spring-oauth2-tests-xml-jwt
07-Nov-2019 19:06:13 [INFO] spring-oauth2-tests-xml-approval
07-Nov-2019 19:06:13 [INFO] spring-oauth2-tests-xml-jdbc
07-Nov-2019 19:06:13 [INFO] spring-oauth2-tests-xml-client
07-Nov-2019 19:06:13 [INFO] OAuth for Spring Security - Integration Tests
07-Nov-2019 19:06:13 [INFO] OAuth for Spring Security - Sparklr (OAuth 1 Provider Example)
07-Nov-2019 19:06:13 [INFO] OAuth for Spring Security - Tonr (OAuth 1 Consumer Example)
07-Nov-2019 19:06:13 [INFO] OAuth for Spring Security - Sparklr2 (OAuth 2 Provider Example)
07-Nov-2019 19:06:13 [INFO] OAuth for Spring Security - Tonr2 (OAuth 2 Client Example)
07-Nov-2019 19:06:13 [INFO] OAuth for Spring Security - Samples
07-Nov-2019 19:06:13 [INFO]                                                                         
07-Nov-2019 19:06:13 [INFO] ------------------------------------------------------------------------
07-Nov-2019 19:06:13 [INFO] Building OAuth for Spring Security 2.4.0.BUILD-SNAPSHOT
07-Nov-2019 19:06:13 [INFO] ------------------------------------------------------------------------
07-Nov-2019 19:06:13 [INFO] Downloading: https://repo.maven.apache.org/maven2/org/apache/maven/plugins/maven-surefire-plugin/maven-metadata.xml
07-Nov-2019 19:06:13 [INFO] Downloaded: https://repo.maven.apache.org/maven2/org/apache/maven/plugins/maven-surefire-plugin/maven-metadata.xml (2 KB at 157.9 KB/sec)
07-Nov-2019 19:06:13 [INFO]
07-Nov-2019 19:06:13 [INFO] --- maven-clean-plugin:2.5:clean (default-clean) @ spring-security-oauth-parent ---
07-Nov-2019 19:06:13 [INFO]
07-Nov-2019 19:06:13 [INFO] >>> maven-source-plugin:2.1.2:jar (attach-sources) > generate-sources @ spring-security-oauth-parent >>>
07-Nov-2019 19:06:13 [INFO]
07-Nov-2019 19:06:13 [INFO] <<< maven-source-plugin:2.1.2:jar (attach-sources) < generate-sources @ spring-security-oauth-parent <<<
07-Nov-2019 19:06:13 [INFO]
07-Nov-2019 19:06:13 [INFO] --- maven-source-plugin:2.1.2:jar (attach-sources) @ spring-security-oauth-parent ---
07-Nov-2019 19:06:13 [INFO]
07-Nov-2019 19:06:13 [INFO] --- maven-javadoc-plugin:2.9.1:jar (javadoc) @ spring-security-oauth-parent ---
07-Nov-2019 19:06:14 [INFO] Not executing Javadoc as the project is not a Java classpath-capable package
07-Nov-2019 19:06:14 [INFO]
07-Nov-2019 19:06:14 [INFO] --- maven-checkstyle-plugin:3.1.0:check (default) @ spring-security-oauth-parent ---
07-Nov-2019 19:06:14 [INFO]                                                                         
07-Nov-2019 19:06:14 [INFO] ------------------------------------------------------------------------
07-Nov-2019 19:06:14 [INFO] Building OAuth 1(a) for Spring Security 2.4.0.BUILD-SNAPSHOT
07-Nov-2019 19:06:14 [INFO] ------------------------------------------------------------------------
07-Nov-2019 19:06:14 [INFO]
07-Nov-2019 19:06:14 [INFO] --- maven-clean-plugin:2.5:clean (default-clean) @ spring-security-oauth ---
07-Nov-2019 19:06:14 [INFO]
07-Nov-2019 19:06:14 [INFO] --- maven-resources-plugin:2.6:resources (default-resources) @ spring-security-oauth ---
07-Nov-2019 19:06:14 [INFO] Using 'UTF-8' encoding to copy filtered resources.
07-Nov-2019 19:06:14 [INFO] Copying 3 resources
07-Nov-2019 19:06:14 [INFO]
07-Nov-2019 19:06:14 [INFO] --- maven-compiler-plugin:2.3.2:compile (default-compile) @ spring-security-oauth ---
07-Nov-2019 19:06:14 [INFO] Compiling 108 source files to /opt/bamboo-home/xml-data/build-dir/SECOAUTH-B21XS5C-JOB1/spring-security-oauth/target/classes
07-Nov-2019 19:06:15 [INFO] -------------------------------------------------------------
07-Nov-2019 19:06:15 [WARNING] COMPILATION WARNING :
07-Nov-2019 19:06:15 [INFO] -------------------------------------------------------------
07-Nov-2019 19:06:15 [WARNING]  class PlainTextSignatureMethod
07-Nov-2019 19:06:15 /opt/bamboo-home/xml-data/build-dir/SECOAUTH-B21XS5C-JOB1/spring-security-oauth/src/main/java/org/springframework/security/oauth/consumer/net/OAuthOverHttpURLStreamHandler.java:[36,76] Handler is internal proprietary API and may be removed in a future release
07-Nov-2019 19:06:15 [WARNING] /opt/bamboo-home/xml-data/build-dir/SECOAUTH-B21XS5C-JOB1/spring-security-oauth/src/main/java/org/springframework/security/oauth/consumer/net/OAuthOverHttpsURLStreamHandler.java:[36,78] Handler is internal proprietary API and may be removed in a future release
07-Nov-2019 19:06:15 [INFO] 2 warnings
07-Nov-2019 19:06:15 [INFO] -------------------------------------------------------------
07-Nov-2019 19:06:15 [INFO] -------------------------------------------------------------
07-Nov-2019 19:06:15 [ERROR] COMPILATION ERROR :
07-Nov-2019 19:06:15 [INFO] -------------------------------------------------------------
07-Nov-2019 19:06:15 [ERROR] /opt/bamboo-home/xml-data/build-dir/SECOAUTH-B21XS5C-JOB1/spring-security-oauth/src/main/java/org/springframework/security/oauth/common/signature/CoreOAuthSignatureMethodFactory.java:[19,59] error: package org.springframework.security.authentication.encoding does not exist
07-Nov-2019 19:06:15 [ERROR] /opt/bamboo-home/xml-data/build-dir/SECOAUTH-B21XS5C-JOB1/spring-security-oauth/src/main/java/org/springframework/security/oauth/common/signature/CoreOAuthSignatureMethodFactory.java:[40,10] error: cannot find symbol
07-Nov-2019 19:06:15 [ERROR]  class CoreOAuthSignatureMethodFactory
07-Nov-2019 19:06:15 /opt/bamboo-home/xml-data/build-dir/SECOAUTH-B21XS5C-JOB1/spring-security-oauth/src/main/java/org/springframework/security/oauth/common/signature/CoreOAuthSignatureMethodFactory.java:[174,9] error: cannot find symbol
07-Nov-2019 19:06:15 [ERROR]  class CoreOAuthSignatureMethodFactory
07-Nov-2019 19:06:15 /opt/bamboo-home/xml-data/build-dir/SECOAUTH-B21XS5C-JOB1/spring-security-oauth/src/main/java/org/springframework/security/oauth/common/signature/CoreOAuthSignatureMethodFactory.java:[183,42] error: cannot find symbol
07-Nov-2019 19:06:15 [ERROR]  class CoreOAuthSignatureMethodFactory
07-Nov-2019 19:06:15 /opt/bamboo-home/xml-data/build-dir/SECOAUTH-B21XS5C-JOB1/spring-security-oauth/src/main/java/org/springframework/security/oauth/common/signature/PlainTextSignatureMethod.java:[19,59] error: package org.springframework.security.authentication.encoding does not exist
07-Nov-2019 19:06:15 [ERROR] /opt/bamboo-home/xml-data/build-dir/SECOAUTH-B21XS5C-JOB1/spring-security-oauth/src/main/java/org/springframework/security/oauth/common/signature/PlainTextSignatureMethod.java:[34,16] error: cannot find symbol
07-Nov-2019 19:06:15 [ERROR]  class PlainTextSignatureMethod
07-Nov-2019 19:06:15 /opt/bamboo-home/xml-data/build-dir/SECOAUTH-B21XS5C-JOB1/spring-security-oauth/src/main/java/org/springframework/security/oauth/common/signature/PlainTextSignatureMethod.java:[53,49] error: cannot find symbol
07-Nov-2019 19:06:15 [INFO] 7 errors
07-Nov-2019 19:06:15 [INFO] -------------------------------------------------------------
07-Nov-2019 19:06:15 [INFO] ------------------------------------------------------------------------
07-Nov-2019 19:06:15 [INFO] Reactor Summary:
07-Nov-2019 19:06:15 [INFO]
07-Nov-2019 19:06:15 [INFO] OAuth for Spring Security .......................... SUCCESS [  1.033 s]
07-Nov-2019 19:06:15 [INFO] OAuth 1(a) for Spring Security ..................... FAILURE [  0.753 s]
07-Nov-2019 19:06:15 [INFO] OAuth2 for Spring Security ......................... SKIPPED
07-Nov-2019 19:06:15 [INFO] spring-oauth2-tests ................................ SKIPPED
07-Nov-2019 19:06:15 [INFO] spring-oauth2-tests-common ......................... SKIPPED
07-Nov-2019 19:06:15 [INFO] spring-oauth2-tests-vanilla ........................ SKIPPED
07-Nov-2019 19:06:15 [INFO] spring-oauth2-tests-mappings ....................... SKIPPED
07-Nov-2019 19:06:15 [INFO] spring-oauth2-tests-form ........................... SKIPPED
07-Nov-2019 19:06:15 [INFO] spring-oauth2-tests-jwt ............................ SKIPPED
07-Nov-2019 19:06:15 [INFO] spring-oauth2-tests-approval ....................... SKIPPED
07-Nov-2019 19:06:15 [INFO] spring-oauth2-tests-jdbc ........................... SKIPPED
07-Nov-2019 19:06:15 [INFO] spring-oauth2-tests-jpa ............................ SKIPPED
07-Nov-2019 19:06:15 [INFO] spring-oauth2-tests-jaxb ........................... SKIPPED
07-Nov-2019 19:06:15 [INFO] spring-oauth-tests-custom-grant .................... SKIPPED
07-Nov-2019 19:06:15 [INFO] spring-oauth2-tests-multi .......................... SKIPPED
07-Nov-2019 19:06:15 [INFO] spring-oauth2-tests-client ......................... SKIPPED
07-Nov-2019 19:06:15 [INFO] spring-oauth2-tests-resource ....................... SKIPPED
07-Nov-2019 19:06:15 [INFO] spring-oauth2-tests-custom-authentication .......... SKIPPED
07-Nov-2019 19:06:15 [INFO] spring-oauth2-tests-xml ............................ SKIPPED
07-Nov-2019 19:06:15 [INFO] spring-oauth2-tests-xml-common ..................... SKIPPED
07-Nov-2019 19:06:15 [INFO] spring-oauth2-tests-xml-vanilla .................... SKIPPED
07-Nov-2019 19:06:15 [INFO] spring-oauth2-tests-xml-mappings ................... SKIPPED
07-Nov-2019 19:06:15 [INFO] spring-oauth2-tests-xml-form ....................... SKIPPED
07-Nov-2019 19:06:15 [INFO] spring-oauth2-tests-xml-jwt ........................ SKIPPED
07-Nov-2019 19:06:15 [INFO] spring-oauth2-tests-xml-approval ................... SKIPPED
07-Nov-2019 19:06:15 [INFO] spring-oauth2-tests-xml-jdbc ....................... SKIPPED
07-Nov-2019 19:06:15 [INFO] spring-oauth2-tests-xml-client ..................... SKIPPED
07-Nov-2019 19:06:15 [INFO] OAuth for Spring Security - Integration Tests ...... SKIPPED
07-Nov-2019 19:06:15 [INFO] OAuth for Spring Security - Sparklr (OAuth 1 Provider Example) SKIPPED
07-Nov-2019 19:06:15 [INFO] OAuth for Spring Security - Tonr (OAuth 1 Consumer Example) SKIPPED
07-Nov-2019 19:06:15 [INFO] OAuth for Spring Security - Sparklr2 (OAuth 2 Provider Example) SKIPPED
07-Nov-2019 19:06:15 [INFO] OAuth for Spring Security - Tonr2 (OAuth 2 Client Example) SKIPPED
07-Nov-2019 19:06:15 [INFO] OAuth for Spring Security - Samples ................ SKIPPED
07-Nov-2019 19:06:15 [INFO] ------------------------------------------------------------------------
07-Nov-2019 19:06:15 [INFO] BUILD FAILURE
07-Nov-2019 19:06:15 [INFO] ------------------------------------------------------------------------
07-Nov-2019 19:06:15 [INFO] Total time: 3.020 s
07-Nov-2019 19:06:15 [INFO] Finished at: 2019-11-07T19:06:15+00:00
07-Nov-2019 19:06:15 [INFO] Final Memory: 57M/493M
07-Nov-2019 19:06:15 [INFO] ------------------------------------------------------------------------
07-Nov-2019 19:06:15 [ERROR] Failed to execute goal org.apache.maven.plugins:maven-compiler-plugin:2.3.2:compile (default-compile) on project spring-security-oauth: Compilation failure: Compilation failure:
07-Nov-2019 19:06:15 [ERROR] /opt/bamboo-home/xml-data/build-dir/SECOAUTH-B21XS5C-JOB1/spring-security-oauth/src/main/java/org/springframework/security/oauth/common/signature/CoreOAuthSignatureMethodFactory.java:[19,59] error: package org.springframework.security.authentication.encoding does not exist
07-Nov-2019 19:06:15 [ERROR] /opt/bamboo-home/xml-data/build-dir/SECOAUTH-B21XS5C-JOB1/spring-security-oauth/src/main/java/org/springframework/security/oauth/common/signature/CoreOAuthSignatureMethodFactory.java:[40,10] error: cannot find symbol
07-Nov-2019 19:06:15 [ERROR] class CoreOAuthSignatureMethodFactory
07-Nov-2019 19:06:15 [ERROR] /opt/bamboo-home/xml-data/build-dir/SECOAUTH-B21XS5C-JOB1/spring-security-oauth/src/main/java/org/springframework/security/oauth/common/signature/CoreOAuthSignatureMethodFactory.java:[174,9] error: cannot find symbol
07-Nov-2019 19:06:15 [ERROR] class CoreOAuthSignatureMethodFactory
07-Nov-2019 19:06:15 [ERROR] /opt/bamboo-home/xml-data/build-dir/SECOAUTH-B21XS5C-JOB1/spring-security-oauth/src/main/java/org/springframework/security/oauth/common/signature/CoreOAuthSignatureMethodFactory.java:[183,42] error: cannot find symbol
07-Nov-2019 19:06:15 [ERROR] class CoreOAuthSignatureMethodFactory
07-Nov-2019 19:06:15 [ERROR] /opt/bamboo-home/xml-data/build-dir/SECOAUTH-B21XS5C-JOB1/spring-security-oauth/src/main/java/org/springframework/security/oauth/common/signature/PlainTextSignatureMethod.java:[19,59] error: package org.springframework.security.authentication.encoding does not exist
07-Nov-2019 19:06:15 [ERROR] /opt/bamboo-home/xml-data/build-dir/SECOAUTH-B21XS5C-JOB1/spring-security-oauth/src/main/java/org/springframework/security/oauth/common/signature/PlainTextSignatureMethod.java:[34,16] error: cannot find symbol
07-Nov-2019 19:06:15 [ERROR] class PlainTextSignatureMethod
07-Nov-2019 19:06:15 [ERROR] /opt/bamboo-home/xml-data/build-dir/SECOAUTH-B21XS5C-JOB1/spring-security-oauth/src/main/java/org/springframework/security/oauth/common/signature/PlainTextSignatureMethod.java:[53,49] error: cannot find symbol
07-Nov-2019 19:06:15 [ERROR] -> [Help 1]
07-Nov-2019 19:06:15 [ERROR]
07-Nov-2019 19:06:15 [ERROR] To see the full stack trace of the errors, re-run Maven with the -e switch.
07-Nov-2019 19:06:15 [ERROR] Re-run Maven using the -X switch to enable full debug logging.
07-Nov-2019 19:06:15 [ERROR]
07-Nov-2019 19:06:15 [ERROR] For more information about the errors and possible solutions, please read the following articles:
07-Nov-2019 19:06:15 [ERROR] [Help 1] http://cwiki.apache.org/confluence/display/MAVEN/MojoFailureException
07-Nov-2019 19:06:15 [ERROR]
07-Nov-2019 19:06:15 [ERROR] After correcting the problems, you can resume the build with the command
07-Nov-2019 19:06:15 [ERROR]   mvn <goals> -rf :spring-security-oauth
07-Nov-2019 19:06:15 Failing task since return code of [/opt/maven-3.3/bin/mvn --batch-mode -Djava.io.tmpdir=/tmp/SECOAUTH-B21XS5C-JOB1 -U clean verify -P spring5] was 1 while expected 0
07-Nov-2019 19:06:15 Parsing test results under /opt/bamboo-home/xml-data/build-dir/SECOAUTH-B21XS5C-JOB1...
07-Nov-2019 19:06:15 Finished task 'Build' with result: Failed
07-Nov-2019 19:06:15 Running post build plugin 'Docker Container Cleanup'
07-Nov-2019 19:06:15 Running post build plugin 'NCover Results Collector'
07-Nov-2019 19:06:15 Running post build plugin 'Artifactory Release Management Staging'
07-Nov-2019 19:06:15 Running post build plugin 'Artifactory Build Info Copier'
07-Nov-2019 19:06:15 Running post build plugin 'Artifactory Gradle Properties Info Copier'
07-Nov-2019 19:06:15 Running post build plugin 'Clover Results Collector'
07-Nov-2019 19:06:15 Running post build plugin 'npm Cache Cleanup'
07-Nov-2019 19:06:15 Running post build plugin 'Artifact Copier'
07-Nov-2019 19:06:15 Successfully removed working directory at '/opt/bamboo-home/xml-data/build-dir/SECOAUTH-B21XS5C-JOB1'
07-Nov-2019 19:06:15 Finalising the build...
07-Nov-2019 19:06:15 Stopping timer.
07-Nov-2019 19:06:15 Build SECOAUTH-B21XS5C-JOB1-956 completed.
07-Nov-2019 19:06:15 Running on server: post build plugin 'NCover Results Collector'
07-Nov-2019 19:06:15 Running on server: post build plugin 'Build Hanging Detection Configuration'
07-Nov-2019 19:06:15 Running on server: post build plugin 'Bamboo project link creator'
07-Nov-2019 19:06:15 Running on server: post build plugin 'Clover Delta Calculator'
07-Nov-2019 19:06:15 Running on server: post build plugin 'Maven Dependencies Postprocessor'
07-Nov-2019 19:06:15 All post build plugins have finished
07-Nov-2019 19:06:15 Generating build results summary...
07-Nov-2019 19:06:15 Saving build results to disk...
07-Nov-2019 19:06:15 Logging substituted variables...
07-Nov-2019 19:06:15 Indexing build results...
07-Nov-2019 19:06:15 Finished building SECOAUTH-B21XS5C-JOB1-956.