Build: #3278 failed Scheduled

Logs

The following logs have been generated by the jobs in this plan.
  • Expand all
  • Collapse all
Job Logs
Collapse Default Job Default Stage Download or View
14-Jan-2019 04:00:12 Downloaded: http://repo.spring.io/libs-snapshot/org/springframework/spring-context/4.0.9.RELEASE/spring-context-4.0.9.RELEASE.jar (956 KB at 669.8 KB/sec)
14-Jan-2019 04:00:12 Downloading: http://repo.spring.io/libs-snapshot/com/fasterxml/jackson/core/jackson-core/2.3.1/jackson-core-2.3.1.jar
14-Jan-2019 04:00:12 Downloaded: http://repo.spring.io/libs-snapshot/com/fasterxml/jackson/core/jackson-annotations/2.3.0/jackson-annotations-2.3.0.jar (35 KB at 118.1 KB/sec)
14-Jan-2019 04:00:12 Downloading: http://repo.spring.io/libs-snapshot/org/webjars/bootstrap/3.0.3/bootstrap-3.0.3.jar
14-Jan-2019 04:00:12 Downloaded: http://repo.spring.io/libs-snapshot/org/springframework/security/spring-security-core/3.2.10.RELEASE/spring-security-core-3.2.10.RELEASE.jar (361 KB at 814.8 KB/sec)
14-Jan-2019 04:00:12 Downloading: http://repo.spring.io/libs-snapshot/org/webjars/jquery/1.9.0/jquery-1.9.0.jar
14-Jan-2019 04:00:13 Downloaded: http://repo.spring.io/libs-snapshot/org/webjars/jquery/1.9.0/jquery-1.9.0.jar (113 KB at 383.0 KB/sec)
14-Jan-2019 04:00:13 Downloaded: http://repo.spring.io/libs-snapshot/com/fasterxml/jackson/core/jackson-core/2.3.1/jackson-core-2.3.1.jar (194 KB at 461.4 KB/sec)
14-Jan-2019 04:00:13 Downloaded: http://repo.spring.io/libs-snapshot/org/springframework/security/spring-security-web/3.2.10.RELEASE/spring-security-web-3.2.10.RELEASE.jar (339 KB at 452.4 KB/sec)
14-Jan-2019 04:00:13 Downloaded: http://repo.spring.io/libs-snapshot/org/webjars/bootstrap/3.0.3/bootstrap-3.0.3.jar (197 KB at 425.7 KB/sec)
14-Jan-2019 04:00:14 Downloaded: http://repo.spring.io/libs-snapshot/com/fasterxml/jackson/core/jackson-databind/2.3.1/jackson-databind-2.3.1.jar (893 KB at 620.9 KB/sec)
14-Jan-2019 04:00:14 [INFO] ------------------------------------------------------------------------
14-Jan-2019 04:00:14 [INFO] BUILD FAILURE
14-Jan-2019 04:00:14 [INFO] ------------------------------------------------------------------------
14-Jan-2019 04:00:14 [INFO] Total time: 11.001s
14-Jan-2019 04:00:14 [INFO] Finished at: Mon Jan 14 04:00:14 UTC 2019
14-Jan-2019 04:00:14 [INFO] Final Memory: 10M/234M
14-Jan-2019 04:00:14 [INFO] ------------------------------------------------------------------------
14-Jan-2019 04:00:14 [ERROR] Failed to execute goal on project sparklr2: Could not resolve dependencies for project org.springframework.security.oauth:sparklr2:war:2.3.5.BUILD-SNAPSHOT: Could not find artifact org.springframework.security.oauth:spring-security-oauth2:jar:2.3.5.BUILD-SNAPSHOT in spring (http://repo.spring.io/libs-snapshot) -> [Help 1]
14-Jan-2019 04:00:14 [ERROR]
14-Jan-2019 04:00:14 [ERROR] To see the full stack trace of the errors, re-run Maven with the -e switch.
14-Jan-2019 04:00:14 [ERROR] Re-run Maven using the -X switch to enable full debug logging.
14-Jan-2019 04:00:14 [ERROR]
14-Jan-2019 04:00:14 [ERROR] For more information about the errors and possible solutions, please read the following articles:
14-Jan-2019 04:00:14 [ERROR] [Help 1] http://cwiki.apache.org/confluence/display/MAVEN/DependencyResolutionException