Build: #3278 failed

Job: Default Job failed

Stages & jobs

  1. Default Stage

Build log

The build generated 266 lines of output. Download or view full build log

14-Jan-2019 04:00:00 Build Spring Security OAuth - Spring Security OAuth - Integration - Default Job #3278 (SECOAUTH-INTEGRATION-JOB1-3278) started building on agent bamboo-03.af.pivotal.io
14-Jan-2019 04:00:00 Remote agent on host bamboo-03.af.pivotal.io
14-Jan-2019 04:00:00 Build working directory is /opt/bamboo-home/xml-data/build-dir/SECOAUTH-INTEGRATION-JOB1
14-Jan-2019 04:00:00 Executing build Spring Security OAuth - Spring Security OAuth - Integration - Default Job #3278 (SECOAUTH-INTEGRATION-JOB1-3278)
14-Jan-2019 04:00:00 Starting task 'Checkout Default Repository' of type 'com.atlassian.bamboo.plugins.vcs:task.vcs.checkout'
14-Jan-2019 04:00:00 Build always requires a clean checkout
14-Jan-2019 04:00:00 Cleaning build directory '/opt/bamboo-home/xml-data/build-dir/SECOAUTH-INTEGRATION-JOB1'
14-Jan-2019 04:00:00 Checking out into /opt/bamboo-home/xml-data/build-dir/SECOAUTH-INTEGRATION-JOB1
14-Jan-2019 04:00:00 Updating source code to revision: 4aa19ade695214257c2c1c2263c99750bc56df2a
14-Jan-2019 04:00:00 Creating local git repository in '/opt/bamboo-home/xml-data/build-dir/SECOAUTH-INTEGRATION-JOB1/.git'.
14-Jan-2019 04:00:00 Initialized empty Git repository in /opt/bamboo-home/xml-data/build-dir/SECOAUTH-INTEGRATION-JOB1/.git/
14-Jan-2019 04:00:01 Fetching 'refs/heads/master' from 'git://github.com/SpringSource/spring-security-oauth.git'. Will try to do a shallow fetch.
14-Jan-2019 04:00:02 From git://github.com/SpringSource/spring-security-oauth
14-Jan-2019 04:00:02 * [new branch]      master     -> master
14-Jan-2019 04:00:02 Checking out revision 4aa19ade695214257c2c1c2263c99750bc56df2a.
14-Jan-2019 04:00:02 Already on 'master'
14-Jan-2019 04:00:02 Updated source code to revision: 4aa19ade695214257c2c1c2263c99750bc56df2a
14-Jan-2019 04:00:02 Finished task 'Checkout Default Repository' with result: Success
14-Jan-2019 04:00:02 Running pre-build action: Artifactory Release Staging
14-Jan-2019 04:00:02 Running pre-build action: VCS Version Collector
14-Jan-2019 04:00:02 Starting task 'Integration tests for sparklr2' of type 'com.atlassian.bamboo.plugins.maven:task.builder.mvn3'
14-Jan-2019 04:00:02
Beginning to execute external process for build 'Spring Security OAuth - Spring Security OAuth - Integration - Default Job #3278 (SECOAUTH-INTEGRATION-JOB1-3278)'
... running command line:
/opt/maven-3.0/bin/mvn --batch-mode -Djava.io.tmpdir=/tmp/SECOAUTH-INTEGRATION-JOB1 clean tomcat7:run -Dmaven.tomcat.fork=true test -P integration
... in: /opt/bamboo-home/xml-data/build-dir/SECOAUTH-INTEGRATION-JOB1/samples/oauth2/sparklr
... using extra environment variables:
bamboo_planRepository_1_branch=master
bamboo_********_username_password=********
bamboo_signing_store_password=********
bamboo_capability_system_builder_ant_Ant_1_9=/opt/ant-1.9
bamboo_capability_system_builder_ant_Ant_1_8=/opt/ant-1.8
bamboo_planRepository_1_branchDisplayName=master
bamboo_capability_system_jdk_OpenJDK_7u181=/opt/openjdk-7
bamboo_repository_revision_number=4aa19ade695214257c2c1c2263c99750bc56df2a
MAVEN2_HOME=/opt/maven-3.0
bamboo_capability_system_builder_node_Node_js_6=/usr/bin/node
bamboo_RIAK_BIN=/usr/sbin/riak
bamboo_buildKey=SECOAUTH-INTEGRATION-JOB1
bamboo_sonar_token_password=********
bamboo_shortJobName=Default Job
bamboo_capability_system_builder_gradle___gradlew=./gradlew
bamboo_buildResultsUrl=https://build.spring.io/browse/SECOAUTH-INTEGRATION-JOB1-3278
bamboo_capability_system_builder_mvn3_Maven_3_3=/opt/maven-3.3
bamboo_capability_system_builder_mvn3_Maven_3_2=/opt/maven-3.2
bamboo_capability_system_builder_mvn3_Maven_3_1=/opt/maven-3.1
bamboo_planRepository_repositoryUrl=git://github.com/SpringSource/spring-security-oauth.git
bamboo_agentId=208568326
bamboo_capability_system_builder_mvn3_Maven_3_5=/opt/maven-3.5
bamboo_capability_system_builder_mvn3_Maven_3_0=/opt/maven-3.0
bamboo_planRepository_revision=4aa19ade695214257c2c1c2263c99750bc56df2a
bamboo_planRepository_previousRevision=4aa19ade695214257c2c1c2263c99750bc56df2a
bamboo_capability_remote_build=true
bamboo_repository_branch_name=master
bamboo_scdf_acceptance_tests_password=********
JAVA_HOME=/opt/jdk-7
bamboo_repository_94273668_branch_name=master
bamboo_capability_Agent=bamboo-03.af.pivotal.io
bamboo_planRepository_branch=master
bamboo_planRepository_1_type=gitv2
bamboo_planRepository_branchName=master
bamboo_repository_94273668_revision_number=4aa19ade695214257c2c1c2263c99750bc56df2a
bamboo_sonar_password=********
bamboo_hg_cache_directory=/opt/bamboo-home/xml-data/build-dir/_hg-repositories-cache
bamboo_planRepository_1_username=
bamboo_planRepository_type=gitv2
bamboo_git_cache_directory=/opt/bamboo-home/xml-data/build-dir/_git-repositories-cache
useMavenReturnCode=false
bamboo_artifactory_username=buildmaster
bamboo_tmp_directory=/opt/bamboo-home/temp
bamboo_planKey=SECOAUTH-INTEGRATION
bamboo_planRepository_username=
bamboo_JDK8_HOME=/opt/jdk-8
bamboo_planRepository_1_branchName=master
bamboo_sonar_version=5.6.3
bamboo_capability_system_jdk_JDK_1_11=/opt/jdk-11
bamboo_resultsUrl=https://build.spring.io/browse/SECOAUTH-INTEGRATION-JOB1-3278
bamboo_capability_system_jdk_JDK_1_10=/opt/jdk-10
bamboo_build_working_directory=/opt/bamboo-home/xml-data/build-dir/SECOAUTH-INTEGRATION-JOB1
bamboo_planRepository_1_name=Plan Repository
bamboo_capability_system_os=ubuntu1604
bamboo_repository_94273668_name=Plan Repository
bamboo_nexusPush_stagingProfile=buildmaster
bamboo_shortPlanName=Spring Security OAuth - Integration
bamboo_planRepository_name=Plan Repository
bamboo_repository_94273668_git_branch=master
bamboo_buildNumber=3278
bamboo_planName=Spring Security OAuth - Spring Security OAuth - Integration
bamboo_JDK7_HOME=/opt/jdk-7
bamboo_shortPlanKey=INTEGRATION
bamboo_shortJobKey=JOB1
bamboo_artifactory_password=********
bamboo_buildTimeStamp=2019-01-14T04:00:00.542Z
bamboo_repository_previous_revision_number=4aa19ade695214257c2c1c2263c99750bc56df2a
bamboo_sonar_username=buildmaster
bamboo_********_password=********
M2_HOME=/opt/maven-3.0
bamboo_repository_git_branch=master
bamboo_buildResultKey=SECOAUTH-INTEGRATION-JOB1-3278
bamboo_nexusPush_close=true
bamboo_buildPlanName=Spring Security OAuth - Spring Security OAuth - Integration - Default Job
bamboo_planRepository_1_revision=4aa19ade695214257c2c1c2263c99750bc56df2a
bamboo_repository_94273668_previous_revision_number=4aa19ade695214257c2c1c2263c99750bc56df2a
bamboo_repository_name=Plan Repository
bamboo_signing_key_password=********
bamboo_buildFailed=false
bamboo_repository_94273668_git_repositoryUrl=git://github.com/SpringSource/spring-security-oauth.git
bamboo_capability_system_docker_executable=/usr/bin/docker
bamboo_capability_system_builder_groovy_Groovy_2_4=/opt/groovy-2.4
bamboo_capability_system_builder_command_Bash=/bin/bash
bamboo_agentWorkingDirectory=/opt/bamboo-home/xml-data/build-dir
bamboo_capability_system_git_executable=/usr/bin/git
bamboo_repository_git_username=
bamboo_planRepository_1_previousRevision=4aa19ade695214257c2c1c2263c99750bc56df2a
bamboo_capability_os_family=unix
bamboo_planRepository_branchDisplayName=master
bamboo_capability_system_builder_maven_Artifactory_Maven_3_5=/opt/maven-3.5
bamboo_capability_system_builder_maven_Artifactory_Maven_3_3=/opt/maven-3.3
bamboo_capability_system_builder_maven_Artifactory_Maven_3_2=/opt/maven-3.2
bamboo_s3_properties=/home/bamboo/tools/s3.properties
bamboo_capability_system_builder_maven_Artifactory_Maven_3_1=/opt/maven-3.1
bamboo_capability_system_builder_maven_Artifactory_Maven_3_0=/opt/maven-3.0
bamboo_plan_storageTag=SECOAUTH-INTEGRATION
bamboo_repository_git_repositoryUrl=git://github.com/SpringSource/spring-security-oauth.git
bamboo_working_directory=/opt/bamboo-home/xml-data/build-dir/SECOAUTH-INTEGRATION-JOB1
bamboo_planRepository_1_repositoryUrl=git://github.com/SpringSource/spring-security-oauth.git
bamboo_capability_system_jdk_JDK_1_8=/opt/jdk-8
bamboo_capability_system_jdk_JDK_1_9=/opt/jdk-9
bamboo_capability_system_jdk_JDK_1_6=/opt/jdk-6
bamboo_capability_system_jdk_JDK_1_7=/opt/jdk-7
bamboo_sonar_ip=10.194.6.9
bamboo_repository_94273668_git_username=
PATH=/opt/jdk-7/bin:/bin:/home/bamboo/.rvm/gems/ruby-2.3.0/bin:/home/bamboo/.rvm/gems/ruby-2.3.0@global/bin:/home/bamboo/.rvm/rubies/ruby-2.3.0/bin:/home/bamboo/bin:/usr/local/bin:/usr/bin:/bin:/usr/local/games:/usr/games:/snap/bin:/home/bamboo/bin:/usr/local/bin:/opt/ec2-api-tools/bin:/home/bamboo/.rvm/bin
14-Jan-2019 04:00:03 [INFO] Scanning for projects...
14-Jan-2019 04:00:03 Downloading: http://repo.maven.apache.org/maven2/org/springframework/build/aws-maven/5.0.0.RELEASE/aws-maven-5.0.0.RELEASE.pom
14-Jan-2019 04:00:03 Downloaded: http://repo.maven.apache.org/maven2/org/springframework/build/aws-maven/5.0.0.RELEASE/aws-maven-5.0.0.RELEASE.pom (5 KB at 42.9 KB/sec)
14-Jan-2019 04:00:03 Downloading: http://repo.maven.apache.org/maven2/ch/qos/logback/logback-classic/1.1.1/logback-classic-1.1.1.pom
14-Jan-2019 04:00:03 Downloaded: http://repo.maven.apache.org/maven2/ch/qos/logback/logback-classic/1.1.1/logback-classic-1.1.1.pom (12 KB at 772.7 KB/sec)
14-Jan-2019 04:00:03 Downloading: http://repo.maven.apache.org/maven2/ch/qos/logback/logback-parent/1.1.1/logback-parent-1.1.1.pom
14-Jan-2019 04:00:03 Downloaded: http://repo.maven.apache.org/maven2/ch/qos/logback/logback-parent/1.1.1/logback-parent-1.1.1.pom (15 KB at 970.1 KB/sec)
14-Jan-2019 04:00:03 Downloading: http://repo.maven.apache.org/maven2/ch/qos/logback/logback-core/1.1.1/logback-core-1.1.1.pom
14-Jan-2019 04:00:03 Downloaded: http://repo.maven.apache.org/maven2/ch/qos/logback/logback-core/1.1.1/logback-core-1.1.1.pom (5 KB at 376.7 KB/sec)
14-Jan-2019 04:00:03 Downloading: http://repo.maven.apache.org/maven2/org/slf4j/slf4j-api/1.7.6/slf4j-api-1.7.6.pom
14-Jan-2019 04:00:03 Downloaded: http://repo.maven.apache.org/maven2/org/slf4j/slf4j-api/1.7.6/slf4j-api-1.7.6.pom (3 KB at 218.8 KB/sec)
14-Jan-2019 04:00:03 Downloading: http://repo.maven.apache.org/maven2/org/slf4j/slf4j-parent/1.7.6/slf4j-parent-1.7.6.pom
14-Jan-2019 04:00:03 Downloaded: http://repo.maven.apache.org/maven2/org/slf4j/slf4j-parent/1.7.6/slf4j-parent-1.7.6.pom (12 KB at 775.2 KB/sec)
14-Jan-2019 04:00:03 Downloading: http://repo.maven.apache.org/maven2/com/amazonaws/aws-java-sdk/1.7.1/aws-java-sdk-1.7.1.pom
14-Jan-2019 04:00:03 Downloaded: http://repo.maven.apache.org/maven2/com/amazonaws/aws-java-sdk/1.7.1/aws-java-sdk-1.7.1.pom (7 KB at 467.1 KB/sec)
14-Jan-2019 04:00:03 Downloading: http://repo.maven.apache.org/maven2/org/apache/httpcomponents/httpclient/4.2/httpclient-4.2.pom
14-Jan-2019 04:00:03 Downloaded: http://repo.maven.apache.org/maven2/org/apache/httpcomponents/httpclient/4.2/httpclient-4.2.pom (6 KB at 480.9 KB/sec)
14-Jan-2019 04:00:03 Downloading: http://repo.maven.apache.org/maven2/org/apache/httpcomponents/httpcomponents-client/4.2/httpcomponents-client-4.2.pom
14-Jan-2019 04:00:03 Downloaded: http://repo.maven.apache.org/maven2/org/apache/httpcomponents/httpcomponents-client/4.2/httpcomponents-client-4.2.pom (15 KB at 934.0 KB/sec)
14-Jan-2019 04:00:03 Downloading: http://repo.maven.apache.org/maven2/org/apache/httpcomponents/project/5/project-5.pom
14-Jan-2019 04:00:03 Downloaded: http://repo.maven.apache.org/maven2/org/apache/httpcomponents/project/5/project-5.pom (23 KB at 1332.6 KB/sec)
14-Jan-2019 04:00:03 Downloading: http://repo.maven.apache.org/maven2/org/apache/httpcomponents/httpcore/4.2/httpcore-4.2.pom
14-Jan-2019 04:00:03 Downloaded: http://repo.maven.apache.org/maven2/org/apache/httpcomponents/httpcore/4.2/httpcore-4.2.pom (6 KB at 462.4 KB/sec)
14-Jan-2019 04:00:03 Downloading: http://repo.maven.apache.org/maven2/org/apache/httpcomponents/httpcomponents-core/4.2/httpcomponents-core-4.2.pom
14-Jan-2019 04:00:03 Downloaded: http://repo.maven.apache.org/maven2/org/apache/httpcomponents/httpcomponents-core/4.2/httpcomponents-core-4.2.pom (12 KB at 799.7 KB/sec)
14-Jan-2019 04:00:03 Downloading: http://repo.maven.apache.org/maven2/com/fasterxml/jackson/core/jackson-core/2.1.1/jackson-core-2.1.1.pom
14-Jan-2019 04:00:03 Downloaded: http://repo.maven.apache.org/maven2/com/fasterxml/jackson/core/jackson-core/2.1.1/jackson-core-2.1.1.pom (6 KB at 458.7 KB/sec)
14-Jan-2019 04:00:03 Downloading: http://repo.maven.apache.org/maven2/com/fasterxml/oss-parent/4/oss-parent-4.pom
14-Jan-2019 04:00:03 Downloaded: http://repo.maven.apache.org/maven2/com/fasterxml/oss-parent/4/oss-parent-4.pom (18 KB at 1199.7 KB/sec)
14-Jan-2019 04:00:03 Downloading: http://repo.maven.apache.org/maven2/com/fasterxml/jackson/core/jackson-databind/2.1.1/jackson-databind-2.1.1.pom
14-Jan-2019 04:00:03 Downloaded: http://repo.maven.apache.org/maven2/com/fasterxml/jackson/core/jackson-databind/2.1.1/jackson-databind-2.1.1.pom (6 KB at 455.6 KB/sec)
14-Jan-2019 04:00:03 Downloading: http://repo.maven.apache.org/maven2/com/fasterxml/jackson/core/jackson-annotations/2.1.1/jackson-annotations-2.1.1.pom
14-Jan-2019 04:00:03 Downloaded: http://repo.maven.apache.org/maven2/com/fasterxml/jackson/core/jackson-annotations/2.1.1/jackson-annotations-2.1.1.pom (2 KB at 165.3 KB/sec)
14-Jan-2019 04:00:03 Downloading: http://repo.maven.apache.org/maven2/joda-time/joda-time/maven-metadata.xml
14-Jan-2019 04:00:03 Downloaded: http://repo.maven.apache.org/maven2/joda-time/joda-time/maven-metadata.xml (2 KB at 121.4 KB/sec)
14-Jan-2019 04:00:03 Downloading: http://repo.maven.apache.org/maven2/joda-time/joda-time/2.3/joda-time-2.3.pom
14-Jan-2019 04:00:03 Downloaded: http://repo.maven.apache.org/maven2/joda-time/joda-time/2.3/joda-time-2.3.pom (25 KB at 1445.6 KB/sec)
14-Jan-2019 04:00:03 Downloading: http://repo.maven.apache.org/maven2/joda-time/joda-time/2.4/joda-time-2.4.pom
14-Jan-2019 04:00:03 Downloaded: http://repo.maven.apache.org/maven2/joda-time/joda-time/2.4/joda-time-2.4.pom (26 KB at 1514.1 KB/sec)
14-Jan-2019 04:00:03 Downloading: http://repo.maven.apache.org/maven2/joda-time/joda-time/2.5/joda-time-2.5.pom
14-Jan-2019 04:00:03 Downloaded: http://repo.maven.apache.org/maven2/joda-time/joda-time/2.5/joda-time-2.5.pom (27 KB at 1547.6 KB/sec)
14-Jan-2019 04:00:03 Downloading: http://repo.maven.apache.org/maven2/joda-time/joda-time/2.6/joda-time-2.6.pom
14-Jan-2019 04:00:03 Downloaded: http://repo.maven.apache.org/maven2/joda-time/joda-time/2.6/joda-time-2.6.pom (27 KB at 1554.2 KB/sec)
14-Jan-2019 04:00:03 Downloading: http://repo.maven.apache.org/maven2/joda-time/joda-time/2.8/joda-time-2.8.pom
14-Jan-2019 04:00:03 Downloaded: http://repo.maven.apache.org/maven2/joda-time/joda-time/2.8/joda-time-2.8.pom (29 KB at 1335.6 KB/sec)
14-Jan-2019 04:00:03 Downloading: http://repo.maven.apache.org/maven2/joda-time/joda-time/2.9/joda-time-2.9.pom
14-Jan-2019 04:00:04 Downloaded: http://repo.maven.apache.org/maven2/joda-time/joda-time/2.9/joda-time-2.9.pom (29 KB at 1511.9 KB/sec)
14-Jan-2019 04:00:04 Downloading: http://repo.maven.apache.org/maven2/joda-time/joda-time/2.9.2/joda-time-2.9.2.pom
14-Jan-2019 04:00:04 Downloaded: http://repo.maven.apache.org/maven2/joda-time/joda-time/2.9.2/joda-time-2.9.2.pom (30 KB at 1531.1 KB/sec)
14-Jan-2019 04:00:04 Downloading: http://repo.maven.apache.org/maven2/joda-time/joda-time/2.9.3/joda-time-2.9.3.pom
14-Jan-2019 04:00:04 Downloaded: http://repo.maven.apache.org/maven2/joda-time/joda-time/2.9.3/joda-time-2.9.3.pom (30 KB at 1629.0 KB/sec)
14-Jan-2019 04:00:04 Downloading: http://repo.maven.apache.org/maven2/joda-time/joda-time/2.9.5/joda-time-2.9.5.pom
14-Jan-2019 04:00:04 Downloaded: http://repo.maven.apache.org/maven2/joda-time/joda-time/2.9.5/joda-time-2.9.5.pom (32 KB at 1673.3 KB/sec)
14-Jan-2019 04:00:04 Downloading: http://repo.maven.apache.org/maven2/joda-time/joda-time/2.9.6/joda-time-2.9.6.pom
14-Jan-2019 04:00:04 Downloaded: http://repo.maven.apache.org/maven2/joda-time/joda-time/2.9.6/joda-time-2.9.6.pom (32 KB at 1673.3 KB/sec)
14-Jan-2019 04:00:04 Downloading: http://repo.maven.apache.org/maven2/joda-time/joda-time/2.9.7/joda-time-2.9.7.pom
14-Jan-2019 04:00:04 Downloaded: http://repo.maven.apache.org/maven2/joda-time/joda-time/2.9.7/joda-time-2.9.7.pom (33 KB at 1693.2 KB/sec)
14-Jan-2019 04:00:04 Downloading: http://repo.maven.apache.org/maven2/joda-time/joda-time/2.9.8/joda-time-2.9.8.pom
14-Jan-2019 04:00:04 Downloaded: http://repo.maven.apache.org/maven2/joda-time/joda-time/2.9.8/joda-time-2.9.8.pom (33 KB at 1705.1 KB/sec)
14-Jan-2019 04:00:04 Downloading: http://repo.maven.apache.org/maven2/org/slf4j/jcl-over-slf4j/1.7.6/jcl-over-slf4j-1.7.6.pom
14-Jan-2019 04:00:04 Downloaded: http://repo.maven.apache.org/maven2/org/slf4j/jcl-over-slf4j/1.7.6/jcl-over-slf4j-1.7.6.pom (2 KB at 164.6 KB/sec)
14-Jan-2019 04:00:04 Downloading: http://repo.maven.apache.org/maven2/org/springframework/build/aws-maven/5.0.0.RELEASE/aws-maven-5.0.0.RELEASE.jar
14-Jan-2019 04:00:04 Downloading: http://repo.maven.apache.org/maven2/ch/qos/logback/logback-classic/1.1.1/logback-classic-1.1.1.jar
14-Jan-2019 04:00:04 Downloading: http://repo.maven.apache.org/maven2/ch/qos/logback/logback-core/1.1.1/logback-core-1.1.1.jar
14-Jan-2019 04:00:04 Downloading: http://repo.maven.apache.org/maven2/com/amazonaws/aws-java-sdk/1.7.1/aws-java-sdk-1.7.1.jar
14-Jan-2019 04:00:04 Downloading: http://repo.maven.apache.org/maven2/org/apache/httpcomponents/httpclient/4.2/httpclient-4.2.jar
14-Jan-2019 04:00:04 Downloaded: http://repo.maven.apache.org/maven2/org/springframework/build/aws-maven/5.0.0.RELEASE/aws-maven-5.0.0.RELEASE.jar (26 KB at 490.8 KB/sec)
14-Jan-2019 04:00:04 Downloading: http://repo.maven.apache.org/maven2/org/apache/httpcomponents/httpcore/4.2/httpcore-4.2.jar
14-Jan-2019 04:00:04 Downloaded: http://repo.maven.apache.org/maven2/org/apache/httpcomponents/httpcore/4.2/httpcore-4.2.jar (219 KB at 1580.1 KB/sec)
14-Jan-2019 04:00:04 Downloading: http://repo.maven.apache.org/maven2/com/fasterxml/jackson/core/jackson-core/2.1.1/jackson-core-2.1.1.jar
14-Jan-2019 04:00:04 Downloaded: http://repo.maven.apache.org/maven2/com/fasterxml/jackson/core/jackson-core/2.1.1/jackson-core-2.1.1.jar (202 KB at 16795.2 KB/sec)
14-Jan-2019 04:00:04 Downloading: http://repo.maven.apache.org/maven2/com/fasterxml/jackson/core/jackson-databind/2.1.1/jackson-databind-2.1.1.jar
14-Jan-2019 04:00:04 Downloaded: http://repo.maven.apache.org/maven2/com/fasterxml/jackson/core/jackson-databind/2.1.1/jackson-databind-2.1.1.jar (902 KB at 23711.0 KB/sec)
14-Jan-2019 04:00:04 Downloading: http://repo.maven.apache.org/maven2/com/fasterxml/jackson/core/jackson-annotations/2.1.1/jackson-annotations-2.1.1.jar
14-Jan-2019 04:00:04 Downloaded: http://repo.maven.apache.org/maven2/com/fasterxml/jackson/core/jackson-annotations/2.1.1/jackson-annotations-2.1.1.jar (34 KB at 3366.9 KB/sec)
14-Jan-2019 04:00:04 Downloading: http://repo.maven.apache.org/maven2/org/slf4j/jcl-over-slf4j/1.7.6/jcl-over-slf4j-1.7.6.jar
14-Jan-2019 04:00:04 Downloaded: http://repo.maven.apache.org/maven2/org/slf4j/jcl-over-slf4j/1.7.6/jcl-over-slf4j-1.7.6.jar (17 KB at 2304.0 KB/sec)
14-Jan-2019 04:00:04 Downloading: http://repo.maven.apache.org/maven2/org/slf4j/slf4j-api/1.7.6/slf4j-api-1.7.6.jar
14-Jan-2019 04:00:04 Downloaded: http://repo.maven.apache.org/maven2/org/slf4j/slf4j-api/1.7.6/slf4j-api-1.7.6.jar (29 KB at 3112.8 KB/sec)
14-Jan-2019 04:00:04 Downloaded: http://repo.maven.apache.org/maven2/ch/qos/logback/logback-classic/1.1.1/logback-classic-1.1.1.jar (265 KB at 699.8 KB/sec)
14-Jan-2019 04:00:04 Downloaded: http://repo.maven.apache.org/maven2/org/apache/httpcomponents/httpclient/4.2/httpclient-4.2.jar (415 KB at 722.5 KB/sec)
14-Jan-2019 04:00:04 Downloaded: http://repo.maven.apache.org/maven2/ch/qos/logback/logback-core/1.1.1/logback-core-1.1.1.jar (418 KB at 701.0 KB/sec)
14-Jan-2019 04:00:05 Downloaded: http://repo.maven.apache.org/maven2/com/amazonaws/aws-java-sdk/1.7.1/aws-java-sdk-1.7.1.jar (11598 KB at 7189.9 KB/sec)
14-Jan-2019 04:00:05 [WARNING]
14-Jan-2019 04:00:05 [WARNING] Some problems were encountered while building the effective model for org.springframework.security.oauth:sparklr2:war:2.3.5.BUILD-SNAPSHOT
14-Jan-2019 04:00:05 [WARNING] 'reporting.plugins.plugin.version' for org.codehaus.mojo:jdepend-maven-plugin is missing. @ org.springframework.security.oauth:spring-security-oauth-parent:2.3.5.BUILD-SNAPSHOT, /opt/bamboo-home/xml-data/build-dir/SECOAUTH-INTEGRATION-JOB1/pom.xml, line 455, column 15
14-Jan-2019 04:00:05 [WARNING] 'reporting.plugins.plugin.version' for org.apache.maven.plugins:maven-javadoc-plugin is missing. @ org.springframework.security.oauth:spring-security-oauth-parent:2.3.5.BUILD-SNAPSHOT, /opt/bamboo-home/xml-data/build-dir/SECOAUTH-INTEGRATION-JOB1/pom.xml, line 459, column 15
14-Jan-2019 04:00:05 [WARNING] 'reporting.plugins.plugin.version' for org.apache.maven.plugins:maven-jxr-plugin is missing. @ org.springframework.security.oauth:spring-security-oauth-parent:2.3.5.BUILD-SNAPSHOT, /opt/bamboo-home/xml-data/build-dir/SECOAUTH-INTEGRATION-JOB1/pom.xml, line 490, column 15
14-Jan-2019 04:00:05 [WARNING]
14-Jan-2019 04:00:05 [WARNING] It is highly recommended to fix these problems because they threaten the stability of your build.
14-Jan-2019 04:00:05 [WARNING]
14-Jan-2019 04:00:05 [WARNING] For this reason, future Maven versions might no longer support building such malformed projects.
14-Jan-2019 04:00:05 [WARNING]
14-Jan-2019 04:00:05 Downloading: http://repo.maven.apache.org/maven2/org/apache/maven/plugins/maven-source-plugin/2.1.2/maven-source-plugin-2.1.2.pom
14-Jan-2019 04:00:05 Downloaded: http://repo.maven.apache.org/maven2/org/apache/maven/plugins/maven-source-plugin/2.1.2/maven-source-plugin-2.1.2.pom (6 KB at 560.4 KB/sec)
14-Jan-2019 04:00:05 Downloading: http://repo.maven.apache.org/maven2/org/apache/maven/plugins/maven-source-plugin/2.1.2/maven-source-plugin-2.1.2.jar
14-Jan-2019 04:00:05 Downloaded: http://repo.maven.apache.org/maven2/org/apache/maven/plugins/maven-source-plugin/2.1.2/maven-source-plugin-2.1.2.jar (24 KB at 1468.4 KB/sec)
14-Jan-2019 04:00:06 Downloading: http://repo.maven.apache.org/maven2/org/codehaus/mojo/animal-sniffer-maven-plugin/1.6/animal-sniffer-maven-plugin-1.6.pom
14-Jan-2019 04:00:06 Downloaded: http://repo.maven.apache.org/maven2/org/codehaus/mojo/animal-sniffer-maven-plugin/1.6/animal-sniffer-maven-plugin-1.6.pom (5 KB at 424.6 KB/sec)
14-Jan-2019 04:00:06 Downloading: http://repo.maven.apache.org/maven2/org/codehaus/mojo/animal-sniffer-parent/1.6/animal-sniffer-parent-1.6.pom
14-Jan-2019 04:00:06 Downloaded: http://repo.maven.apache.org/maven2/org/codehaus/mojo/animal-sniffer-parent/1.6/animal-sniffer-parent-1.6.pom (5 KB at 297.4 KB/sec)
14-Jan-2019 04:00:06 Downloading: http://repo.maven.apache.org/maven2/org/codehaus/mojo/mojo-parent/23/mojo-parent-23.pom
14-Jan-2019 04:00:06 Downloaded: http://repo.maven.apache.org/maven2/org/codehaus/mojo/mojo-parent/23/mojo-parent-23.pom (23 KB at 2210.1 KB/sec)
14-Jan-2019 04:00:06 Downloading: http://repo.maven.apache.org/maven2/org/codehaus/mojo/animal-sniffer-maven-plugin/1.6/animal-sniffer-maven-plugin-1.6.jar
14-Jan-2019 04:00:06 Downloaded: http://repo.maven.apache.org/maven2/org/codehaus/mojo/animal-sniffer-maven-plugin/1.6/animal-sniffer-maven-plugin-1.6.jar (25 KB at 162.8 KB/sec)
14-Jan-2019 04:00:06 Downloading: http://repo.maven.apache.org/maven2/org/apache/maven/plugins/maven-deploy-plugin/2.6/maven-deploy-plugin-2.6.pom
14-Jan-2019 04:00:06 Downloaded: http://repo.maven.apache.org/maven2/org/apache/maven/plugins/maven-deploy-plugin/2.6/maven-deploy-plugin-2.6.pom (6 KB at 609.0 KB/sec)
14-Jan-2019 04:00:06 Downloading: http://repo.maven.apache.org/maven2/org/apache/maven/plugins/maven-deploy-plugin/2.6/maven-deploy-plugin-2.6.jar
14-Jan-2019 04:00:06 Downloaded: http://repo.maven.apache.org/maven2/org/apache/maven/plugins/maven-deploy-plugin/2.6/maven-deploy-plugin-2.6.jar (24 KB at 1488.0 KB/sec)
14-Jan-2019 04:00:06 Downloading: http://repo.maven.apache.org/maven2/org/apache/maven/plugins/maven-surefire-plugin/2.7.1/maven-surefire-plugin-2.7.1.pom
14-Jan-2019 04:00:06 Downloaded: http://repo.maven.apache.org/maven2/org/apache/maven/plugins/maven-surefire-plugin/2.7.1/maven-surefire-plugin-2.7.1.pom (10 KB at 917.0 KB/sec)
14-Jan-2019 04:00:06 Downloading: http://repo.maven.apache.org/maven2/org/apache/maven/surefire/surefire/2.7.1/surefire-2.7.1.pom
14-Jan-2019 04:00:06 Downloaded: http://repo.maven.apache.org/maven2/org/apache/maven/surefire/surefire/2.7.1/surefire-2.7.1.pom (10 KB at 694.4 KB/sec)
14-Jan-2019 04:00:06 Downloading: http://repo.maven.apache.org/maven2/org/apache/maven/maven-parent/18/maven-parent-18.pom
14-Jan-2019 04:00:06 Downloaded: http://repo.maven.apache.org/maven2/org/apache/maven/maven-parent/18/maven-parent-18.pom (24 KB at 2616.1 KB/sec)
14-Jan-2019 04:00:06 Downloading: http://repo.maven.apache.org/maven2/org/apache/apache/8/apache-8.pom
14-Jan-2019 04:00:06 Downloaded: http://repo.maven.apache.org/maven2/org/apache/apache/8/apache-8.pom (14 KB at 1525.0 KB/sec)
14-Jan-2019 04:00:06 Downloading: http://repo.maven.apache.org/maven2/org/apache/maven/plugins/maven-surefire-plugin/2.7.1/maven-surefire-plugin-2.7.1.jar
14-Jan-2019 04:00:06 Downloaded: http://repo.maven.apache.org/maven2/org/apache/maven/plugins/maven-surefire-plugin/2.7.1/maven-surefire-plugin-2.7.1.jar (29 KB at 2172.6 KB/sec)
14-Jan-2019 04:00:06 Downloading: http://repo.maven.apache.org/maven2/org/apache/tomcat/maven/tomcat7-maven-plugin/2.2/tomcat7-maven-plugin-2.2.pom
14-Jan-2019 04:00:06 Downloaded: http://repo.maven.apache.org/maven2/org/apache/tomcat/maven/tomcat7-maven-plugin/2.2/tomcat7-maven-plugin-2.2.pom (12 KB at 1178.6 KB/sec)
14-Jan-2019 04:00:06 Downloading: http://repo.maven.apache.org/maven2/org/apache/tomcat/maven/tomcat-maven-plugin/2.2/tomcat-maven-plugin-2.2.pom
14-Jan-2019 04:00:06 Downloaded: http://repo.maven.apache.org/maven2/org/apache/tomcat/maven/tomcat-maven-plugin/2.2/tomcat-maven-plugin-2.2.pom (33 KB at 2916.2 KB/sec)
14-Jan-2019 04:00:06 Downloading: http://repo.maven.apache.org/maven2/org/apache/tomcat/maven/tomcat7-maven-plugin/2.2/tomcat7-maven-plugin-2.2.jar
14-Jan-2019 04:00:06 Downloaded: http://repo.maven.apache.org/maven2/org/apache/tomcat/maven/tomcat7-maven-plugin/2.2/tomcat7-maven-plugin-2.2.jar (112 KB at 7452.0 KB/sec)
14-Jan-2019 04:00:06 [INFO]                                                                         
14-Jan-2019 04:00:06 [INFO] ------------------------------------------------------------------------
14-Jan-2019 04:00:06 [INFO] Building OAuth for Spring Security - Sparklr2 (OAuth 2 Provider Example) 2.3.5.BUILD-SNAPSHOT
14-Jan-2019 04:00:06 [INFO] ------------------------------------------------------------------------
14-Jan-2019 04:00:06 Downloading: http://repo.spring.io/libs-snapshot/org/springframework/security/oauth/spring-security-oauth2/2.3.5.BUILD-SNAPSHOT/maven-metadata.xml
14-Jan-2019 04:00:06 Downloading: http://repo.spring.io/libs-snapshot/org/springframework/security/oauth/spring-security-oauth2/2.3.5.BUILD-SNAPSHOT/spring-security-oauth2-2.3.5.BUILD-SNAPSHOT.pom
14-Jan-2019 04:00:07 [WARNING] The POM for org.springframework.security.oauth:spring-security-oauth2:jar:2.3.5.BUILD-SNAPSHOT is missing, no dependency information available
14-Jan-2019 04:00:07 Downloading: http://repo.spring.io/libs-snapshot/org/springframework/spring-web/4.0.9.RELEASE/spring-web-4.0.9.RELEASE.pom
14-Jan-2019 04:00:07 Downloaded: http://repo.spring.io/libs-snapshot/org/springframework/spring-web/4.0.9.RELEASE/spring-web-4.0.9.RELEASE.pom (7 KB at 28.0 KB/sec)
14-Jan-2019 04:00:07 Downloading: http://repo.spring.io/libs-snapshot/org/springframework/spring-aop/4.0.9.RELEASE/spring-aop-4.0.9.RELEASE.pom
14-Jan-2019 04:00:07 Downloaded: http://repo.spring.io/libs-snapshot/org/springframework/spring-aop/4.0.9.RELEASE/spring-aop-4.0.9.RELEASE.pom (3 KB at 16.0 KB/sec)
14-Jan-2019 04:00:07 Downloading: http://repo.spring.io/libs-snapshot/org/springframework/spring-beans/4.0.9.RELEASE/spring-beans-4.0.9.RELEASE.pom
14-Jan-2019 04:00:07 Downloaded: http://repo.spring.io/libs-snapshot/org/springframework/spring-beans/4.0.9.RELEASE/spring-beans-4.0.9.RELEASE.pom (3 KB at 13.9 KB/sec)
14-Jan-2019 04:00:07 Downloading: http://repo.spring.io/libs-snapshot/org/springframework/spring-context/4.0.9.RELEASE/spring-context-4.0.9.RELEASE.pom
14-Jan-2019 04:00:08 Downloaded: http://repo.spring.io/libs-snapshot/org/springframework/spring-context/4.0.9.RELEASE/spring-context-4.0.9.RELEASE.pom (5 KB at 29.5 KB/sec)
14-Jan-2019 04:00:08 Downloading: http://repo.spring.io/libs-snapshot/org/springframework/spring-expression/4.0.9.RELEASE/spring-expression-4.0.9.RELEASE.pom
14-Jan-2019 04:00:08 Downloaded: http://repo.spring.io/libs-snapshot/org/springframework/spring-expression/4.0.9.RELEASE/spring-expression-4.0.9.RELEASE.pom (2 KB at 10.4 KB/sec)
14-Jan-2019 04:00:08 Downloading: http://repo.spring.io/libs-snapshot/org/springframework/spring-jdbc/4.0.9.RELEASE/spring-jdbc-4.0.9.RELEASE.pom
14-Jan-2019 04:00:08 Downloaded: http://repo.spring.io/libs-snapshot/org/springframework/spring-jdbc/4.0.9.RELEASE/spring-jdbc-4.0.9.RELEASE.pom (4 KB at 17.5 KB/sec)
14-Jan-2019 04:00:08 Downloading: http://repo.spring.io/libs-snapshot/org/springframework/spring-tx/4.0.9.RELEASE/spring-tx-4.0.9.RELEASE.pom
14-Jan-2019 04:00:08 Downloaded: http://repo.spring.io/libs-snapshot/org/springframework/spring-tx/4.0.9.RELEASE/spring-tx-4.0.9.RELEASE.pom (4 KB at 16.9 KB/sec)
14-Jan-2019 04:00:08 Downloading: http://repo.spring.io/libs-snapshot/org/springframework/spring-webmvc/4.0.9.RELEASE/spring-webmvc-4.0.9.RELEASE.pom
14-Jan-2019 04:00:08 Downloaded: http://repo.spring.io/libs-snapshot/org/springframework/spring-webmvc/4.0.9.RELEASE/spring-webmvc-4.0.9.RELEASE.pom (11 KB at 49.6 KB/sec)
14-Jan-2019 04:00:08 Downloading: http://repo.spring.io/libs-snapshot/org/springframework/security/spring-security-taglibs/3.2.10.RELEASE/spring-security-taglibs-3.2.10.RELEASE.pom
14-Jan-2019 04:00:09 Downloaded: http://repo.spring.io/libs-snapshot/org/springframework/security/spring-security-taglibs/3.2.10.RELEASE/spring-security-taglibs-3.2.10.RELEASE.pom (7 KB at 24.3 KB/sec)
14-Jan-2019 04:00:09 Downloading: http://repo.spring.io/libs-snapshot/org/springframework/security/spring-security-acl/3.2.10.RELEASE/spring-security-acl-3.2.10.RELEASE.pom
14-Jan-2019 04:00:09 Downloaded: http://repo.spring.io/libs-snapshot/org/springframework/security/spring-security-acl/3.2.10.RELEASE/spring-security-acl-3.2.10.RELEASE.pom (6 KB at 22.9 KB/sec)
14-Jan-2019 04:00:09 Downloading: http://repo.spring.io/libs-snapshot/org/springframework/security/spring-security-core/3.2.10.RELEASE/spring-security-core-3.2.10.RELEASE.pom
14-Jan-2019 04:00:09 Downloaded: http://repo.spring.io/libs-snapshot/org/springframework/security/spring-security-core/3.2.10.RELEASE/spring-security-core-3.2.10.RELEASE.pom (9 KB at 43.6 KB/sec)
14-Jan-2019 04:00:09 Downloading: http://repo.spring.io/libs-snapshot/org/springframework/security/spring-security-web/3.2.10.RELEASE/spring-security-web-3.2.10.RELEASE.pom
14-Jan-2019 04:00:09 Downloaded: http://repo.spring.io/libs-snapshot/org/springframework/security/spring-security-web/3.2.10.RELEASE/spring-security-web-3.2.10.RELEASE.pom (8 KB at 35.1 KB/sec)
14-Jan-2019 04:00:09 Downloading: http://repo.spring.io/libs-snapshot/com/fasterxml/jackson/core/jackson-databind/2.3.1/jackson-databind-2.3.1.pom
14-Jan-2019 04:00:10 Downloaded: http://repo.spring.io/libs-snapshot/com/fasterxml/jackson/core/jackson-databind/2.3.1/jackson-databind-2.3.1.pom (6 KB at 29.5 KB/sec)
14-Jan-2019 04:00:10 Downloading: http://repo.spring.io/libs-snapshot/com/fasterxml/oss-parent/12/oss-parent-12.pom
14-Jan-2019 04:00:10 Downloaded: http://repo.spring.io/libs-snapshot/com/fasterxml/oss-parent/12/oss-parent-12.pom (24 KB at 114.0 KB/sec)
14-Jan-2019 04:00:10 Downloading: http://repo.spring.io/libs-snapshot/com/fasterxml/jackson/core/jackson-annotations/2.3.0/jackson-annotations-2.3.0.pom
14-Jan-2019 04:00:10 Downloaded: http://repo.spring.io/libs-snapshot/com/fasterxml/jackson/core/jackson-annotations/2.3.0/jackson-annotations-2.3.0.pom (2 KB at 6.2 KB/sec)
14-Jan-2019 04:00:10 Downloading: http://repo.spring.io/libs-snapshot/com/fasterxml/oss-parent/11/oss-parent-11.pom
14-Jan-2019 04:00:10 Downloaded: http://repo.spring.io/libs-snapshot/com/fasterxml/oss-parent/11/oss-parent-11.pom (23 KB at 125.6 KB/sec)
14-Jan-2019 04:00:10 Downloading: http://repo.spring.io/libs-snapshot/com/fasterxml/jackson/core/jackson-core/2.3.1/jackson-core-2.3.1.pom
14-Jan-2019 04:00:10 Downloaded: http://repo.spring.io/libs-snapshot/com/fasterxml/jackson/core/jackson-core/2.3.1/jackson-core-2.3.1.pom (6 KB at 33.1 KB/sec)
14-Jan-2019 04:00:10 Downloading: http://repo.spring.io/libs-snapshot/org/webjars/bootstrap/3.0.3/bootstrap-3.0.3.pom
14-Jan-2019 04:00:11 Downloaded: http://repo.spring.io/libs-snapshot/org/webjars/bootstrap/3.0.3/bootstrap-3.0.3.pom (5 KB at 20.6 KB/sec)
14-Jan-2019 04:00:11 Downloading: http://repo.spring.io/libs-snapshot/org/webjars/jquery/1.9.0/jquery-1.9.0.pom
14-Jan-2019 04:00:11 Downloaded: http://repo.spring.io/libs-snapshot/org/webjars/jquery/1.9.0/jquery-1.9.0.pom (4 KB at 12.3 KB/sec)
14-Jan-2019 04:00:11 Downloading: http://repo.spring.io/libs-snapshot/org/springframework/security/oauth/spring-security-oauth2/2.3.5.BUILD-SNAPSHOT/spring-security-oauth2-2.3.5.BUILD-SNAPSHOT.jar
14-Jan-2019 04:00:11 Downloading: http://repo.spring.io/libs-snapshot/org/springframework/spring-aop/4.0.9.RELEASE/spring-aop-4.0.9.RELEASE.jar
14-Jan-2019 04:00:11 Downloading: http://repo.spring.io/libs-snapshot/org/springframework/spring-beans/4.0.9.RELEASE/spring-beans-4.0.9.RELEASE.jar
14-Jan-2019 04:00:11 Downloading: http://repo.spring.io/libs-snapshot/org/springframework/spring-web/4.0.9.RELEASE/spring-web-4.0.9.RELEASE.jar
14-Jan-2019 04:00:11 Downloading: http://repo.spring.io/libs-snapshot/org/springframework/spring-context/4.0.9.RELEASE/spring-context-4.0.9.RELEASE.jar
14-Jan-2019 04:00:11 Downloaded: http://repo.spring.io/libs-snapshot/org/springframework/spring-beans/4.0.9.RELEASE/spring-beans-4.0.9.RELEASE.jar (657 KB at 2138.7 KB/sec)
14-Jan-2019 04:00:11 Downloading: http://repo.spring.io/libs-snapshot/org/springframework/spring-jdbc/4.0.9.RELEASE/spring-jdbc-4.0.9.RELEASE.jar
14-Jan-2019 04:00:11 Downloaded: http://repo.spring.io/libs-snapshot/org/springframework/spring-aop/4.0.9.RELEASE/spring-aop-4.0.9.RELEASE.jar (345 KB at 850.8 KB/sec)
14-Jan-2019 04:00:11 Downloading: http://repo.spring.io/libs-snapshot/org/springframework/spring-webmvc/4.0.9.RELEASE/spring-webmvc-4.0.9.RELEASE.jar
14-Jan-2019 04:00:11 Downloaded: http://repo.spring.io/libs-snapshot/org/springframework/spring-jdbc/4.0.9.RELEASE/spring-jdbc-4.0.9.RELEASE.jar (415 KB at 1415.4 KB/sec)
14-Jan-2019 04:00:11 Downloading: http://repo.spring.io/libs-snapshot/org/springframework/spring-expression/4.0.9.RELEASE/spring-expression-4.0.9.RELEASE.jar
14-Jan-2019 04:00:12 Downloaded: http://repo.spring.io/libs-snapshot/org/springframework/spring-expression/4.0.9.RELEASE/spring-expression-4.0.9.RELEASE.jar (201 KB at 771.8 KB/sec)
14-Jan-2019 04:00:12 Downloading: http://repo.spring.io/libs-snapshot/org/springframework/spring-tx/4.0.9.RELEASE/spring-tx-4.0.9.RELEASE.jar
14-Jan-2019 04:00:12 Downloaded: http://repo.spring.io/libs-snapshot/org/springframework/spring-webmvc/4.0.9.RELEASE/spring-webmvc-4.0.9.RELEASE.jar (650 KB at 1317.3 KB/sec)
14-Jan-2019 04:00:12 Downloading: http://repo.spring.io/libs-snapshot/org/springframework/security/spring-security-taglibs/3.2.10.RELEASE/spring-security-taglibs-3.2.10.RELEASE.jar
14-Jan-2019 04:00:12 Downloading: http://repo.spring.io/libs-snapshot/org/springframework/security/spring-security-acl/3.2.10.RELEASE/spring-security-acl-3.2.10.RELEASE.jar
14-Jan-2019 04:00:12 Downloaded: http://repo.spring.io/libs-snapshot/org/springframework/security/spring-security-taglibs/3.2.10.RELEASE/spring-security-taglibs-3.2.10.RELEASE.jar (24 KB at 109.9 KB/sec)
14-Jan-2019 04:00:12 Downloading: http://repo.spring.io/libs-snapshot/org/springframework/security/spring-security-core/3.2.10.RELEASE/spring-security-core-3.2.10.RELEASE.jar
14-Jan-2019 04:00:12 Downloaded: http://repo.spring.io/libs-snapshot/org/springframework/spring-web/4.0.9.RELEASE/spring-web-4.0.9.RELEASE.jar (656 KB at 579.7 KB/sec)
14-Jan-2019 04:00:12 Downloading: http://repo.spring.io/libs-snapshot/org/springframework/security/spring-security-web/3.2.10.RELEASE/spring-security-web-3.2.10.RELEASE.jar
14-Jan-2019 04:00:12 Downloaded: http://repo.spring.io/libs-snapshot/org/springframework/security/spring-security-acl/3.2.10.RELEASE/spring-security-acl-3.2.10.RELEASE.jar (81 KB at 260.7 KB/sec)
14-Jan-2019 04:00:12 Downloading: http://repo.spring.io/libs-snapshot/com/fasterxml/jackson/core/jackson-databind/2.3.1/jackson-databind-2.3.1.jar
14-Jan-2019 04:00:12 Downloaded: http://repo.spring.io/libs-snapshot/org/springframework/spring-tx/4.0.9.RELEASE/spring-tx-4.0.9.RELEASE.jar (243 KB at 662.7 KB/sec)
14-Jan-2019 04:00:12 Downloading: http://repo.spring.io/libs-snapshot/com/fasterxml/jackson/core/jackson-annotations/2.3.0/jackson-annotations-2.3.0.jar
14-Jan-2019 04:00:12 Downloaded: http://repo.spring.io/libs-snapshot/org/springframework/spring-context/4.0.9.RELEASE/spring-context-4.0.9.RELEASE.jar (956 KB at 669.8 KB/sec)
14-Jan-2019 04:00:12 Downloading: http://repo.spring.io/libs-snapshot/com/fasterxml/jackson/core/jackson-core/2.3.1/jackson-core-2.3.1.jar
14-Jan-2019 04:00:12 Downloaded: http://repo.spring.io/libs-snapshot/com/fasterxml/jackson/core/jackson-annotations/2.3.0/jackson-annotations-2.3.0.jar (35 KB at 118.1 KB/sec)
14-Jan-2019 04:00:12 Downloading: http://repo.spring.io/libs-snapshot/org/webjars/bootstrap/3.0.3/bootstrap-3.0.3.jar
14-Jan-2019 04:00:12 Downloaded: http://repo.spring.io/libs-snapshot/org/springframework/security/spring-security-core/3.2.10.RELEASE/spring-security-core-3.2.10.RELEASE.jar (361 KB at 814.8 KB/sec)
14-Jan-2019 04:00:12 Downloading: http://repo.spring.io/libs-snapshot/org/webjars/jquery/1.9.0/jquery-1.9.0.jar
14-Jan-2019 04:00:13 Downloaded: http://repo.spring.io/libs-snapshot/org/webjars/jquery/1.9.0/jquery-1.9.0.jar (113 KB at 383.0 KB/sec)
14-Jan-2019 04:00:13 Downloaded: http://repo.spring.io/libs-snapshot/com/fasterxml/jackson/core/jackson-core/2.3.1/jackson-core-2.3.1.jar (194 KB at 461.4 KB/sec)
14-Jan-2019 04:00:13 Downloaded: http://repo.spring.io/libs-snapshot/org/springframework/security/spring-security-web/3.2.10.RELEASE/spring-security-web-3.2.10.RELEASE.jar (339 KB at 452.4 KB/sec)
14-Jan-2019 04:00:13 Downloaded: http://repo.spring.io/libs-snapshot/org/webjars/bootstrap/3.0.3/bootstrap-3.0.3.jar (197 KB at 425.7 KB/sec)
14-Jan-2019 04:00:14 Downloaded: http://repo.spring.io/libs-snapshot/com/fasterxml/jackson/core/jackson-databind/2.3.1/jackson-databind-2.3.1.jar (893 KB at 620.9 KB/sec)
14-Jan-2019 04:00:14 [INFO] ------------------------------------------------------------------------
14-Jan-2019 04:00:14 [INFO] BUILD FAILURE
14-Jan-2019 04:00:14 [INFO] ------------------------------------------------------------------------
14-Jan-2019 04:00:14 [INFO] Total time: 11.001s
14-Jan-2019 04:00:14 [INFO] Finished at: Mon Jan 14 04:00:14 UTC 2019
14-Jan-2019 04:00:14 [INFO] Final Memory: 10M/234M
14-Jan-2019 04:00:14 [INFO] ------------------------------------------------------------------------
14-Jan-2019 04:00:14 [ERROR] Failed to execute goal on project sparklr2: Could not resolve dependencies for project org.springframework.security.oauth:sparklr2:war:2.3.5.BUILD-SNAPSHOT: Could not find artifact org.springframework.security.oauth:spring-security-oauth2:jar:2.3.5.BUILD-SNAPSHOT in spring (http://repo.spring.io/libs-snapshot) -> [Help 1]
14-Jan-2019 04:00:14 [ERROR]
14-Jan-2019 04:00:14 [ERROR] To see the full stack trace of the errors, re-run Maven with the -e switch.
14-Jan-2019 04:00:14 [ERROR] Re-run Maven using the -X switch to enable full debug logging.
14-Jan-2019 04:00:14 [ERROR]
14-Jan-2019 04:00:14 [ERROR] For more information about the errors and possible solutions, please read the following articles:
14-Jan-2019 04:00:14 [ERROR] [Help 1] http://cwiki.apache.org/confluence/display/MAVEN/DependencyResolutionException
14-Jan-2019 04:00:14 Failing task since return code of [/opt/maven-3.0/bin/mvn --batch-mode -Djava.io.tmpdir=/tmp/SECOAUTH-INTEGRATION-JOB1 clean tomcat7:run -Dmaven.tomcat.fork=true test -P integration] was 1 while expected 0
14-Jan-2019 04:00:14 Parsing test results under /opt/bamboo-home/xml-data/build-dir/SECOAUTH-INTEGRATION-JOB1...
14-Jan-2019 04:00:14 Finished task 'Integration tests for sparklr2' with result: Failed
14-Jan-2019 04:00:14 Running post build plugin 'Docker Container Cleanup'
14-Jan-2019 04:00:14 Running post build plugin 'NCover Results Collector'
14-Jan-2019 04:00:14 Running post build plugin 'Artifactory Release Management Staging'
14-Jan-2019 04:00:14 Running post build plugin 'Artifactory Build Info Copier'
14-Jan-2019 04:00:14 Running post build plugin 'Artifactory Gradle Properties Info Copier'
14-Jan-2019 04:00:14 Running post build plugin 'Clover Results Collector'
14-Jan-2019 04:00:14 Running post build plugin 'npm Cache Cleanup'
14-Jan-2019 04:00:14 Running post build plugin 'Artifact Copier'
14-Jan-2019 04:00:14 Successfully removed working directory at '/opt/bamboo-home/xml-data/build-dir/SECOAUTH-INTEGRATION-JOB1'
14-Jan-2019 04:00:14 Finalising the build...
14-Jan-2019 04:00:14 Stopping timer.
14-Jan-2019 04:00:14 Build SECOAUTH-INTEGRATION-JOB1-3278 completed.
14-Jan-2019 04:00:14 Running on server: post build plugin 'NCover Results Collector'
14-Jan-2019 04:00:14 Running on server: post build plugin 'Build Hanging Detection Configuration'
14-Jan-2019 04:00:14 Running on server: post build plugin 'Clover Delta Calculator'
14-Jan-2019 04:00:14 Running on server: post build plugin 'Maven Dependencies Postprocessor'
14-Jan-2019 04:00:14 All post build plugins have finished
14-Jan-2019 04:00:14 Generating build results summary...
14-Jan-2019 04:00:14 Saving build results to disk...
14-Jan-2019 04:00:14 Logging substituted variables...
14-Jan-2019 04:00:14 Indexing build results...
14-Jan-2019 04:00:14 Finished building SECOAUTH-INTEGRATION-JOB1-3278.