Build: #1506 failed Scheduled

Logs

The following logs have been generated by the jobs in this plan.
  • Expand all
  • Collapse all
Job Logs
Collapse Default Job Default Stage Download or View
14-Jan-2019 00:00:14 Downloaded: http://repo.spring.io/release/org/springframework/boot/spring-boot-dependencies/1.5.1.RELEASE/spring-boot-dependencies-1.5.1.RELEASE.pom (88 KB at 364.5 KB/sec)
14-Jan-2019 00:00:14 Downloading: https://repo.maven.apache.org/maven2/joda-time/joda-time/2.2/joda-time-2.2.pom
14-Jan-2019 00:00:14            
14-Jan-2019 00:00:14 Downloading: https://repo.maven.apache.org/maven2/joda-time/joda-time/2.7/joda-time-2.7.pom
14-Jan-2019 00:00:14            
14-Jan-2019 00:00:14 Downloading: https://repo.maven.apache.org/maven2/joda-time/joda-time/2.8.2/joda-time-2.8.2.pom
14-Jan-2019 00:00:14            
14-Jan-2019 00:00:14 Downloading: https://repo.maven.apache.org/maven2/joda-time/joda-time/2.9.2/joda-time-2.9.2.pom
14-Jan-2019 00:00:14            
14-Jan-2019 00:00:15 Downloading: https://repo.maven.apache.org/maven2/joda-time/joda-time/2.10/joda-time-2.10.pom
14-Jan-2019 00:00:15            
14-Jan-2019 00:00:15 [ERROR] [ERROR] Some problems were encountered while processing the POMs:
14-Jan-2019 00:00:15 [ERROR] Unresolveable build extension: Plugin org.springframework.build:aws-maven:5.0.0.RELEASE or one of its dependencies could not be resolved: Failed to collect dependencies at org.springframework.build:aws-maven:jar:5.0.0.RELEASE -> com.amazonaws:aws-java-sdk:jar:1.7.1 -> joda-time:joda-time:jar:2.2 @
14-Jan-2019 00:00:15 @
14-Jan-2019 00:00:15 [ERROR] The build could not read 1 project -> [Help 1]
14-Jan-2019 00:00:15 [ERROR]   
14-Jan-2019 00:00:15 [ERROR]   The project org.springframework.security.oauth:spring-security-oauth-parent:2.3.5.BUILD-SNAPSHOT (/opt/bamboo-home/xml-data/build-dir/SECOAUTH-NIGHTLY-JOB1/pom.xml) has 1 error
14-Jan-2019 00:00:15 [ERROR]     Unresolveable build extension: Plugin org.springframework.build:aws-maven:5.0.0.RELEASE or one of its dependencies could not be resolved: Failed to collect dependencies at org.springframework.build:aws-maven:jar:5.0.0.RELEASE -> com.amazonaws:aws-java-sdk:jar:1.7.1 -> joda-time:joda-time:jar:2.2: Failed to read artifact descriptor for joda-time:joda-time:jar:2.2: Could not transfer artifact joda-time:joda-time:pom:2.2 from/to central (https://repo.maven.apache.org/maven2): Received fatal alert: protocol_version -> [Help 2]
14-Jan-2019 00:00:15 [ERROR]
14-Jan-2019 00:00:15 [ERROR] To see the full stack trace of the errors, re-run Maven with the -e switch.
14-Jan-2019 00:00:15 [ERROR] Re-run Maven using the -X switch to enable full debug logging.
14-Jan-2019 00:00:15 [ERROR]
14-Jan-2019 00:00:15 [ERROR] For more information about the errors and possible solutions, please read the following articles:
14-Jan-2019 00:00:15 [ERROR] [Help 1] http://cwiki.apache.org/confluence/display/MAVEN/ProjectBuildingException
14-Jan-2019 00:00:15 [ERROR] [Help 2] http://cwiki.apache.org/confluence/display/MAVEN/PluginManagerException