Build: #1641 failed Scheduled

Logs

The following logs have been generated by the jobs in this plan.
  • Expand all
  • Collapse all
Job Logs
Collapse Default Job Default Stage Download or View
15-May-2019 00:00:04 Downloading: https://repo.spring.io/libs-snapshot-local/org/springframework/boot/spring-boot-starter-parent/1.5.1.RELEASE/spring-boot-starter-parent-1.5.1.RELEASE.pom
15-May-2019 00:00:05
15-May-2019 00:00:05 Downloading: https://repo.spring.io/libs-milestone-local/org/springframework/boot/spring-boot-starter-parent/1.5.1.RELEASE/spring-boot-starter-parent-1.5.1.RELEASE.pom
15-May-2019 00:00:05
15-May-2019 00:00:05 Downloading: https://repo.spring.io/release/org/springframework/boot/spring-boot-starter-parent/1.5.1.RELEASE/spring-boot-starter-parent-1.5.1.RELEASE.pom
15-May-2019 00:00:05
15-May-2019 00:00:05 Downloading: https://repo.maven.apache.org/maven2/org/springframework/boot/spring-boot-starter-parent/1.5.1.RELEASE/spring-boot-starter-parent-1.5.1.RELEASE.pom
15-May-2019 00:00:05
15-May-2019 00:00:05 Downloading: https://repo.spring.io/snapshot/org/springframework/spring-framework-bom/4.3.23.BUILD-SNAPSHOT/maven-metadata.xml
15-May-2019 00:00:05
15-May-2019 00:00:05 [WARNING] Could not transfer metadata org.springframework:spring-framework-bom:4.3.23.BUILD-SNAPSHOT/maven-metadata.xml from/to spring-snapshots (https://repo.spring.io/snapshot): Received fatal alert: protocol_version
15-May-2019 00:00:06 [ERROR] [ERROR] Some problems were encountered while processing the POMs:
15-May-2019 00:00:06 [FATAL] Non-resolvable parent POM for org.demo:spring-oauth2-tests-parent:2.3.6.BUILD-SNAPSHOT: Could not transfer artifact org.springframework.boot:spring-boot-starter-parent:pom:1.5.1.RELEASE from/to spring-snapshots (https://repo.spring.io/libs-snapshot-local): Received fatal alert: protocol_version and 'parent.relativePath' points at no local POM @ line 36, column 10
15-May-2019 00:00:06 @
15-May-2019 00:00:06 [ERROR] The build could not read 1 project -> [Help 1]
15-May-2019 00:00:06 [ERROR]   
15-May-2019 00:00:06 [ERROR]   The project org.demo:spring-oauth2-tests-parent:2.3.6.BUILD-SNAPSHOT (/opt/bamboo-home/xml-data/build-dir/SECOAUTH-NIGHTLY-JOB1/tests/annotation/pom.xml) has 1 error
15-May-2019 00:00:06 [ERROR]     Non-resolvable parent POM for org.demo:spring-oauth2-tests-parent:2.3.6.BUILD-SNAPSHOT: Could not transfer artifact org.springframework.boot:spring-boot-starter-parent:pom:1.5.1.RELEASE from/to spring-snapshots (https://repo.spring.io/libs-snapshot-local): Received fatal alert: protocol_version and 'parent.relativePath' points at no local POM @ line 36, column 10 -> [Help 2]
15-May-2019 00:00:06 [ERROR]
15-May-2019 00:00:06 [ERROR] To see the full stack trace of the errors, re-run Maven with the -e switch.
15-May-2019 00:00:06 [ERROR] Re-run Maven using the -X switch to enable full debug logging.
15-May-2019 00:00:06 [ERROR]
15-May-2019 00:00:06 [ERROR] For more information about the errors and possible solutions, please read the following articles:
15-May-2019 00:00:06 [ERROR] [Help 1] http://cwiki.apache.org/confluence/display/MAVEN/ProjectBuildingException
15-May-2019 00:00:06 [ERROR] [Help 2] http://cwiki.apache.org/confluence/display/MAVEN/UnresolvableModelException