Build: #1647 failed Scheduled

Logs

The following logs have been generated by the jobs in this plan.
  • Expand all
  • Collapse all
Job Logs
Collapse Default Job Default Stage Download or View
21-May-2019 00:00:28 [INFO] spring-oauth2-tests-xml-jdbc ....................... SKIPPED
21-May-2019 00:00:28 [INFO] spring-oauth2-tests-xml-client ..................... SKIPPED
21-May-2019 00:00:28 [INFO] OAuth for Spring Security - Integration Tests ...... SKIPPED
21-May-2019 00:00:28 [INFO] OAuth for Spring Security - Sparklr (OAuth 1 Provider Example) SKIPPED
21-May-2019 00:00:28 [INFO] OAuth for Spring Security - Tonr (OAuth 1 Consumer Example) SKIPPED
21-May-2019 00:00:28 [INFO] OAuth for Spring Security - Sparklr2 (OAuth 2 Provider Example) SKIPPED
21-May-2019 00:00:28 [INFO] OAuth for Spring Security - Tonr2 (OAuth 2 Client Example) SKIPPED
21-May-2019 00:00:28 [INFO] OAuth for Spring Security - Samples ................ SKIPPED
21-May-2019 00:00:28 [INFO] ------------------------------------------------------------------------
21-May-2019 00:00:28 [INFO] BUILD FAILURE
21-May-2019 00:00:28 [INFO] ------------------------------------------------------------------------
21-May-2019 00:00:28 [INFO] Total time: 6.353 s
21-May-2019 00:00:28 [INFO] Finished at: 2019-05-21T00:00:28+00:00
21-May-2019 00:00:29 [INFO] Final Memory: 52M/367M
21-May-2019 00:00:29 [INFO] ------------------------------------------------------------------------
21-May-2019 00:00:29 [ERROR] Failed to execute goal on project spring-security-oauth: Could not resolve dependencies for project org.springframework.security.oauth:spring-security-oauth:jar:2.3.6.BUILD-SNAPSHOT: Failed to collect dependencies at org.springframework:spring-beans:jar:4.3.23.BUILD-SNAPSHOT: Failed to read artifact descriptor for org.springframework:spring-beans:jar:4.3.23.BUILD-SNAPSHOT: Could not transfer artifact org.springframework:spring-beans:pom:4.3.23.BUILD-SNAPSHOT from/to repo.spring.io-milestone (https://repo.spring.io/libs-milestone-local): Received fatal alert: protocol_version -> [Help 1]
21-May-2019 00:00:29 [ERROR]
21-May-2019 00:00:29 [ERROR] To see the full stack trace of the errors, re-run Maven with the -e switch.
21-May-2019 00:00:29 [ERROR] Re-run Maven using the -X switch to enable full debug logging.
21-May-2019 00:00:29 [ERROR]
21-May-2019 00:00:29 [ERROR] For more information about the errors and possible solutions, please read the following articles:
21-May-2019 00:00:29 [ERROR] [Help 1] http://cwiki.apache.org/confluence/display/MAVEN/DependencyResolutionException
21-May-2019 00:00:29 [ERROR]
21-May-2019 00:00:29 [ERROR] After correcting the problems, you can resume the build with the command
21-May-2019 00:00:29 [ERROR]   mvn <goals> -rf :spring-security-oauth