Build: #1671 failed Scheduled

Logs

The following logs have been generated by the jobs in this plan.
  • Expand all
  • Collapse all
Job Logs
Collapse Default Job Default Stage Download or View
11-Jun-2019 00:02:16 [INFO] spring-oauth2-tests-xml-client ..................... SKIPPED
11-Jun-2019 00:02:16 [INFO] OAuth for Spring Security - Integration Tests ...... SKIPPED
11-Jun-2019 00:02:16 [INFO] OAuth for Spring Security - Sparklr (OAuth 1 Provider Example) SKIPPED
11-Jun-2019 00:02:16 [INFO] OAuth for Spring Security - Tonr (OAuth 1 Consumer Example) SKIPPED
11-Jun-2019 00:02:16 [INFO] OAuth for Spring Security - Sparklr2 (OAuth 2 Provider Example) SKIPPED
11-Jun-2019 00:02:16 [INFO] OAuth for Spring Security - Tonr2 (OAuth 2 Client Example) SKIPPED
11-Jun-2019 00:02:16 [INFO] OAuth for Spring Security - Samples ................ SKIPPED
11-Jun-2019 00:02:16 [INFO] ------------------------------------------------------------------------
11-Jun-2019 00:02:16 [INFO] BUILD FAILURE
11-Jun-2019 00:02:16 [INFO] ------------------------------------------------------------------------
11-Jun-2019 00:02:16 [INFO] Total time: 01:03 min
11-Jun-2019 00:02:16 [INFO] Finished at: 2019-06-11T00:02:16+00:00
11-Jun-2019 00:02:16 [INFO] Final Memory: 74M/497M
11-Jun-2019 00:02:16 [INFO] ------------------------------------------------------------------------
11-Jun-2019 00:02:16 [ERROR] Failed to execute goal org.apache.maven.plugins:maven-surefire-plugin:2.12.4:test (default-test) on project spring-security-oauth2: Execution default-test of goal org.apache.maven.plugins:maven-surefire-plugin:2.12.4:test failed: The forked VM terminated without saying properly goodbye. VM crash or System.exit called ? -> [Help 1]
11-Jun-2019 00:02:16 [ERROR]
11-Jun-2019 00:02:16 [ERROR] To see the full stack trace of the errors, re-run Maven with the -e switch.
11-Jun-2019 00:02:16 [ERROR] Re-run Maven using the -X switch to enable full debug logging.
11-Jun-2019 00:02:16 [ERROR]
11-Jun-2019 00:02:16 [ERROR] For more information about the errors and possible solutions, please read the following articles:
11-Jun-2019 00:02:16 [ERROR] [Help 1] http://cwiki.apache.org/confluence/display/MAVEN/PluginExecutionException
11-Jun-2019 00:02:16 [ERROR]
11-Jun-2019 00:02:16 [ERROR] After correcting the problems, you can resume the build with the command
11-Jun-2019 00:02:16 [ERROR]   mvn <goals> -rf :spring-security-oauth2
11-Jun-2019 00:02:16 Exception in thread "main"