Build: #1677 failed Scheduled

Logs

The following logs have been generated by the jobs in this plan.
  • Expand all
  • Collapse all
Job Logs
Collapse Default Job Default Stage Download or View
17-Jun-2019 00:00:58 [INFO] spring-oauth2-tests-xml-client ..................... SKIPPED
17-Jun-2019 00:00:58 [INFO] OAuth for Spring Security - Integration Tests ...... SKIPPED
17-Jun-2019 00:00:58 [INFO] OAuth for Spring Security - Sparklr (OAuth 1 Provider Example) SKIPPED
17-Jun-2019 00:00:58 [INFO] OAuth for Spring Security - Tonr (OAuth 1 Consumer Example) SKIPPED
17-Jun-2019 00:00:58 [INFO] OAuth for Spring Security - Sparklr2 (OAuth 2 Provider Example) SKIPPED
17-Jun-2019 00:00:58 [INFO] OAuth for Spring Security - Tonr2 (OAuth 2 Client Example) SKIPPED
17-Jun-2019 00:00:58 [INFO] OAuth for Spring Security - Samples ................ SKIPPED
17-Jun-2019 00:00:58 [INFO] ------------------------------------------------------------------------
17-Jun-2019 00:00:58 [INFO] BUILD FAILURE
17-Jun-2019 00:00:58 [INFO] ------------------------------------------------------------------------
17-Jun-2019 00:00:58 [INFO] Total time: 43.256 s
17-Jun-2019 00:00:58 [INFO] Finished at: 2019-06-17T00:00:58+00:00
17-Jun-2019 00:00:58 [INFO] Final Memory: 73M/489M
17-Jun-2019 00:00:58 [INFO] ------------------------------------------------------------------------
17-Jun-2019 00:00:58 [ERROR] Failed to execute goal org.apache.maven.plugins:maven-surefire-plugin:2.12.4:test (default-test) on project spring-security-oauth2: Execution default-test of goal org.apache.maven.plugins:maven-surefire-plugin:2.12.4:test failed: The forked VM terminated without saying properly goodbye. VM crash or System.exit called ? -> [Help 1]
17-Jun-2019 00:00:58 [ERROR]
17-Jun-2019 00:00:58 [ERROR] To see the full stack trace of the errors, re-run Maven with the -e switch.
17-Jun-2019 00:00:58 [ERROR] Re-run Maven using the -X switch to enable full debug logging.
17-Jun-2019 00:00:58 [ERROR]
17-Jun-2019 00:00:58 [ERROR] For more information about the errors and possible solutions, please read the following articles:
17-Jun-2019 00:00:58 [ERROR] [Help 1] http://cwiki.apache.org/confluence/display/MAVEN/PluginExecutionException
17-Jun-2019 00:00:58 [ERROR]
17-Jun-2019 00:00:58 [ERROR] After correcting the problems, you can resume the build with the command
17-Jun-2019 00:00:58 [ERROR]   mvn <goals> -rf :spring-security-oauth2
17-Jun-2019 00:00:58 Exception in thread "main"