Build: #1690 failed Scheduled

Logs

The following logs have been generated by the jobs in this plan.
  • Expand all
  • Collapse all
Job Logs
Collapse Default Job Default Stage Download or View
30-Jun-2019 00:01:01 [INFO] spring-oauth2-tests-xml-client ..................... SKIPPED
30-Jun-2019 00:01:01 [INFO] OAuth for Spring Security - Integration Tests ...... SKIPPED
30-Jun-2019 00:01:01 [INFO] OAuth for Spring Security - Sparklr (OAuth 1 Provider Example) SKIPPED
30-Jun-2019 00:01:01 [INFO] OAuth for Spring Security - Tonr (OAuth 1 Consumer Example) SKIPPED
30-Jun-2019 00:01:01 [INFO] OAuth for Spring Security - Sparklr2 (OAuth 2 Provider Example) SKIPPED
30-Jun-2019 00:01:01 [INFO] OAuth for Spring Security - Tonr2 (OAuth 2 Client Example) SKIPPED
30-Jun-2019 00:01:01 [INFO] OAuth for Spring Security - Samples ................ SKIPPED
30-Jun-2019 00:01:01 [INFO] ------------------------------------------------------------------------
30-Jun-2019 00:01:01 [INFO] BUILD FAILURE
30-Jun-2019 00:01:01 [INFO] ------------------------------------------------------------------------
30-Jun-2019 00:01:01 [INFO] Total time: 43.112 s
30-Jun-2019 00:01:01 [INFO] Finished at: 2019-06-30T00:01:01+00:00
30-Jun-2019 00:01:01 [INFO] Final Memory: 73M/488M
30-Jun-2019 00:01:01 [INFO] ------------------------------------------------------------------------
30-Jun-2019 00:01:01 [ERROR] Failed to execute goal org.apache.maven.plugins:maven-surefire-plugin:2.12.4:test (default-test) on project spring-security-oauth2: Execution default-test of goal org.apache.maven.plugins:maven-surefire-plugin:2.12.4:test failed: The forked VM terminated without saying properly goodbye. VM crash or System.exit called ? -> [Help 1]
30-Jun-2019 00:01:01 [ERROR]
30-Jun-2019 00:01:01 [ERROR] To see the full stack trace of the errors, re-run Maven with the -e switch.
30-Jun-2019 00:01:01 [ERROR] Re-run Maven using the -X switch to enable full debug logging.
30-Jun-2019 00:01:01 [ERROR]
30-Jun-2019 00:01:01 [ERROR] For more information about the errors and possible solutions, please read the following articles:
30-Jun-2019 00:01:01 [ERROR] [Help 1] http://cwiki.apache.org/confluence/display/MAVEN/PluginExecutionException
30-Jun-2019 00:01:01 [ERROR]
30-Jun-2019 00:01:01 [ERROR] After correcting the problems, you can resume the build with the command
30-Jun-2019 00:01:01 [ERROR]   mvn <goals> -rf :spring-security-oauth2
30-Jun-2019 00:01:01 Exception in thread "main"