Build: #1693 failed Scheduled

Logs

The following logs have been generated by the jobs in this plan.
  • Expand all
  • Collapse all
Job Logs
Collapse Default Job Default Stage Download or View
03-Jul-2019 00:01:02 [INFO] spring-oauth2-tests-xml-client ..................... SKIPPED
03-Jul-2019 00:01:02 [INFO] OAuth for Spring Security - Integration Tests ...... SKIPPED
03-Jul-2019 00:01:02 [INFO] OAuth for Spring Security - Sparklr (OAuth 1 Provider Example) SKIPPED
03-Jul-2019 00:01:02 [INFO] OAuth for Spring Security - Tonr (OAuth 1 Consumer Example) SKIPPED
03-Jul-2019 00:01:02 [INFO] OAuth for Spring Security - Sparklr2 (OAuth 2 Provider Example) SKIPPED
03-Jul-2019 00:01:02 [INFO] OAuth for Spring Security - Tonr2 (OAuth 2 Client Example) SKIPPED
03-Jul-2019 00:01:02 [INFO] OAuth for Spring Security - Samples ................ SKIPPED
03-Jul-2019 00:01:02 [INFO] ------------------------------------------------------------------------
03-Jul-2019 00:01:02 [INFO] BUILD FAILURE
03-Jul-2019 00:01:02 [INFO] ------------------------------------------------------------------------
03-Jul-2019 00:01:02 [INFO] Total time: 44.773 s
03-Jul-2019 00:01:02 [INFO] Finished at: 2019-07-03T00:01:02+00:00
03-Jul-2019 00:01:03 [INFO] Final Memory: 73M/528M
03-Jul-2019 00:01:03 [INFO] ------------------------------------------------------------------------
03-Jul-2019 00:01:03 [ERROR] Failed to execute goal org.apache.maven.plugins:maven-surefire-plugin:2.12.4:test (default-test) on project spring-security-oauth2: Execution default-test of goal org.apache.maven.plugins:maven-surefire-plugin:2.12.4:test failed: The forked VM terminated without saying properly goodbye. VM crash or System.exit called ? -> [Help 1]
03-Jul-2019 00:01:03 [ERROR]
03-Jul-2019 00:01:03 [ERROR] To see the full stack trace of the errors, re-run Maven with the -e switch.
03-Jul-2019 00:01:03 [ERROR] Re-run Maven using the -X switch to enable full debug logging.
03-Jul-2019 00:01:03 [ERROR]
03-Jul-2019 00:01:03 [ERROR] For more information about the errors and possible solutions, please read the following articles:
03-Jul-2019 00:01:03 [ERROR] [Help 1] http://cwiki.apache.org/confluence/display/MAVEN/PluginExecutionException
03-Jul-2019 00:01:03 [ERROR]
03-Jul-2019 00:01:03 [ERROR] After correcting the problems, you can resume the build with the command
03-Jul-2019 00:01:03 [ERROR]   mvn <goals> -rf :spring-security-oauth2
03-Jul-2019 00:01:03 Exception in thread "main"