Build: #1639 failed

Job: Default Job failed

Stages & jobs

  1. Default Stage

Build log

The build generated 75 lines of output. Download or view full build log

13-May-2019 00:00:03 Build Spring Security OAuth - 2.1.x - Default Job #1639 (SECOAUTH-NIGHTLY-JOB1-1639) started building on agent bamboo-05.af.pivotal.io
13-May-2019 00:00:03 Remote agent on host bamboo-05.af.pivotal.io
13-May-2019 00:00:03 Build working directory is /opt/bamboo-home/xml-data/build-dir/SECOAUTH-NIGHTLY-JOB1
13-May-2019 00:00:03 Executing build Spring Security OAuth - 2.1.x - Default Job #1639 (SECOAUTH-NIGHTLY-JOB1-1639)
13-May-2019 00:00:03 Starting task 'Checkout Default Repository' of type 'com.atlassian.bamboo.plugins.vcs:task.vcs.checkout'
13-May-2019 00:00:03 Build always requires a clean checkout
13-May-2019 00:00:03 Cleaning build directory '/opt/bamboo-home/xml-data/build-dir/SECOAUTH-NIGHTLY-JOB1'
13-May-2019 00:00:03 Checking out into /opt/bamboo-home/xml-data/build-dir/SECOAUTH-NIGHTLY-JOB1
13-May-2019 00:00:03 Updating source code to revision: bbae0027eceb2c74a21ac26bbc86142dc732ffbe
13-May-2019 00:00:03 Creating local git repository in '/opt/bamboo-home/xml-data/build-dir/SECOAUTH-NIGHTLY-JOB1/.git'.
13-May-2019 00:00:03 Initialized empty Git repository in /opt/bamboo-home/xml-data/build-dir/SECOAUTH-NIGHTLY-JOB1/.git/
13-May-2019 00:00:05 Fetching 'refs/heads/master' from 'git://github.com/SpringSource/spring-security-oauth.git'. Will try to do a shallow fetch.
13-May-2019 00:00:08 From git://github.com/SpringSource/spring-security-oauth
13-May-2019 00:00:08 * [new branch]      master     -> master
13-May-2019 00:00:08 Checking out revision bbae0027eceb2c74a21ac26bbc86142dc732ffbe.
13-May-2019 00:00:08 Already on 'master'
13-May-2019 00:00:08 Updated source code to revision: bbae0027eceb2c74a21ac26bbc86142dc732ffbe
13-May-2019 00:00:08 Finished task 'Checkout Default Repository' with result: Success
13-May-2019 00:00:08 Running pre-build action: Artifactory Release Staging
13-May-2019 00:00:08 Running pre-build action: VCS Version Collector
13-May-2019 00:00:11 Skipping execution of task 'Build' as it is disabled
13-May-2019 00:00:11 Starting task 'Artifactory Maven 3' of type 'org.jfrog.bamboo.bamboo-artifactory-plugin:maven3Task'
13-May-2019 00:00:11 Bamboo Artifactory Plugin version: 2.5.x-SNAPSHOT
13-May-2019 00:00:11
Beginning to execute external process for build 'Spring Security OAuth - 2.1.x - Default Job #1639 (SECOAUTH-NIGHTLY-JOB1-1639)'
... running command line:
/opt/jdk-7/bin/java -cp /opt/maven-3.3/boot/plexus-classworlds-2.5.2.jar -Dclassworlds.conf=/tmp/artifactoryM28180838813328767624conf -DbuildInfoConfig.propertiesFile=/tmp/buildInfo3058006740593426087.properties -Xmx1256m -Xms128m -Dmaven.home=/opt/maven-3.3 -Dmaven.multiModuleProjectDirectory=/opt/bamboo-home/xml-data/build-dir/SECOAUTH-NIGHTLY-JOB1 org.codehaus.plexus.classworlds.launcher.Launcher clean install -P bootstrap -Dartifactory.publish.password=********
... in: /opt/bamboo-home/xml-data/build-dir/SECOAUTH-NIGHTLY-JOB1
... using extra environment variables:
bamboo_planRepository_1_branch=master
IRBRC=/home/bamboo/.rvm/rubies/ruby-2.3.0/.irbrc
bamboo_repository_94273667_previous_revision_number=bbae0027eceb2c74a21ac26bbc86142dc732ffbe
bamboo_********_username_password=********
bamboo_signing_store_password=********
bamboo_capability_system_builder_ant_Ant_1_9=/opt/ant-1.9
bamboo_capability_system_builder_ant_Ant_1_8=/opt/ant-1.8
bamboo_planRepository_1_branchDisplayName=master
bamboo_capability_system_jdk_OpenJDK_7u181=/opt/openjdk-7
bamboo_repository_revision_number=bbae0027eceb2c74a21ac26bbc86142dc732ffbe
bamboo_capability_system_builder_node_Node_js_6=/usr/bin/node
bamboo_RIAK_BIN=/usr/sbin/riak
bamboo_repository_94273667_revision_number=bbae0027eceb2c74a21ac26bbc86142dc732ffbe
WRAPPER_BITS=32
bamboo_buildKey=SECOAUTH-NIGHTLY-JOB1
rvm_loaded_flag=1
bamboo_repository_94273667_git_branch=master
bamboo_bintray_password=********
bamboo_sonar_token_password=********
rvm_version=1.27.0 (latest)
PWD=/opt/bamboo-home/bin
bamboo_shortJobName=Default Job
bamboo_capability_system_builder_gradle___gradlew=./gradlew
bamboo_buildResultsUrl=https://build.spring.io/browse/SECOAUTH-NIGHTLY-JOB1-1639
bamboo_capability_system_builder_mvn3_Maven_3_3=/opt/maven-3.3
bamboo_capability_system_builder_mvn3_Maven_3_2=/opt/maven-3.2
bamboo_capability_system_builder_mvn3_Maven_3_1=/opt/maven-3.1
bamboo_planRepository_repositoryUrl=git://github.com/SpringSource/spring-security-oauth.git
bamboo_agentId=208568324
bamboo_capability_system_builder_mvn3_Maven_3_5=/opt/maven-3.5
MY_RUBY_HOME=/home/bamboo/.rvm/rubies/ruby-2.3.0
bamboo_capability_system_builder_mvn3_Maven_3_0=/opt/maven-3.0
rvm_path=/home/bamboo/.rvm
bamboo_planRepository_revision=bbae0027eceb2c74a21ac26bbc86142dc732ffbe
bamboo_planRepository_previousRevision=bbae0027eceb2c74a21ac26bbc86142dc732ffbe
bamboo_capability_remote_build=true
bamboo_repository_branch_name=master
bamboo_sonatype_token_password=********
SHLVL=1
bamboo_org_jfrog_bamboo_buildInfo_serverUrl=https://repo.spring.io
bamboo_scdf_acceptance_tests_password=********
bamboo_repository_94273667_branch_name=master
WRAPPER_OS=linux
EC2_HOME=/opt/ec2-api-tools
XDG_SESSION_ID=c1
bamboo_capability_Agent=bamboo-05.af.pivotal.io
bamboo_planRepository_branch=master
bamboo_org_jfrog_bamboo_release_activated=false
bamboo_planRepository_1_type=gitv2
bamboo_planRepository_branchName=master
bamboo_capability_system_jdk_JDK_12=/opt/jdk-12
WRAPPER_FILE_SEPARATOR=/
_=/opt/bamboo-home/bin/bamboo-agent.sh
bamboo_repository_94273667_name=Plan Repository
WRAPPER_PATH_SEPARATOR=:
bamboo_sonar_password=********
bamboo_hg_cache_directory=/opt/bamboo-home/xml-data/build-dir/_hg-repositories-cache
bamboo_planRepository_1_username=
bamboo_planRepository_type=gitv2
bamboo_git_cache_directory=/opt/bamboo-home/xml-data/build-dir/_git-repositories-cache
bamboo_artifactory_username=buildmaster
rvm_stored_umask=0002
bamboo_tmp_directory=/opt/bamboo-home/temp
GEM_PATH=/home/bamboo/.rvm/gems/ruby-2.3.0:/home/bamboo/.rvm/gems/ruby-2.3.0@global
bamboo_planKey=SECOAUTH-NIGHTLY
bamboo_planRepository_username=
bamboo_JDK8_HOME=/opt/jdk-8
bamboo_repository_94273667_git_username=
bamboo_planRepository_1_branchName=master
bamboo_sonar_version=5.6.3
XDG_DATA_DIRS=/usr/local/share:/usr/share:/var/lib/snapd/desktop
bamboo_capability_system_jdk_JDK_1_11=/opt/jdk-11
bamboo_resultsUrl=https://build.spring.io/browse/SECOAUTH-NIGHTLY-JOB1-1639
bamboo_capability_system_jdk_JDK_1_10=/opt/jdk-10
bamboo_build_working_directory=/opt/bamboo-home/xml-data/build-dir/SECOAUTH-NIGHTLY-JOB1
bamboo_planRepository_1_name=Plan Repository
bamboo_capability_system_os=ubuntu1604
bamboo_nexusPush_stagingProfile=buildmaster
bamboo_shortPlanName=2.1.x
MAIL=/var/mail/bamboo
bamboo_planRepository_name=Plan Repository
LOGNAME=bamboo
bamboo_buildNumber=1639
rvm_user_install_flag=1
SHELL=/bin/bash
bamboo_planName=Spring Security OAuth - 2.1.x
bamboo_JDK7_HOME=/opt/jdk-7
bamboo_repository_94273667_git_repositoryUrl=git://github.com/SpringSource/spring-security-oauth.git
bamboo_shortPlanKey=NIGHTLY
OLDPWD=/opt/users/bamboo
GEM_HOME=/home/bamboo/.rvm/gems/ruby-2.3.0
bamboo_shortJobKey=JOB1
bamboo_artifactory_password=********
bamboo_buildTimeStamp=2019-05-13T00:00:03.749Z
bamboo_repository_previous_revision_number=bbae0027eceb2c74a21ac26bbc86142dc732ffbe
RUBY_VERSION=ruby-2.3.0
bamboo_sonar_username=buildmaster
_system_name=Ubuntu
bamboo_********_password=********
bamboo_repository_git_branch=master
bamboo_buildResultKey=SECOAUTH-NIGHTLY-JOB1-1639
bamboo_nexusPush_close=true
bamboo_buildPlanName=Spring Security OAuth - 2.1.x - Default Job
bamboo_planRepository_1_revision=bbae0027eceb2c74a21ac26bbc86142dc732ffbe
_system_arch=x86_64
bamboo_repository_name=Plan Repository
rvm_bin_path=/home/bamboo/.rvm/bin
bamboo_signing_key_password=********
rvm_prefix=/home/bamboo
LANG=en_US.UTF-8
bamboo_buildFailed=false
bamboo_capability_system_docker_executable=/usr/bin/docker
DISPLAY=localhost:1.0
bamboo_capability_system_builder_groovy_Groovy_2_4=/opt/groovy-2.4
bamboo_capability_system_builder_command_Bash=/bin/bash
bamboo_artifactory_password_mask_a=********
bamboo_agentWorkingDirectory=/opt/bamboo-home/xml-data/build-dir
bamboo_capability_system_git_executable=/usr/bin/git
bamboo_repository_git_username=
bamboo_planRepository_1_previousRevision=bbae0027eceb2c74a21ac26bbc86142dc732ffbe
bamboo_capability_os_family=unix
NVM_NODEJS_ORG_MIRROR=http://nodejs.org/dist
bamboo_planRepository_branchDisplayName=master
NODE_PATH=/usr/lib/nodejs:/usr/lib/node_modules:/usr/share/javascript
bamboo_capability_system_builder_maven_Artifactory_Maven_3_5=/opt/maven-3.5
GIT_SSL_NO_VERIFY=true
bamboo_capability_system_builder_maven_Artifactory_Maven_3_3=/opt/maven-3.3
NVM_DIR=/home/bamboo/.nvm
bamboo_capability_system_builder_maven_Artifactory_Maven_3_2=/opt/maven-3.2
bamboo_s3_properties=/home/bamboo/tools/s3.properties
bamboo_capability_system_builder_maven_Artifactory_Maven_3_1=/opt/maven-3.1
bamboo_capability_system_builder_maven_Artifactory_Maven_3_0=/opt/maven-3.0
_system_type=Linux
bamboo_plan_storageTag=SECOAUTH-NIGHTLY
bamboo_bintray_username_password=********
_system_version=16.04
USER=bamboo
bamboo_repository_git_repositoryUrl=git://github.com/SpringSource/spring-security-oauth.git
bamboo_working_directory=/opt/bamboo-home/xml-data/build-dir/SECOAUTH-NIGHTLY-JOB1
bamboo_org_jfrog_bamboo_buildInfo_activated=true
bamboo_planRepository_1_repositoryUrl=git://github.com/SpringSource/spring-security-oauth.git
bamboo_capability_system_jdk_JDK_1_8=/opt/jdk-8
bamboo_capability_system_jdk_JDK_1_9=/opt/jdk-9
WRAPPER_ARCH=x86
bamboo_capability_system_jdk_JDK_1_6=/opt/jdk-6
bamboo_sonatype_password=********
bamboo_capability_system_jdk_JDK_1_7=/opt/jdk-7
bamboo_sonar_ip=10.194.6.9
XDG_RUNTIME_DIR=/run/user/505
HOME=/home/bamboo
PATH=/bin:/home/bamboo/.rvm/gems/ruby-2.3.0/bin:/home/bamboo/.rvm/gems/ruby-2.3.0@global/bin:/home/bamboo/.rvm/rubies/ruby-2.3.0/bin:/home/bamboo/bin:/usr/local/bin:/usr/bin:/bin:/usr/local/games:/usr/games:/snap/bin:/home/bamboo/bin:/usr/local/bin:/opt/ec2-api-tools/bin:/home/bamboo/.rvm/bin:/bin:/home/bamboo/.rvm/gems/ruby-2.3.0/bin:/home/bamboo/.rvm/gems/ruby-2.3.0@global/bin:/home/bamboo/.rvm/rubies/ruby-2.3.0/bin:/home/bamboo/bin:/usr/local/bin:/usr/bin:/bin:/usr/local/games:/usr/games:/snap/bin:/home/bamboo/bin:/usr/local/bin:/opt/ec2-api-tools/bin:/home/bamboo/.rvm/bin
13-May-2019 00:00:13 [INFO] Scanning for projects...
13-May-2019 00:00:13 Downloading: https://repo.spring.io/libs-snapshot-local/org/springframework/boot/spring-boot-starter-parent/1.5.1.RELEASE/spring-boot-starter-parent-1.5.1.RELEASE.pom
13-May-2019 00:00:13
13-May-2019 00:00:13 Downloading: https://repo.spring.io/libs-milestone-local/org/springframework/boot/spring-boot-starter-parent/1.5.1.RELEASE/spring-boot-starter-parent-1.5.1.RELEASE.pom
13-May-2019 00:00:13
13-May-2019 00:00:13 Downloading: https://repo.spring.io/release/org/springframework/boot/spring-boot-starter-parent/1.5.1.RELEASE/spring-boot-starter-parent-1.5.1.RELEASE.pom
13-May-2019 00:00:13
13-May-2019 00:00:13 Downloading: https://repo.maven.apache.org/maven2/org/springframework/boot/spring-boot-starter-parent/1.5.1.RELEASE/spring-boot-starter-parent-1.5.1.RELEASE.pom
13-May-2019 00:00:13
13-May-2019 00:00:14 Downloading: https://repo.spring.io/snapshot/org/springframework/spring-framework-bom/4.3.23.BUILD-SNAPSHOT/maven-metadata.xml
13-May-2019 00:00:14
13-May-2019 00:00:14 [WARNING] Could not transfer metadata org.springframework:spring-framework-bom:4.3.23.BUILD-SNAPSHOT/maven-metadata.xml from/to spring-snapshots (https://repo.spring.io/snapshot): Received fatal alert: protocol_version
13-May-2019 00:00:14 [ERROR] [ERROR] Some problems were encountered while processing the POMs:
13-May-2019 00:00:14 [FATAL] Non-resolvable parent POM for org.demo:spring-oauth2-tests-parent:2.3.6.BUILD-SNAPSHOT: Could not transfer artifact org.springframework.boot:spring-boot-starter-parent:pom:1.5.1.RELEASE from/to spring-snapshots (https://repo.spring.io/libs-snapshot-local): Received fatal alert: protocol_version and 'parent.relativePath' points at no local POM @ line 36, column 10
13-May-2019 00:00:14 @
13-May-2019 00:00:14 [ERROR] The build could not read 1 project -> [Help 1]
13-May-2019 00:00:14 [ERROR]   
13-May-2019 00:00:14 [ERROR]   The project org.demo:spring-oauth2-tests-parent:2.3.6.BUILD-SNAPSHOT (/opt/bamboo-home/xml-data/build-dir/SECOAUTH-NIGHTLY-JOB1/tests/annotation/pom.xml) has 1 error
13-May-2019 00:00:14 [ERROR]     Non-resolvable parent POM for org.demo:spring-oauth2-tests-parent:2.3.6.BUILD-SNAPSHOT: Could not transfer artifact org.springframework.boot:spring-boot-starter-parent:pom:1.5.1.RELEASE from/to spring-snapshots (https://repo.spring.io/libs-snapshot-local): Received fatal alert: protocol_version and 'parent.relativePath' points at no local POM @ line 36, column 10 -> [Help 2]
13-May-2019 00:00:14 [ERROR]
13-May-2019 00:00:14 [ERROR] To see the full stack trace of the errors, re-run Maven with the -e switch.
13-May-2019 00:00:14 [ERROR] Re-run Maven using the -X switch to enable full debug logging.
13-May-2019 00:00:14 [ERROR]
13-May-2019 00:00:14 [ERROR] For more information about the errors and possible solutions, please read the following articles:
13-May-2019 00:00:14 [ERROR] [Help 1] http://cwiki.apache.org/confluence/display/MAVEN/ProjectBuildingException
13-May-2019 00:00:14 [ERROR] [Help 2] http://cwiki.apache.org/confluence/display/MAVEN/UnresolvableModelException
13-May-2019 00:00:14
13-May-2019 00:00:14 Failing task since return code of [/opt/jdk-7/bin/java -cp /opt/maven-3.3/boot/plexus-classworlds-2.5.2.jar -Dclassworlds.conf=/tmp/artifactoryM28180838813328767624conf -DbuildInfoConfig.propertiesFile=/tmp/buildInfo3058006740593426087.properties -Xmx1256m -Xms128m -Dmaven.home=/opt/maven-3.3 -Dmaven.multiModuleProjectDirectory=/opt/bamboo-home/xml-data/build-dir/SECOAUTH-NIGHTLY-JOB1 org.codehaus.plexus.classworlds.launcher.Launcher clean install -P bootstrap -Dartifactory.publish.password=********] was 1 while expected 0
13-May-2019 00:00:14 Finished task 'Artifactory Maven 3' with result: Failed
13-May-2019 00:00:14 Running post build plugin 'Docker Container Cleanup'
13-May-2019 00:00:14 Running post build plugin 'NCover Results Collector'
13-May-2019 00:00:14 Running post build plugin 'Artifactory Release Management Staging'
13-May-2019 00:00:14 Running post build plugin 'Artifactory Build Info Copier'
13-May-2019 00:00:14 Running post build plugin 'Artifactory Gradle Properties Info Copier'
13-May-2019 00:00:14 Running post build plugin 'Clover Results Collector'
13-May-2019 00:00:14 Running post build plugin 'npm Cache Cleanup'
13-May-2019 00:00:14 Running post build plugin 'Artifact Copier'
13-May-2019 00:00:14 Successfully removed working directory at '/opt/bamboo-home/xml-data/build-dir/SECOAUTH-NIGHTLY-JOB1'
13-May-2019 00:00:14 Finalising the build...
13-May-2019 00:00:14 Stopping timer.
13-May-2019 00:00:14 Build SECOAUTH-NIGHTLY-JOB1-1639 completed.
13-May-2019 00:00:16 Running on server: post build plugin 'NCover Results Collector'
13-May-2019 00:00:16 Running on server: post build plugin 'Build Hanging Detection Configuration'
13-May-2019 00:00:16 Running on server: post build plugin 'Clover Delta Calculator'
13-May-2019 00:00:16 Running on server: post build plugin 'Maven Dependencies Postprocessor'
13-May-2019 00:00:16 All post build plugins have finished
13-May-2019 00:00:16 Generating build results summary...
13-May-2019 00:00:16 Saving build results to disk...
13-May-2019 00:00:16 Logging substituted variables...
13-May-2019 00:00:16 Indexing build results...
13-May-2019 00:00:16 Finished building SECOAUTH-NIGHTLY-JOB1-1639.