Build: #1647 failed

Job: Default Job failed

Stages & jobs

  1. Default Stage

Build log

The build generated 365 lines of output. Download or view full build log

21-May-2019 00:00:09 Build Spring Security OAuth - 2.1.x - Default Job #1647 (SECOAUTH-NIGHTLY-JOB1-1647) started building on agent bamboo-12.af.pivotal.io
21-May-2019 00:00:09 Remote agent on host bamboo-12.af.pivotal.io
21-May-2019 00:00:15 Build working directory is /opt/bamboo-home/xml-data/build-dir/SECOAUTH-NIGHTLY-JOB1
21-May-2019 00:00:15 Executing build Spring Security OAuth - 2.1.x - Default Job #1647 (SECOAUTH-NIGHTLY-JOB1-1647)
21-May-2019 00:00:15 Starting task 'Checkout Default Repository' of type 'com.atlassian.bamboo.plugins.vcs:task.vcs.checkout'
21-May-2019 00:00:15 Build always requires a clean checkout
21-May-2019 00:00:15 Cleaning build directory '/opt/bamboo-home/xml-data/build-dir/SECOAUTH-NIGHTLY-JOB1'
21-May-2019 00:00:15 Checking out into /opt/bamboo-home/xml-data/build-dir/SECOAUTH-NIGHTLY-JOB1
21-May-2019 00:00:15 Updating source code to revision: bbae0027eceb2c74a21ac26bbc86142dc732ffbe
21-May-2019 00:00:15 Creating local git repository in '/opt/bamboo-home/xml-data/build-dir/SECOAUTH-NIGHTLY-JOB1/.git'.
21-May-2019 00:00:15 Initialized empty Git repository in /opt/bamboo-home/xml-data/build-dir/SECOAUTH-NIGHTLY-JOB1/.git/
21-May-2019 00:00:17 Fetching 'refs/heads/master' from 'git://github.com/SpringSource/spring-security-oauth.git'. Will try to do a shallow fetch.
21-May-2019 00:00:20 From git://github.com/SpringSource/spring-security-oauth
21-May-2019 00:00:20 * [new branch]      master     -> master
21-May-2019 00:00:20 Checking out revision bbae0027eceb2c74a21ac26bbc86142dc732ffbe.
21-May-2019 00:00:20 Already on 'master'
21-May-2019 00:00:20 Updated source code to revision: bbae0027eceb2c74a21ac26bbc86142dc732ffbe
21-May-2019 00:00:20 Finished task 'Checkout Default Repository' with result: Success
21-May-2019 00:00:20 Running pre-build action: Artifactory Release Staging
21-May-2019 00:00:20 Running pre-build action: VCS Version Collector
21-May-2019 00:00:20 Skipping execution of task 'Build' as it is disabled
21-May-2019 00:00:20 Starting task 'Artifactory Maven 3' of type 'org.jfrog.bamboo.bamboo-artifactory-plugin:maven3Task'
21-May-2019 00:00:20 Bamboo Artifactory Plugin version: 2.5.x-SNAPSHOT
21-May-2019 00:00:21
Beginning to execute external process for build 'Spring Security OAuth - 2.1.x - Default Job #1647 (SECOAUTH-NIGHTLY-JOB1-1647)'
... running command line:
/opt/jdk-7/bin/java -cp /opt/maven-3.3/boot/plexus-classworlds-2.5.2.jar -Dclassworlds.conf=/tmp/artifactoryM27985770160240143557conf -DbuildInfoConfig.propertiesFile=/tmp/buildInfo1130930558474880497.properties -Xmx1256m -Xms128m -Dmaven.home=/opt/maven-3.3 -Dmaven.multiModuleProjectDirectory=/opt/bamboo-home/xml-data/build-dir/SECOAUTH-NIGHTLY-JOB1 org.codehaus.plexus.classworlds.launcher.Launcher clean install -P bootstrap -Dartifactory.publish.password=********
... in: /opt/bamboo-home/xml-data/build-dir/SECOAUTH-NIGHTLY-JOB1
... using extra environment variables:
bamboo_planRepository_1_branch=master
IRBRC=/home/bamboo/.rvm/rubies/ruby-2.3.0/.irbrc
bamboo_repository_94273667_previous_revision_number=bbae0027eceb2c74a21ac26bbc86142dc732ffbe
bamboo_********_username_password=********
bamboo_signing_store_password=********
bamboo_capability_system_builder_ant_Ant_1_9=/opt/ant-1.9
bamboo_capability_system_builder_ant_Ant_1_8=/opt/ant-1.8
bamboo_planRepository_1_branchDisplayName=master
bamboo_capability_system_jdk_OpenJDK_7u181=/opt/openjdk-7
bamboo_repository_revision_number=bbae0027eceb2c74a21ac26bbc86142dc732ffbe
bamboo_capability_system_builder_node_Node_js_6=/usr/bin/node
bamboo_RIAK_BIN=/usr/sbin/riak
bamboo_repository_94273667_revision_number=bbae0027eceb2c74a21ac26bbc86142dc732ffbe
WRAPPER_BITS=32
bamboo_buildKey=SECOAUTH-NIGHTLY-JOB1
rvm_loaded_flag=1
bamboo_repository_94273667_git_branch=master
bamboo_bintray_password=********
bamboo_sonar_token_password=********
rvm_version=1.27.0 (latest)
PWD=/opt/bamboo-home/bin
bamboo_shortJobName=Default Job
bamboo_capability_system_builder_gradle___gradlew=./gradlew
bamboo_buildResultsUrl=https://build.spring.io/browse/SECOAUTH-NIGHTLY-JOB1-1647
bamboo_capability_system_builder_mvn3_Maven_3_3=/opt/maven-3.3
bamboo_capability_system_builder_mvn3_Maven_3_2=/opt/maven-3.2
bamboo_capability_system_builder_mvn3_Maven_3_1=/opt/maven-3.1
bamboo_planRepository_repositoryUrl=git://github.com/SpringSource/spring-security-oauth.git
bamboo_agentId=208568336
bamboo_capability_system_builder_mvn3_Maven_3_5=/opt/maven-3.5
MY_RUBY_HOME=/home/bamboo/.rvm/rubies/ruby-2.3.0
bamboo_capability_system_builder_mvn3_Maven_3_0=/opt/maven-3.0
rvm_path=/home/bamboo/.rvm
bamboo_planRepository_revision=bbae0027eceb2c74a21ac26bbc86142dc732ffbe
bamboo_planRepository_previousRevision=bbae0027eceb2c74a21ac26bbc86142dc732ffbe
bamboo_capability_remote_build=true
bamboo_repository_branch_name=master
bamboo_sonatype_token_password=********
SHLVL=1
bamboo_org_jfrog_bamboo_buildInfo_serverUrl=https://repo.spring.io
bamboo_scdf_acceptance_tests_password=********
bamboo_repository_94273667_branch_name=master
WRAPPER_OS=linux
EC2_HOME=/opt/ec2-api-tools
XDG_SESSION_ID=c1
bamboo_capability_Agent=bamboo-12.af.pivotal.io
bamboo_planRepository_branch=master
bamboo_org_jfrog_bamboo_release_activated=false
bamboo_planRepository_1_type=gitv2
bamboo_planRepository_branchName=master
bamboo_capability_system_jdk_JDK_12=/opt/jdk-12
WRAPPER_FILE_SEPARATOR=/
_=/opt/bamboo-home/bin/bamboo-agent.sh
bamboo_repository_94273667_name=Plan Repository
WRAPPER_PATH_SEPARATOR=:
bamboo_sonar_password=********
bamboo_hg_cache_directory=/opt/bamboo-home/xml-data/build-dir/_hg-repositories-cache
bamboo_planRepository_1_username=
bamboo_planRepository_type=gitv2
bamboo_git_cache_directory=/opt/bamboo-home/xml-data/build-dir/_git-repositories-cache
bamboo_artifactory_username=buildmaster
rvm_stored_umask=0002
bamboo_tmp_directory=/opt/bamboo-home/temp
GEM_PATH=/home/bamboo/.rvm/gems/ruby-2.3.0:/home/bamboo/.rvm/gems/ruby-2.3.0@global
bamboo_planKey=SECOAUTH-NIGHTLY
bamboo_planRepository_username=
bamboo_JDK8_HOME=/opt/jdk-8
bamboo_repository_94273667_git_username=
bamboo_planRepository_1_branchName=master
bamboo_sonar_version=5.6.3
XDG_DATA_DIRS=/usr/local/share:/usr/share:/var/lib/snapd/desktop
bamboo_capability_system_jdk_JDK_1_11=/opt/jdk-11
bamboo_resultsUrl=https://build.spring.io/browse/SECOAUTH-NIGHTLY-JOB1-1647
bamboo_capability_system_jdk_JDK_1_10=/opt/jdk-10
bamboo_build_working_directory=/opt/bamboo-home/xml-data/build-dir/SECOAUTH-NIGHTLY-JOB1
bamboo_planRepository_1_name=Plan Repository
bamboo_capability_system_os=ubuntu1604
bamboo_nexusPush_stagingProfile=buildmaster
bamboo_shortPlanName=2.1.x
MAIL=/var/mail/bamboo
bamboo_planRepository_name=Plan Repository
LOGNAME=bamboo
bamboo_buildNumber=1647
rvm_user_install_flag=1
SHELL=/bin/bash
bamboo_planName=Spring Security OAuth - 2.1.x
bamboo_JDK7_HOME=/opt/jdk-7
bamboo_repository_94273667_git_repositoryUrl=git://github.com/SpringSource/spring-security-oauth.git
bamboo_shortPlanKey=NIGHTLY
OLDPWD=/opt/users/bamboo
GEM_HOME=/home/bamboo/.rvm/gems/ruby-2.3.0
bamboo_shortJobKey=JOB1
bamboo_artifactory_password=********
bamboo_buildTimeStamp=2019-05-21T00:00:04.591Z
bamboo_repository_previous_revision_number=bbae0027eceb2c74a21ac26bbc86142dc732ffbe
RUBY_VERSION=ruby-2.3.0
bamboo_sonar_username=buildmaster
_system_name=Ubuntu
bamboo_********_password=********
bamboo_repository_git_branch=master
bamboo_buildResultKey=SECOAUTH-NIGHTLY-JOB1-1647
bamboo_nexusPush_close=true
bamboo_buildPlanName=Spring Security OAuth - 2.1.x - Default Job
bamboo_planRepository_1_revision=bbae0027eceb2c74a21ac26bbc86142dc732ffbe
_system_arch=x86_64
bamboo_repository_name=Plan Repository
rvm_bin_path=/home/bamboo/.rvm/bin
bamboo_signing_key_password=********
rvm_prefix=/home/bamboo
LANG=en_US.UTF-8
bamboo_buildFailed=false
bamboo_capability_system_docker_executable=/usr/bin/docker
DISPLAY=localhost:1.0
bamboo_capability_system_builder_groovy_Groovy_2_4=/opt/groovy-2.4
bamboo_capability_system_builder_command_Bash=/bin/bash
bamboo_artifactory_password_mask_a=********
bamboo_agentWorkingDirectory=/opt/bamboo-home/xml-data/build-dir
bamboo_capability_system_git_executable=/usr/bin/git
bamboo_repository_git_username=
bamboo_planRepository_1_previousRevision=bbae0027eceb2c74a21ac26bbc86142dc732ffbe
bamboo_capability_os_family=unix
NVM_NODEJS_ORG_MIRROR=http://nodejs.org/dist
bamboo_planRepository_branchDisplayName=master
NODE_PATH=/usr/lib/nodejs:/usr/lib/node_modules:/usr/share/javascript
bamboo_capability_system_builder_maven_Artifactory_Maven_3_5=/opt/maven-3.5
GIT_SSL_NO_VERIFY=true
bamboo_capability_system_builder_maven_Artifactory_Maven_3_3=/opt/maven-3.3
NVM_DIR=/home/bamboo/.nvm
bamboo_capability_system_builder_maven_Artifactory_Maven_3_2=/opt/maven-3.2
bamboo_s3_properties=/home/bamboo/tools/s3.properties
bamboo_capability_system_builder_maven_Artifactory_Maven_3_1=/opt/maven-3.1
bamboo_capability_system_builder_maven_Artifactory_Maven_3_0=/opt/maven-3.0
_system_type=Linux
bamboo_plan_storageTag=SECOAUTH-NIGHTLY
bamboo_bintray_username_password=********
_system_version=16.04
USER=bamboo
bamboo_repository_git_repositoryUrl=git://github.com/SpringSource/spring-security-oauth.git
bamboo_working_directory=/opt/bamboo-home/xml-data/build-dir/SECOAUTH-NIGHTLY-JOB1
bamboo_org_jfrog_bamboo_buildInfo_activated=true
bamboo_planRepository_1_repositoryUrl=git://github.com/SpringSource/spring-security-oauth.git
bamboo_capability_system_jdk_JDK_1_8=/opt/jdk-8
bamboo_capability_system_jdk_JDK_1_9=/opt/jdk-9
WRAPPER_ARCH=x86
bamboo_capability_system_jdk_JDK_1_6=/opt/jdk-6
bamboo_sonatype_password=********
bamboo_capability_system_jdk_JDK_1_7=/opt/jdk-7
bamboo_sonar_ip=10.194.6.9
XDG_RUNTIME_DIR=/run/user/505
HOME=/home/bamboo
PATH=/bin:/home/bamboo/.rvm/gems/ruby-2.3.0/bin:/home/bamboo/.rvm/gems/ruby-2.3.0@global/bin:/home/bamboo/.rvm/rubies/ruby-2.3.0/bin:/home/bamboo/bin:/usr/local/bin:/usr/bin:/bin:/usr/local/games:/usr/games:/snap/bin:/home/bamboo/bin:/usr/local/bin:/opt/ec2-api-tools/bin:/home/bamboo/.rvm/bin:/bin:/home/bamboo/.rvm/gems/ruby-2.3.0/bin:/home/bamboo/.rvm/gems/ruby-2.3.0@global/bin:/home/bamboo/.rvm/rubies/ruby-2.3.0/bin:/home/bamboo/bin:/usr/local/bin:/usr/bin:/bin:/usr/local/games:/usr/games:/snap/bin:/home/bamboo/bin:/usr/local/bin:/opt/ec2-api-tools/bin:/home/bamboo/.rvm/bin
21-May-2019 00:00:22 [INFO] Scanning for projects...
21-May-2019 00:00:23 Downloading: https://repo.spring.io/libs-snapshot-local/org/springframework/spring-framework-bom/4.3.23.BUILD-SNAPSHOT/maven-metadata.xml
21-May-2019 00:00:23
21-May-2019 00:00:23 [WARNING] Could not transfer metadata org.springframework:spring-framework-bom:4.3.23.BUILD-SNAPSHOT/maven-metadata.xml from/to spring-snapshots (https://repo.spring.io/libs-snapshot-local): Received fatal alert: protocol_version
21-May-2019 00:00:23 Downloading: https://repo.spring.io/snapshot/org/springframework/spring-framework-bom/4.3.23.BUILD-SNAPSHOT/maven-metadata.xml
21-May-2019 00:00:23
21-May-2019 00:00:23 [WARNING] Could not transfer metadata org.springframework:spring-framework-bom:4.3.23.BUILD-SNAPSHOT/maven-metadata.xml from/to spring-snapshots (https://repo.spring.io/snapshot): Received fatal alert: protocol_version
21-May-2019 00:00:24 [WARNING] Failure to transfer org.springframework:spring-framework-bom:4.3.23.BUILD-SNAPSHOT/maven-metadata.xml from https://repo.spring.io/snapshot was cached in the local repository, resolution will not be reattempted until the update interval of spring-snapshots has elapsed or updates are forced. Original error: Could not transfer metadata org.springframework:spring-framework-bom:4.3.23.BUILD-SNAPSHOT/maven-metadata.xml from/to spring-snapshots (https://repo.spring.io/snapshot): Received fatal alert: protocol_version
21-May-2019 00:00:24 [INFO] Initializing Artifactory Build-Info Recording
21-May-2019 00:00:24 [INFO] ------------------------------------------------------------------------
21-May-2019 00:00:24 [INFO] Reactor Build Order:
21-May-2019 00:00:24 [INFO]
21-May-2019 00:00:24 [INFO] OAuth for Spring Security
21-May-2019 00:00:24 [INFO] OAuth 1(a) for Spring Security
21-May-2019 00:00:24 [INFO] OAuth2 for Spring Security
21-May-2019 00:00:24 [INFO] spring-oauth2-tests
21-May-2019 00:00:24 [INFO] spring-oauth2-tests-common
21-May-2019 00:00:24 [INFO] spring-oauth2-tests-vanilla
21-May-2019 00:00:24 [INFO] spring-oauth2-tests-mappings
21-May-2019 00:00:24 [INFO] spring-oauth2-tests-form
21-May-2019 00:00:24 [INFO] spring-oauth2-tests-jwt
21-May-2019 00:00:24 [INFO] spring-oauth2-tests-approval
21-May-2019 00:00:24 [INFO] spring-oauth2-tests-jdbc
21-May-2019 00:00:24 [INFO] spring-oauth2-tests-jpa
21-May-2019 00:00:24 [INFO] spring-oauth2-tests-jaxb
21-May-2019 00:00:24 [INFO] spring-oauth-tests-custom-grant
21-May-2019 00:00:24 [INFO] spring-oauth2-tests-multi
21-May-2019 00:00:24 [INFO] spring-oauth2-tests-client
21-May-2019 00:00:24 [INFO] spring-oauth2-tests-resource
21-May-2019 00:00:24 [INFO] spring-oauth2-tests-custom-authentication
21-May-2019 00:00:24 [INFO] spring-oauth2-tests-xml
21-May-2019 00:00:24 [INFO] spring-oauth2-tests-xml-common
21-May-2019 00:00:24 [INFO] spring-oauth2-tests-xml-vanilla
21-May-2019 00:00:24 [INFO] spring-oauth2-tests-xml-mappings
21-May-2019 00:00:24 [INFO] spring-oauth2-tests-xml-form
21-May-2019 00:00:24 [INFO] spring-oauth2-tests-xml-jwt
21-May-2019 00:00:24 [INFO] spring-oauth2-tests-xml-approval
21-May-2019 00:00:24 [INFO] spring-oauth2-tests-xml-jdbc
21-May-2019 00:00:24 [INFO] spring-oauth2-tests-xml-client
21-May-2019 00:00:24 [INFO] OAuth for Spring Security - Integration Tests
21-May-2019 00:00:24 [INFO] OAuth for Spring Security - Sparklr (OAuth 1 Provider Example)
21-May-2019 00:00:24 [INFO] OAuth for Spring Security - Tonr (OAuth 1 Consumer Example)
21-May-2019 00:00:24 [INFO] OAuth for Spring Security - Sparklr2 (OAuth 2 Provider Example)
21-May-2019 00:00:24 [INFO] OAuth for Spring Security - Tonr2 (OAuth 2 Client Example)
21-May-2019 00:00:24 [INFO] OAuth for Spring Security - Samples
21-May-2019 00:00:24 [INFO]                                                                         
21-May-2019 00:00:24 [INFO] ------------------------------------------------------------------------
21-May-2019 00:00:24 [INFO] Building OAuth for Spring Security 2.3.6.BUILD-SNAPSHOT
21-May-2019 00:00:24 [INFO] ------------------------------------------------------------------------
21-May-2019 00:00:24 [INFO]
21-May-2019 00:00:24 [INFO] --- maven-clean-plugin:2.5:clean (default-clean) @ spring-security-oauth-parent ---
21-May-2019 00:00:24 [INFO]
21-May-2019 00:00:24 [INFO] >>> maven-source-plugin:2.1.2:jar (attach-sources) > generate-sources @ spring-security-oauth-parent >>>
21-May-2019 00:00:24 [INFO]
21-May-2019 00:00:24 [INFO] <<< maven-source-plugin:2.1.2:jar (attach-sources) < generate-sources @ spring-security-oauth-parent <<<
21-May-2019 00:00:24 [INFO]
21-May-2019 00:00:24 [INFO] --- maven-source-plugin:2.1.2:jar (attach-sources) @ spring-security-oauth-parent ---
21-May-2019 00:00:24 [INFO]
21-May-2019 00:00:24 [INFO] --- maven-javadoc-plugin:2.9.1:jar (javadoc) @ spring-security-oauth-parent ---
21-May-2019 00:00:25 [INFO] Not executing Javadoc as the project is not a Java classpath-capable package
21-May-2019 00:00:25 [INFO]
21-May-2019 00:00:25 [INFO] --- maven-install-plugin:2.4:install (default-install) @ spring-security-oauth-parent ---
21-May-2019 00:00:25 [INFO] Installing /opt/bamboo-home/xml-data/build-dir/SECOAUTH-NIGHTLY-JOB1/pom.xml to /home/bamboo/.m2/repository/org/springframework/security/oauth/spring-security-oauth-parent/2.3.6.BUILD-SNAPSHOT/spring-security-oauth-parent-2.3.6.BUILD-SNAPSHOT.pom
21-May-2019 00:00:25 [INFO]                                                                         
21-May-2019 00:00:25 [INFO] ------------------------------------------------------------------------
21-May-2019 00:00:25 [INFO] Building OAuth 1(a) for Spring Security 2.3.6.BUILD-SNAPSHOT
21-May-2019 00:00:25 [INFO] ------------------------------------------------------------------------
21-May-2019 00:00:25 Downloading: https://repo.spring.io/libs-milestone-local/org/springframework/spring-beans/4.3.23.BUILD-SNAPSHOT/maven-metadata.xml
21-May-2019 00:00:25 Downloading: https://repo.spring.io/libs-release-local/org/springframework/spring-beans/4.3.23.BUILD-SNAPSHOT/maven-metadata.xml
21-May-2019 00:00:25 Downloading: https://repo.spring.io/libs-snapshot-local/org/springframework/spring-beans/4.3.23.BUILD-SNAPSHOT/maven-metadata.xml
21-May-2019 00:00:25 Downloading: https://oauth.googlecode.com/svn/code/maven/org/springframework/spring-beans/4.3.23.BUILD-SNAPSHOT/maven-metadata.xml
21-May-2019 00:00:25
21-May-2019 00:00:25
21-May-2019 00:00:25
21-May-2019 00:00:25
21-May-2019 00:00:25 [WARNING] Could not transfer metadata org.springframework:spring-beans:4.3.23.BUILD-SNAPSHOT/maven-metadata.xml from/to repo.spring.io-milestone (https://repo.spring.io/libs-milestone-local): Received fatal alert: protocol_version
21-May-2019 00:00:25 [WARNING] Could not transfer metadata org.springframework:spring-beans:4.3.23.BUILD-SNAPSHOT/maven-metadata.xml from/to repo.spring.io-release (https://repo.spring.io/libs-release-local): Received fatal alert: protocol_version
21-May-2019 00:00:25 [WARNING] Could not transfer metadata org.springframework:spring-beans:4.3.23.BUILD-SNAPSHOT/maven-metadata.xml from/to repo.spring.io-snapshot (https://repo.spring.io/libs-snapshot-local): Received fatal alert: protocol_version
21-May-2019 00:00:25 [WARNING] Failure to transfer org.springframework:spring-beans:4.3.23.BUILD-SNAPSHOT/maven-metadata.xml from https://repo.spring.io/libs-milestone-local was cached in the local repository, resolution will not be reattempted until the update interval of repo.spring.io-milestone has elapsed or updates are forced. Original error: Could not transfer metadata org.springframework:spring-beans:4.3.23.BUILD-SNAPSHOT/maven-metadata.xml from/to repo.spring.io-milestone (https://repo.spring.io/libs-milestone-local): Received fatal alert: protocol_version
21-May-2019 00:00:25 [WARNING] Failure to transfer org.springframework:spring-beans:4.3.23.BUILD-SNAPSHOT/maven-metadata.xml from https://repo.spring.io/libs-release-local was cached in the local repository, resolution will not be reattempted until the update interval of repo.spring.io-release has elapsed or updates are forced. Original error: Could not transfer metadata org.springframework:spring-beans:4.3.23.BUILD-SNAPSHOT/maven-metadata.xml from/to repo.spring.io-release (https://repo.spring.io/libs-release-local): Received fatal alert: protocol_version
21-May-2019 00:00:25 [WARNING] Failure to transfer org.springframework:spring-beans:4.3.23.BUILD-SNAPSHOT/maven-metadata.xml from https://repo.spring.io/libs-snapshot-local was cached in the local repository, resolution will not be reattempted until the update interval of repo.spring.io-snapshot has elapsed or updates are forced. Original error: Could not transfer metadata org.springframework:spring-beans:4.3.23.BUILD-SNAPSHOT/maven-metadata.xml from/to repo.spring.io-snapshot (https://repo.spring.io/libs-snapshot-local): Received fatal alert: protocol_version
21-May-2019 00:00:25 Downloading: https://repo.spring.io/libs-milestone-local/org/springframework/spring-beans/4.3.23.BUILD-SNAPSHOT/spring-beans-4.3.23.BUILD-SNAPSHOT.pom
21-May-2019 00:00:25
21-May-2019 00:00:25 Downloading: https://repo.spring.io/libs-release-local/org/springframework/spring-beans/4.3.23.BUILD-SNAPSHOT/spring-beans-4.3.23.BUILD-SNAPSHOT.pom
21-May-2019 00:00:25
21-May-2019 00:00:25 Downloading: https://repo.spring.io/libs-snapshot-local/org/springframework/spring-beans/4.3.23.BUILD-SNAPSHOT/spring-beans-4.3.23.BUILD-SNAPSHOT.pom
21-May-2019 00:00:25
21-May-2019 00:00:25 Downloading: https://oauth.googlecode.com/svn/code/maven/org/springframework/spring-beans/4.3.23.BUILD-SNAPSHOT/spring-beans-4.3.23.BUILD-SNAPSHOT.pom
21-May-2019 00:00:25
21-May-2019 00:00:25 Downloading: https://repo.spring.io/libs-release-local/org/springframework/spring-core/4.3.23.BUILD-SNAPSHOT/maven-metadata.xml
21-May-2019 00:00:25 Downloading: https://repo.spring.io/libs-milestone-local/org/springframework/spring-core/4.3.23.BUILD-SNAPSHOT/maven-metadata.xml
21-May-2019 00:00:25 Downloading: https://oauth.googlecode.com/svn/code/maven/org/springframework/spring-core/4.3.23.BUILD-SNAPSHOT/maven-metadata.xml
21-May-2019 00:00:25 Downloading: https://repo.spring.io/libs-snapshot-local/org/springframework/spring-core/4.3.23.BUILD-SNAPSHOT/maven-metadata.xml
21-May-2019 00:00:25
21-May-2019 00:00:25
21-May-2019 00:00:25
21-May-2019 00:00:26
21-May-2019 00:00:26 [WARNING] Could not transfer metadata org.springframework:spring-core:4.3.23.BUILD-SNAPSHOT/maven-metadata.xml from/to repo.spring.io-milestone (https://repo.spring.io/libs-milestone-local): Received fatal alert: protocol_version
21-May-2019 00:00:26 [WARNING] Could not transfer metadata org.springframework:spring-core:4.3.23.BUILD-SNAPSHOT/maven-metadata.xml from/to repo.spring.io-release (https://repo.spring.io/libs-release-local): Received fatal alert: protocol_version
21-May-2019 00:00:26 [WARNING] Could not transfer metadata org.springframework:spring-core:4.3.23.BUILD-SNAPSHOT/maven-metadata.xml from/to repo.spring.io-snapshot (https://repo.spring.io/libs-snapshot-local): Received fatal alert: protocol_version
21-May-2019 00:00:26 [WARNING] Failure to transfer org.springframework:spring-core:4.3.23.BUILD-SNAPSHOT/maven-metadata.xml from https://repo.spring.io/libs-milestone-local was cached in the local repository, resolution will not be reattempted until the update interval of repo.spring.io-milestone has elapsed or updates are forced. Original error: Could not transfer metadata org.springframework:spring-core:4.3.23.BUILD-SNAPSHOT/maven-metadata.xml from/to repo.spring.io-milestone (https://repo.spring.io/libs-milestone-local): Received fatal alert: protocol_version
21-May-2019 00:00:26 [WARNING] Failure to transfer org.springframework:spring-core:4.3.23.BUILD-SNAPSHOT/maven-metadata.xml from https://repo.spring.io/libs-release-local was cached in the local repository, resolution will not be reattempted until the update interval of repo.spring.io-release has elapsed or updates are forced. Original error: Could not transfer metadata org.springframework:spring-core:4.3.23.BUILD-SNAPSHOT/maven-metadata.xml from/to repo.spring.io-release (https://repo.spring.io/libs-release-local): Received fatal alert: protocol_version
21-May-2019 00:00:26 [WARNING] Failure to transfer org.springframework:spring-core:4.3.23.BUILD-SNAPSHOT/maven-metadata.xml from https://repo.spring.io/libs-snapshot-local was cached in the local repository, resolution will not be reattempted until the update interval of repo.spring.io-snapshot has elapsed or updates are forced. Original error: Could not transfer metadata org.springframework:spring-core:4.3.23.BUILD-SNAPSHOT/maven-metadata.xml from/to repo.spring.io-snapshot (https://repo.spring.io/libs-snapshot-local): Received fatal alert: protocol_version
21-May-2019 00:00:26 Downloading: https://repo.spring.io/libs-milestone-local/org/springframework/spring-core/4.3.23.BUILD-SNAPSHOT/spring-core-4.3.23.BUILD-SNAPSHOT.pom
21-May-2019 00:00:26
21-May-2019 00:00:26 Downloading: https://repo.spring.io/libs-release-local/org/springframework/spring-core/4.3.23.BUILD-SNAPSHOT/spring-core-4.3.23.BUILD-SNAPSHOT.pom
21-May-2019 00:00:26
21-May-2019 00:00:26 Downloading: https://repo.spring.io/libs-snapshot-local/org/springframework/spring-core/4.3.23.BUILD-SNAPSHOT/spring-core-4.3.23.BUILD-SNAPSHOT.pom
21-May-2019 00:00:26
21-May-2019 00:00:26 Downloading: https://oauth.googlecode.com/svn/code/maven/org/springframework/spring-core/4.3.23.BUILD-SNAPSHOT/spring-core-4.3.23.BUILD-SNAPSHOT.pom
21-May-2019 00:00:26
21-May-2019 00:00:26 Downloading: https://repo.spring.io/libs-milestone-local/org/springframework/spring-context/4.3.23.BUILD-SNAPSHOT/maven-metadata.xml
21-May-2019 00:00:26 Downloading: https://repo.spring.io/libs-release-local/org/springframework/spring-context/4.3.23.BUILD-SNAPSHOT/maven-metadata.xml
21-May-2019 00:00:26 Downloading: https://repo.spring.io/libs-snapshot-local/org/springframework/spring-context/4.3.23.BUILD-SNAPSHOT/maven-metadata.xml
21-May-2019 00:00:26 Downloading: https://oauth.googlecode.com/svn/code/maven/org/springframework/spring-context/4.3.23.BUILD-SNAPSHOT/maven-metadata.xml
21-May-2019 00:00:26
21-May-2019 00:00:26
21-May-2019 00:00:26
21-May-2019 00:00:26
21-May-2019 00:00:26 [WARNING] Could not transfer metadata org.springframework:spring-context:4.3.23.BUILD-SNAPSHOT/maven-metadata.xml from/to repo.spring.io-milestone (https://repo.spring.io/libs-milestone-local): Received fatal alert: protocol_version
21-May-2019 00:00:26 [WARNING] Could not transfer metadata org.springframework:spring-context:4.3.23.BUILD-SNAPSHOT/maven-metadata.xml from/to repo.spring.io-release (https://repo.spring.io/libs-release-local): Received fatal alert: protocol_version
21-May-2019 00:00:26 [WARNING] Could not transfer metadata org.springframework:spring-context:4.3.23.BUILD-SNAPSHOT/maven-metadata.xml from/to repo.spring.io-snapshot (https://repo.spring.io/libs-snapshot-local): Received fatal alert: protocol_version
21-May-2019 00:00:26 [WARNING] Failure to transfer org.springframework:spring-context:4.3.23.BUILD-SNAPSHOT/maven-metadata.xml from https://repo.spring.io/libs-milestone-local was cached in the local repository, resolution will not be reattempted until the update interval of repo.spring.io-milestone has elapsed or updates are forced. Original error: Could not transfer metadata org.springframework:spring-context:4.3.23.BUILD-SNAPSHOT/maven-metadata.xml from/to repo.spring.io-milestone (https://repo.spring.io/libs-milestone-local): Received fatal alert: protocol_version
21-May-2019 00:00:26 [WARNING] Failure to transfer org.springframework:spring-context:4.3.23.BUILD-SNAPSHOT/maven-metadata.xml from https://repo.spring.io/libs-release-local was cached in the local repository, resolution will not be reattempted until the update interval of repo.spring.io-release has elapsed or updates are forced. Original error: Could not transfer metadata org.springframework:spring-context:4.3.23.BUILD-SNAPSHOT/maven-metadata.xml from/to repo.spring.io-release (https://repo.spring.io/libs-release-local): Received fatal alert: protocol_version
21-May-2019 00:00:26 [WARNING] Failure to transfer org.springframework:spring-context:4.3.23.BUILD-SNAPSHOT/maven-metadata.xml from https://repo.spring.io/libs-snapshot-local was cached in the local repository, resolution will not be reattempted until the update interval of repo.spring.io-snapshot has elapsed or updates are forced. Original error: Could not transfer metadata org.springframework:spring-context:4.3.23.BUILD-SNAPSHOT/maven-metadata.xml from/to repo.spring.io-snapshot (https://repo.spring.io/libs-snapshot-local): Received fatal alert: protocol_version
21-May-2019 00:00:26 Downloading: https://repo.spring.io/libs-milestone-local/org/springframework/spring-context/4.3.23.BUILD-SNAPSHOT/spring-context-4.3.23.BUILD-SNAPSHOT.pom
21-May-2019 00:00:26
21-May-2019 00:00:26 Downloading: https://repo.spring.io/libs-release-local/org/springframework/spring-context/4.3.23.BUILD-SNAPSHOT/spring-context-4.3.23.BUILD-SNAPSHOT.pom
21-May-2019 00:00:26
21-May-2019 00:00:26 Downloading: https://repo.spring.io/libs-snapshot-local/org/springframework/spring-context/4.3.23.BUILD-SNAPSHOT/spring-context-4.3.23.BUILD-SNAPSHOT.pom
21-May-2019 00:00:26
21-May-2019 00:00:26 Downloading: https://oauth.googlecode.com/svn/code/maven/org/springframework/spring-context/4.3.23.BUILD-SNAPSHOT/spring-context-4.3.23.BUILD-SNAPSHOT.pom
21-May-2019 00:00:26
21-May-2019 00:00:26 Downloading: https://repo.spring.io/libs-milestone-local/org/springframework/spring-web/4.3.23.BUILD-SNAPSHOT/maven-metadata.xml
21-May-2019 00:00:26 Downloading: https://repo.spring.io/libs-release-local/org/springframework/spring-web/4.3.23.BUILD-SNAPSHOT/maven-metadata.xml
21-May-2019 00:00:26 Downloading: https://repo.spring.io/libs-snapshot-local/org/springframework/spring-web/4.3.23.BUILD-SNAPSHOT/maven-metadata.xml
21-May-2019 00:00:26 Downloading: https://oauth.googlecode.com/svn/code/maven/org/springframework/spring-web/4.3.23.BUILD-SNAPSHOT/maven-metadata.xml
21-May-2019 00:00:26
21-May-2019 00:00:26
21-May-2019 00:00:26
21-May-2019 00:00:26
21-May-2019 00:00:26 [WARNING] Could not transfer metadata org.springframework:spring-web:4.3.23.BUILD-SNAPSHOT/maven-metadata.xml from/to repo.spring.io-milestone (https://repo.spring.io/libs-milestone-local): Received fatal alert: protocol_version
21-May-2019 00:00:26 [WARNING] Could not transfer metadata org.springframework:spring-web:4.3.23.BUILD-SNAPSHOT/maven-metadata.xml from/to repo.spring.io-release (https://repo.spring.io/libs-release-local): Received fatal alert: protocol_version
21-May-2019 00:00:26 [WARNING] Could not transfer metadata org.springframework:spring-web:4.3.23.BUILD-SNAPSHOT/maven-metadata.xml from/to repo.spring.io-snapshot (https://repo.spring.io/libs-snapshot-local): Received fatal alert: protocol_version
21-May-2019 00:00:26 [WARNING] Failure to transfer org.springframework:spring-web:4.3.23.BUILD-SNAPSHOT/maven-metadata.xml from https://repo.spring.io/libs-milestone-local was cached in the local repository, resolution will not be reattempted until the update interval of repo.spring.io-milestone has elapsed or updates are forced. Original error: Could not transfer metadata org.springframework:spring-web:4.3.23.BUILD-SNAPSHOT/maven-metadata.xml from/to repo.spring.io-milestone (https://repo.spring.io/libs-milestone-local): Received fatal alert: protocol_version
21-May-2019 00:00:26 [WARNING] Failure to transfer org.springframework:spring-web:4.3.23.BUILD-SNAPSHOT/maven-metadata.xml from https://repo.spring.io/libs-release-local was cached in the local repository, resolution will not be reattempted until the update interval of repo.spring.io-release has elapsed or updates are forced. Original error: Could not transfer metadata org.springframework:spring-web:4.3.23.BUILD-SNAPSHOT/maven-metadata.xml from/to repo.spring.io-release (https://repo.spring.io/libs-release-local): Received fatal alert: protocol_version
21-May-2019 00:00:26 [WARNING] Failure to transfer org.springframework:spring-web:4.3.23.BUILD-SNAPSHOT/maven-metadata.xml from https://repo.spring.io/libs-snapshot-local was cached in the local repository, resolution will not be reattempted until the update interval of repo.spring.io-snapshot has elapsed or updates are forced. Original error: Could not transfer metadata org.springframework:spring-web:4.3.23.BUILD-SNAPSHOT/maven-metadata.xml from/to repo.spring.io-snapshot (https://repo.spring.io/libs-snapshot-local): Received fatal alert: protocol_version
21-May-2019 00:00:26 Downloading: https://repo.spring.io/libs-milestone-local/org/springframework/spring-web/4.3.23.BUILD-SNAPSHOT/spring-web-4.3.23.BUILD-SNAPSHOT.pom
21-May-2019 00:00:26
21-May-2019 00:00:26 Downloading: https://repo.spring.io/libs-release-local/org/springframework/spring-web/4.3.23.BUILD-SNAPSHOT/spring-web-4.3.23.BUILD-SNAPSHOT.pom
21-May-2019 00:00:26
21-May-2019 00:00:26 Downloading: https://repo.spring.io/libs-snapshot-local/org/springframework/spring-web/4.3.23.BUILD-SNAPSHOT/spring-web-4.3.23.BUILD-SNAPSHOT.pom
21-May-2019 00:00:26
21-May-2019 00:00:26 Downloading: https://oauth.googlecode.com/svn/code/maven/org/springframework/spring-web/4.3.23.BUILD-SNAPSHOT/spring-web-4.3.23.BUILD-SNAPSHOT.pom
21-May-2019 00:00:26
21-May-2019 00:00:26 Downloading: https://repo.spring.io/libs-milestone-local/org/springframework/spring-aop/4.3.23.BUILD-SNAPSHOT/maven-metadata.xml
21-May-2019 00:00:26 Downloading: https://repo.spring.io/libs-release-local/org/springframework/spring-aop/4.3.23.BUILD-SNAPSHOT/maven-metadata.xml
21-May-2019 00:00:27 Downloading: https://oauth.googlecode.com/svn/code/maven/org/springframework/spring-aop/4.3.23.BUILD-SNAPSHOT/maven-metadata.xml
21-May-2019 00:00:27 Downloading: https://repo.spring.io/libs-snapshot-local/org/springframework/spring-aop/4.3.23.BUILD-SNAPSHOT/maven-metadata.xml
21-May-2019 00:00:27
21-May-2019 00:00:27
21-May-2019 00:00:27
21-May-2019 00:00:27
21-May-2019 00:00:27 [WARNING] Could not transfer metadata org.springframework:spring-aop:4.3.23.BUILD-SNAPSHOT/maven-metadata.xml from/to repo.spring.io-milestone (https://repo.spring.io/libs-milestone-local): Received fatal alert: protocol_version
21-May-2019 00:00:27 [WARNING] Could not transfer metadata org.springframework:spring-aop:4.3.23.BUILD-SNAPSHOT/maven-metadata.xml from/to repo.spring.io-release (https://repo.spring.io/libs-release-local): Received fatal alert: protocol_version
21-May-2019 00:00:27 [WARNING] Could not transfer metadata org.springframework:spring-aop:4.3.23.BUILD-SNAPSHOT/maven-metadata.xml from/to repo.spring.io-snapshot (https://repo.spring.io/libs-snapshot-local): Received fatal alert: protocol_version
21-May-2019 00:00:27 [WARNING] Failure to transfer org.springframework:spring-aop:4.3.23.BUILD-SNAPSHOT/maven-metadata.xml from https://repo.spring.io/libs-milestone-local was cached in the local repository, resolution will not be reattempted until the update interval of repo.spring.io-milestone has elapsed or updates are forced. Original error: Could not transfer metadata org.springframework:spring-aop:4.3.23.BUILD-SNAPSHOT/maven-metadata.xml from/to repo.spring.io-milestone (https://repo.spring.io/libs-milestone-local): Received fatal alert: protocol_version
21-May-2019 00:00:27 [WARNING] Failure to transfer org.springframework:spring-aop:4.3.23.BUILD-SNAPSHOT/maven-metadata.xml from https://repo.spring.io/libs-release-local was cached in the local repository, resolution will not be reattempted until the update interval of repo.spring.io-release has elapsed or updates are forced. Original error: Could not transfer metadata org.springframework:spring-aop:4.3.23.BUILD-SNAPSHOT/maven-metadata.xml from/to repo.spring.io-release (https://repo.spring.io/libs-release-local): Received fatal alert: protocol_version
21-May-2019 00:00:27 [WARNING] Failure to transfer org.springframework:spring-aop:4.3.23.BUILD-SNAPSHOT/maven-metadata.xml from https://repo.spring.io/libs-snapshot-local was cached in the local repository, resolution will not be reattempted until the update interval of repo.spring.io-snapshot has elapsed or updates are forced. Original error: Could not transfer metadata org.springframework:spring-aop:4.3.23.BUILD-SNAPSHOT/maven-metadata.xml from/to repo.spring.io-snapshot (https://repo.spring.io/libs-snapshot-local): Received fatal alert: protocol_version
21-May-2019 00:00:27 Downloading: https://repo.spring.io/libs-milestone-local/org/springframework/spring-aop/4.3.23.BUILD-SNAPSHOT/spring-aop-4.3.23.BUILD-SNAPSHOT.pom
21-May-2019 00:00:27
21-May-2019 00:00:27 Downloading: https://repo.spring.io/libs-release-local/org/springframework/spring-aop/4.3.23.BUILD-SNAPSHOT/spring-aop-4.3.23.BUILD-SNAPSHOT.pom
21-May-2019 00:00:27
21-May-2019 00:00:27 Downloading: https://repo.spring.io/libs-snapshot-local/org/springframework/spring-aop/4.3.23.BUILD-SNAPSHOT/spring-aop-4.3.23.BUILD-SNAPSHOT.pom
21-May-2019 00:00:27
21-May-2019 00:00:27 Downloading: https://oauth.googlecode.com/svn/code/maven/org/springframework/spring-aop/4.3.23.BUILD-SNAPSHOT/spring-aop-4.3.23.BUILD-SNAPSHOT.pom
21-May-2019 00:00:27
21-May-2019 00:00:27 Downloading: https://repo.spring.io/libs-release-local/org/springframework/spring-jdbc/4.3.23.BUILD-SNAPSHOT/maven-metadata.xml
21-May-2019 00:00:27 Downloading: https://repo.spring.io/libs-milestone-local/org/springframework/spring-jdbc/4.3.23.BUILD-SNAPSHOT/maven-metadata.xml
21-May-2019 00:00:27 Downloading: https://repo.spring.io/libs-snapshot-local/org/springframework/spring-jdbc/4.3.23.BUILD-SNAPSHOT/maven-metadata.xml
21-May-2019 00:00:27 Downloading: https://oauth.googlecode.com/svn/code/maven/org/springframework/spring-jdbc/4.3.23.BUILD-SNAPSHOT/maven-metadata.xml
21-May-2019 00:00:27
21-May-2019 00:00:27
21-May-2019 00:00:27
21-May-2019 00:00:27
21-May-2019 00:00:27 [WARNING] Could not transfer metadata org.springframework:spring-jdbc:4.3.23.BUILD-SNAPSHOT/maven-metadata.xml from/to repo.spring.io-milestone (https://repo.spring.io/libs-milestone-local): Received fatal alert: protocol_version
21-May-2019 00:00:27 [WARNING] Could not transfer metadata org.springframework:spring-jdbc:4.3.23.BUILD-SNAPSHOT/maven-metadata.xml from/to repo.spring.io-release (https://repo.spring.io/libs-release-local): Received fatal alert: protocol_version
21-May-2019 00:00:27 [WARNING] Could not transfer metadata org.springframework:spring-jdbc:4.3.23.BUILD-SNAPSHOT/maven-metadata.xml from/to repo.spring.io-snapshot (https://repo.spring.io/libs-snapshot-local): Received fatal alert: protocol_version
21-May-2019 00:00:27 [WARNING] Failure to transfer org.springframework:spring-jdbc:4.3.23.BUILD-SNAPSHOT/maven-metadata.xml from https://repo.spring.io/libs-milestone-local was cached in the local repository, resolution will not be reattempted until the update interval of repo.spring.io-milestone has elapsed or updates are forced. Original error: Could not transfer metadata org.springframework:spring-jdbc:4.3.23.BUILD-SNAPSHOT/maven-metadata.xml from/to repo.spring.io-milestone (https://repo.spring.io/libs-milestone-local): Received fatal alert: protocol_version
21-May-2019 00:00:27 [WARNING] Failure to transfer org.springframework:spring-jdbc:4.3.23.BUILD-SNAPSHOT/maven-metadata.xml from https://repo.spring.io/libs-release-local was cached in the local repository, resolution will not be reattempted until the update interval of repo.spring.io-release has elapsed or updates are forced. Original error: Could not transfer metadata org.springframework:spring-jdbc:4.3.23.BUILD-SNAPSHOT/maven-metadata.xml from/to repo.spring.io-release (https://repo.spring.io/libs-release-local): Received fatal alert: protocol_version
21-May-2019 00:00:27 [WARNING] Failure to transfer org.springframework:spring-jdbc:4.3.23.BUILD-SNAPSHOT/maven-metadata.xml from https://repo.spring.io/libs-snapshot-local was cached in the local repository, resolution will not be reattempted until the update interval of repo.spring.io-snapshot has elapsed or updates are forced. Original error: Could not transfer metadata org.springframework:spring-jdbc:4.3.23.BUILD-SNAPSHOT/maven-metadata.xml from/to repo.spring.io-snapshot (https://repo.spring.io/libs-snapshot-local): Received fatal alert: protocol_version
21-May-2019 00:00:27 Downloading: https://repo.spring.io/libs-milestone-local/org/springframework/spring-jdbc/4.3.23.BUILD-SNAPSHOT/spring-jdbc-4.3.23.BUILD-SNAPSHOT.pom
21-May-2019 00:00:27
21-May-2019 00:00:27 Downloading: https://repo.spring.io/libs-release-local/org/springframework/spring-jdbc/4.3.23.BUILD-SNAPSHOT/spring-jdbc-4.3.23.BUILD-SNAPSHOT.pom
21-May-2019 00:00:27
21-May-2019 00:00:27 Downloading: https://repo.spring.io/libs-snapshot-local/org/springframework/spring-jdbc/4.3.23.BUILD-SNAPSHOT/spring-jdbc-4.3.23.BUILD-SNAPSHOT.pom
21-May-2019 00:00:27
21-May-2019 00:00:27 Downloading: https://oauth.googlecode.com/svn/code/maven/org/springframework/spring-jdbc/4.3.23.BUILD-SNAPSHOT/spring-jdbc-4.3.23.BUILD-SNAPSHOT.pom
21-May-2019 00:00:27
21-May-2019 00:00:27 Downloading: https://repo.spring.io/libs-milestone-local/org/springframework/spring-test/4.3.23.BUILD-SNAPSHOT/maven-metadata.xml
21-May-2019 00:00:27 Downloading: https://repo.spring.io/libs-snapshot-local/org/springframework/spring-test/4.3.23.BUILD-SNAPSHOT/maven-metadata.xml
21-May-2019 00:00:27 Downloading: https://repo.spring.io/libs-release-local/org/springframework/spring-test/4.3.23.BUILD-SNAPSHOT/maven-metadata.xml
21-May-2019 00:00:27 Downloading: https://oauth.googlecode.com/svn/code/maven/org/springframework/spring-test/4.3.23.BUILD-SNAPSHOT/maven-metadata.xml
21-May-2019 00:00:27
21-May-2019 00:00:27
21-May-2019 00:00:27
21-May-2019 00:00:27
21-May-2019 00:00:27 [WARNING] Could not transfer metadata org.springframework:spring-test:4.3.23.BUILD-SNAPSHOT/maven-metadata.xml from/to repo.spring.io-milestone (https://repo.spring.io/libs-milestone-local): Received fatal alert: protocol_version
21-May-2019 00:00:27 [WARNING] Could not transfer metadata org.springframework:spring-test:4.3.23.BUILD-SNAPSHOT/maven-metadata.xml from/to repo.spring.io-release (https://repo.spring.io/libs-release-local): Received fatal alert: protocol_version
21-May-2019 00:00:27 [WARNING] Could not transfer metadata org.springframework:spring-test:4.3.23.BUILD-SNAPSHOT/maven-metadata.xml from/to repo.spring.io-snapshot (https://repo.spring.io/libs-snapshot-local): Received fatal alert: protocol_version
21-May-2019 00:00:27 [WARNING] Failure to transfer org.springframework:spring-test:4.3.23.BUILD-SNAPSHOT/maven-metadata.xml from https://repo.spring.io/libs-milestone-local was cached in the local repository, resolution will not be reattempted until the update interval of repo.spring.io-milestone has elapsed or updates are forced. Original error: Could not transfer metadata org.springframework:spring-test:4.3.23.BUILD-SNAPSHOT/maven-metadata.xml from/to repo.spring.io-milestone (https://repo.spring.io/libs-milestone-local): Received fatal alert: protocol_version
21-May-2019 00:00:27 [WARNING] Failure to transfer org.springframework:spring-test:4.3.23.BUILD-SNAPSHOT/maven-metadata.xml from https://repo.spring.io/libs-release-local was cached in the local repository, resolution will not be reattempted until the update interval of repo.spring.io-release has elapsed or updates are forced. Original error: Could not transfer metadata org.springframework:spring-test:4.3.23.BUILD-SNAPSHOT/maven-metadata.xml from/to repo.spring.io-release (https://repo.spring.io/libs-release-local): Received fatal alert: protocol_version
21-May-2019 00:00:27 [WARNING] Failure to transfer org.springframework:spring-test:4.3.23.BUILD-SNAPSHOT/maven-metadata.xml from https://repo.spring.io/libs-snapshot-local was cached in the local repository, resolution will not be reattempted until the update interval of repo.spring.io-snapshot has elapsed or updates are forced. Original error: Could not transfer metadata org.springframework:spring-test:4.3.23.BUILD-SNAPSHOT/maven-metadata.xml from/to repo.spring.io-snapshot (https://repo.spring.io/libs-snapshot-local): Received fatal alert: protocol_version
21-May-2019 00:00:27 Downloading: https://repo.spring.io/libs-milestone-local/org/springframework/spring-test/4.3.23.BUILD-SNAPSHOT/spring-test-4.3.23.BUILD-SNAPSHOT.pom
21-May-2019 00:00:27
21-May-2019 00:00:27 Downloading: https://repo.spring.io/libs-release-local/org/springframework/spring-test/4.3.23.BUILD-SNAPSHOT/spring-test-4.3.23.BUILD-SNAPSHOT.pom
21-May-2019 00:00:27
21-May-2019 00:00:27 Downloading: https://repo.spring.io/libs-snapshot-local/org/springframework/spring-test/4.3.23.BUILD-SNAPSHOT/spring-test-4.3.23.BUILD-SNAPSHOT.pom
21-May-2019 00:00:27
21-May-2019 00:00:27 Downloading: https://oauth.googlecode.com/svn/code/maven/org/springframework/spring-test/4.3.23.BUILD-SNAPSHOT/spring-test-4.3.23.BUILD-SNAPSHOT.pom
21-May-2019 00:00:28
21-May-2019 00:00:28 Downloading: https://repo.spring.io/libs-milestone-local/org/springframework/spring-expression/4.3.23.BUILD-SNAPSHOT/maven-metadata.xml
21-May-2019 00:00:28 Downloading: https://repo.spring.io/libs-snapshot-local/org/springframework/spring-expression/4.3.23.BUILD-SNAPSHOT/maven-metadata.xml
21-May-2019 00:00:28 Downloading: https://oauth.googlecode.com/svn/code/maven/org/springframework/spring-expression/4.3.23.BUILD-SNAPSHOT/maven-metadata.xml
21-May-2019 00:00:28 Downloading: https://repo.spring.io/libs-release-local/org/springframework/spring-expression/4.3.23.BUILD-SNAPSHOT/maven-metadata.xml
21-May-2019 00:00:28
21-May-2019 00:00:28
21-May-2019 00:00:28
21-May-2019 00:00:28
21-May-2019 00:00:28 [WARNING] Could not transfer metadata org.springframework:spring-expression:4.3.23.BUILD-SNAPSHOT/maven-metadata.xml from/to repo.spring.io-milestone (https://repo.spring.io/libs-milestone-local): Received fatal alert: protocol_version
21-May-2019 00:00:28 [WARNING] Could not transfer metadata org.springframework:spring-expression:4.3.23.BUILD-SNAPSHOT/maven-metadata.xml from/to repo.spring.io-release (https://repo.spring.io/libs-release-local): Received fatal alert: protocol_version
21-May-2019 00:00:28 [WARNING] Could not transfer metadata org.springframework:spring-expression:4.3.23.BUILD-SNAPSHOT/maven-metadata.xml from/to repo.spring.io-snapshot (https://repo.spring.io/libs-snapshot-local): Received fatal alert: protocol_version
21-May-2019 00:00:28 [WARNING] Failure to transfer org.springframework:spring-expression:4.3.23.BUILD-SNAPSHOT/maven-metadata.xml from https://repo.spring.io/libs-milestone-local was cached in the local repository, resolution will not be reattempted until the update interval of repo.spring.io-milestone has elapsed or updates are forced. Original error: Could not transfer metadata org.springframework:spring-expression:4.3.23.BUILD-SNAPSHOT/maven-metadata.xml from/to repo.spring.io-milestone (https://repo.spring.io/libs-milestone-local): Received fatal alert: protocol_version
21-May-2019 00:00:28 [WARNING] Failure to transfer org.springframework:spring-expression:4.3.23.BUILD-SNAPSHOT/maven-metadata.xml from https://repo.spring.io/libs-release-local was cached in the local repository, resolution will not be reattempted until the update interval of repo.spring.io-release has elapsed or updates are forced. Original error: Could not transfer metadata org.springframework:spring-expression:4.3.23.BUILD-SNAPSHOT/maven-metadata.xml from/to repo.spring.io-release (https://repo.spring.io/libs-release-local): Received fatal alert: protocol_version
21-May-2019 00:00:28 [WARNING] Failure to transfer org.springframework:spring-expression:4.3.23.BUILD-SNAPSHOT/maven-metadata.xml from https://repo.spring.io/libs-snapshot-local was cached in the local repository, resolution will not be reattempted until the update interval of repo.spring.io-snapshot has elapsed or updates are forced. Original error: Could not transfer metadata org.springframework:spring-expression:4.3.23.BUILD-SNAPSHOT/maven-metadata.xml from/to repo.spring.io-snapshot (https://repo.spring.io/libs-snapshot-local): Received fatal alert: protocol_version
21-May-2019 00:00:28 Downloading: https://repo.spring.io/libs-milestone-local/org/springframework/spring-expression/4.3.23.BUILD-SNAPSHOT/spring-expression-4.3.23.BUILD-SNAPSHOT.pom
21-May-2019 00:00:28
21-May-2019 00:00:28 Downloading: https://repo.spring.io/libs-release-local/org/springframework/spring-expression/4.3.23.BUILD-SNAPSHOT/spring-expression-4.3.23.BUILD-SNAPSHOT.pom
21-May-2019 00:00:28
21-May-2019 00:00:28 Downloading: https://repo.spring.io/libs-snapshot-local/org/springframework/spring-expression/4.3.23.BUILD-SNAPSHOT/spring-expression-4.3.23.BUILD-SNAPSHOT.pom
21-May-2019 00:00:28
21-May-2019 00:00:28 Downloading: https://oauth.googlecode.com/svn/code/maven/org/springframework/spring-expression/4.3.23.BUILD-SNAPSHOT/spring-expression-4.3.23.BUILD-SNAPSHOT.pom
21-May-2019 00:00:28
21-May-2019 00:00:28 Downloading: https://repo.spring.io/libs-milestone-local/org/springframework/security/spring-security-config/4.2.11.RELEASE/spring-security-config-4.2.11.RELEASE.pom
21-May-2019 00:00:28
21-May-2019 00:00:28 Downloading: https://repo.spring.io/libs-release-local/org/springframework/security/spring-security-config/4.2.11.RELEASE/spring-security-config-4.2.11.RELEASE.pom
21-May-2019 00:00:28
21-May-2019 00:00:28 Downloading: https://repo.spring.io/libs-snapshot-local/org/springframework/security/spring-security-config/4.2.11.RELEASE/spring-security-config-4.2.11.RELEASE.pom
21-May-2019 00:00:28
21-May-2019 00:00:28 Downloading: https://oauth.googlecode.com/svn/code/maven/org/springframework/security/spring-security-config/4.2.11.RELEASE/spring-security-config-4.2.11.RELEASE.pom
21-May-2019 00:00:28
21-May-2019 00:00:28 Downloading: https://repo.maven.apache.org/maven2/org/springframework/security/spring-security-config/4.2.11.RELEASE/spring-security-config-4.2.11.RELEASE.pom
21-May-2019 00:00:28
21-May-2019 00:00:28 Downloading: https://repo.spring.io/libs-milestone-local/javax/servlet/javax.servlet-api/3.0.1/javax.servlet-api-3.0.1.pom
21-May-2019 00:00:28
21-May-2019 00:00:28 Downloading: https://repo.spring.io/libs-release-local/javax/servlet/javax.servlet-api/3.0.1/javax.servlet-api-3.0.1.pom
21-May-2019 00:00:28
21-May-2019 00:00:28 Downloading: https://repo.spring.io/libs-snapshot-local/javax/servlet/javax.servlet-api/3.0.1/javax.servlet-api-3.0.1.pom
21-May-2019 00:00:28
21-May-2019 00:00:28 Downloading: https://oauth.googlecode.com/svn/code/maven/javax/servlet/javax.servlet-api/3.0.1/javax.servlet-api-3.0.1.pom
21-May-2019 00:00:28
21-May-2019 00:00:28 Downloading: https://repo.maven.apache.org/maven2/javax/servlet/javax.servlet-api/3.0.1/javax.servlet-api-3.0.1.pom
21-May-2019 00:00:28
21-May-2019 00:00:28 [INFO] ------------------------------------------------------------------------
21-May-2019 00:00:28 [INFO] Reactor Summary:
21-May-2019 00:00:28 [INFO]
21-May-2019 00:00:28 [INFO] OAuth for Spring Security .......................... SUCCESS [  0.910 s]
21-May-2019 00:00:28 [INFO] OAuth 1(a) for Spring Security ..................... FAILURE [  3.417 s]
21-May-2019 00:00:28 [INFO] OAuth2 for Spring Security ......................... SKIPPED
21-May-2019 00:00:28 [INFO] spring-oauth2-tests ................................ SKIPPED
21-May-2019 00:00:28 [INFO] spring-oauth2-tests-common ......................... SKIPPED
21-May-2019 00:00:28 [INFO] spring-oauth2-tests-vanilla ........................ SKIPPED
21-May-2019 00:00:28 [INFO] spring-oauth2-tests-mappings ....................... SKIPPED
21-May-2019 00:00:28 [INFO] spring-oauth2-tests-form ........................... SKIPPED
21-May-2019 00:00:28 [INFO] spring-oauth2-tests-jwt ............................ SKIPPED
21-May-2019 00:00:28 [INFO] spring-oauth2-tests-approval ....................... SKIPPED
21-May-2019 00:00:28 [INFO] spring-oauth2-tests-jdbc ........................... SKIPPED
21-May-2019 00:00:28 [INFO] spring-oauth2-tests-jpa ............................ SKIPPED
21-May-2019 00:00:28 [INFO] spring-oauth2-tests-jaxb ........................... SKIPPED
21-May-2019 00:00:28 [INFO] spring-oauth-tests-custom-grant .................... SKIPPED
21-May-2019 00:00:28 [INFO] spring-oauth2-tests-multi .......................... SKIPPED
21-May-2019 00:00:28 [INFO] spring-oauth2-tests-client ......................... SKIPPED
21-May-2019 00:00:28 [INFO] spring-oauth2-tests-resource ....................... SKIPPED
21-May-2019 00:00:28 [INFO] spring-oauth2-tests-custom-authentication .......... SKIPPED
21-May-2019 00:00:28 [INFO] spring-oauth2-tests-xml ............................ SKIPPED
21-May-2019 00:00:28 [INFO] spring-oauth2-tests-xml-common ..................... SKIPPED
21-May-2019 00:00:28 [INFO] spring-oauth2-tests-xml-vanilla .................... SKIPPED
21-May-2019 00:00:28 [INFO] spring-oauth2-tests-xml-mappings ................... SKIPPED
21-May-2019 00:00:28 [INFO] spring-oauth2-tests-xml-form ....................... SKIPPED
21-May-2019 00:00:28 [INFO] spring-oauth2-tests-xml-jwt ........................ SKIPPED
21-May-2019 00:00:28 [INFO] spring-oauth2-tests-xml-approval ................... SKIPPED
21-May-2019 00:00:28 [INFO] spring-oauth2-tests-xml-jdbc ....................... SKIPPED
21-May-2019 00:00:28 [INFO] spring-oauth2-tests-xml-client ..................... SKIPPED
21-May-2019 00:00:28 [INFO] OAuth for Spring Security - Integration Tests ...... SKIPPED
21-May-2019 00:00:28 [INFO] OAuth for Spring Security - Sparklr (OAuth 1 Provider Example) SKIPPED
21-May-2019 00:00:28 [INFO] OAuth for Spring Security - Tonr (OAuth 1 Consumer Example) SKIPPED
21-May-2019 00:00:28 [INFO] OAuth for Spring Security - Sparklr2 (OAuth 2 Provider Example) SKIPPED
21-May-2019 00:00:28 [INFO] OAuth for Spring Security - Tonr2 (OAuth 2 Client Example) SKIPPED
21-May-2019 00:00:28 [INFO] OAuth for Spring Security - Samples ................ SKIPPED
21-May-2019 00:00:28 [INFO] ------------------------------------------------------------------------
21-May-2019 00:00:28 [INFO] BUILD FAILURE
21-May-2019 00:00:28 [INFO] ------------------------------------------------------------------------
21-May-2019 00:00:28 [INFO] Total time: 6.353 s
21-May-2019 00:00:28 [INFO] Finished at: 2019-05-21T00:00:28+00:00
21-May-2019 00:00:29 [INFO] Final Memory: 52M/367M
21-May-2019 00:00:29 [INFO] ------------------------------------------------------------------------
21-May-2019 00:00:29 [ERROR] Failed to execute goal on project spring-security-oauth: Could not resolve dependencies for project org.springframework.security.oauth:spring-security-oauth:jar:2.3.6.BUILD-SNAPSHOT: Failed to collect dependencies at org.springframework:spring-beans:jar:4.3.23.BUILD-SNAPSHOT: Failed to read artifact descriptor for org.springframework:spring-beans:jar:4.3.23.BUILD-SNAPSHOT: Could not transfer artifact org.springframework:spring-beans:pom:4.3.23.BUILD-SNAPSHOT from/to repo.spring.io-milestone (https://repo.spring.io/libs-milestone-local): Received fatal alert: protocol_version -> [Help 1]
21-May-2019 00:00:29 [ERROR]
21-May-2019 00:00:29 [ERROR] To see the full stack trace of the errors, re-run Maven with the -e switch.
21-May-2019 00:00:29 [ERROR] Re-run Maven using the -X switch to enable full debug logging.
21-May-2019 00:00:29 [ERROR]
21-May-2019 00:00:29 [ERROR] For more information about the errors and possible solutions, please read the following articles:
21-May-2019 00:00:29 [ERROR] [Help 1] http://cwiki.apache.org/confluence/display/MAVEN/DependencyResolutionException
21-May-2019 00:00:29 [ERROR]
21-May-2019 00:00:29 [ERROR] After correcting the problems, you can resume the build with the command
21-May-2019 00:00:29 [ERROR]   mvn <goals> -rf :spring-security-oauth
21-May-2019 00:00:29
21-May-2019 00:00:29 Failing task since return code of [/opt/jdk-7/bin/java -cp /opt/maven-3.3/boot/plexus-classworlds-2.5.2.jar -Dclassworlds.conf=/tmp/artifactoryM27985770160240143557conf -DbuildInfoConfig.propertiesFile=/tmp/buildInfo1130930558474880497.properties -Xmx1256m -Xms128m -Dmaven.home=/opt/maven-3.3 -Dmaven.multiModuleProjectDirectory=/opt/bamboo-home/xml-data/build-dir/SECOAUTH-NIGHTLY-JOB1 org.codehaus.plexus.classworlds.launcher.Launcher clean install -P bootstrap -Dartifactory.publish.password=********] was 1 while expected 0
21-May-2019 00:00:29 Finished task 'Artifactory Maven 3' with result: Failed
21-May-2019 00:00:29 Running post build plugin 'Docker Container Cleanup'
21-May-2019 00:00:29 Running post build plugin 'NCover Results Collector'
21-May-2019 00:00:29 Running post build plugin 'Artifactory Release Management Staging'
21-May-2019 00:00:29 Running post build plugin 'Artifactory Build Info Copier'
21-May-2019 00:00:29 Running post build plugin 'Artifactory Gradle Properties Info Copier'
21-May-2019 00:00:29 Running post build plugin 'Clover Results Collector'
21-May-2019 00:00:29 Running post build plugin 'npm Cache Cleanup'
21-May-2019 00:00:29 Running post build plugin 'Artifact Copier'
21-May-2019 00:00:29 Successfully removed working directory at '/opt/bamboo-home/xml-data/build-dir/SECOAUTH-NIGHTLY-JOB1'
21-May-2019 00:00:29 Finalising the build...
21-May-2019 00:00:29 Stopping timer.
21-May-2019 00:00:29 Build SECOAUTH-NIGHTLY-JOB1-1647 completed.
21-May-2019 00:00:29 Running on server: post build plugin 'NCover Results Collector'
21-May-2019 00:00:29 Running on server: post build plugin 'Build Hanging Detection Configuration'
21-May-2019 00:00:29 Running on server: post build plugin 'Clover Delta Calculator'
21-May-2019 00:00:29 Running on server: post build plugin 'Maven Dependencies Postprocessor'
21-May-2019 00:00:29 All post build plugins have finished
21-May-2019 00:00:29 Generating build results summary...
21-May-2019 00:00:29 Saving build results to disk...
21-May-2019 00:00:29 Logging substituted variables...
21-May-2019 00:00:29 Indexing build results...
21-May-2019 00:00:29 Finished building SECOAUTH-NIGHTLY-JOB1-1647.