Build: #1667 failed

Job: Default Job failed

Stages & jobs

  1. Default Stage

Build log

The build generated 639 lines of output. Download or view full build log

07-Jun-2019 00:00:08 Build Spring Security OAuth - 2.1.x - Default Job #1667 (SECOAUTH-NIGHTLY-JOB1-1667) started building on agent bamboo-17.af.pivotal.io
07-Jun-2019 00:00:08 Remote agent on host bamboo-17.af.pivotal.io
07-Jun-2019 00:00:09 Build working directory is /opt/bamboo-home/xml-data/build-dir/SECOAUTH-NIGHTLY-JOB1
07-Jun-2019 00:00:09 Executing build Spring Security OAuth - 2.1.x - Default Job #1667 (SECOAUTH-NIGHTLY-JOB1-1667)
07-Jun-2019 00:00:09 Starting task 'Checkout Default Repository' of type 'com.atlassian.bamboo.plugins.vcs:task.vcs.checkout'
07-Jun-2019 00:00:09 Build always requires a clean checkout
07-Jun-2019 00:00:09 Cleaning build directory '/opt/bamboo-home/xml-data/build-dir/SECOAUTH-NIGHTLY-JOB1'
07-Jun-2019 00:00:09 Checking out into /opt/bamboo-home/xml-data/build-dir/SECOAUTH-NIGHTLY-JOB1
07-Jun-2019 00:00:09 Updating source code to revision: 3d37444a991104dd7f23edb2812e9f57620a1395
07-Jun-2019 00:00:09 Creating local git repository in '/opt/bamboo-home/xml-data/build-dir/SECOAUTH-NIGHTLY-JOB1/.git'.
07-Jun-2019 00:00:09 Initialized empty Git repository in /opt/bamboo-home/xml-data/build-dir/SECOAUTH-NIGHTLY-JOB1/.git/
07-Jun-2019 00:00:10 Fetching 'refs/heads/master' from 'git://github.com/SpringSource/spring-security-oauth.git'. Will try to do a shallow fetch.
07-Jun-2019 00:00:14 From git://github.com/SpringSource/spring-security-oauth
07-Jun-2019 00:00:14 * [new branch]      master     -> master
07-Jun-2019 00:00:14 Checking out revision 3d37444a991104dd7f23edb2812e9f57620a1395.
07-Jun-2019 00:00:14 Already on 'master'
07-Jun-2019 00:00:14 Updated source code to revision: 3d37444a991104dd7f23edb2812e9f57620a1395
07-Jun-2019 00:00:14 Finished task 'Checkout Default Repository' with result: Success
07-Jun-2019 00:00:14 Running pre-build action: Artifactory Release Staging
07-Jun-2019 00:00:14 Running pre-build action: VCS Version Collector
07-Jun-2019 00:00:16 Skipping execution of task 'Build' as it is disabled
07-Jun-2019 00:00:16 Starting task 'Artifactory Maven 3' of type 'org.jfrog.bamboo.bamboo-artifactory-plugin:maven3Task'
07-Jun-2019 00:00:16 Bamboo Artifactory Plugin version: 2.6.3
07-Jun-2019 00:00:16
Beginning to execute external process for build 'Spring Security OAuth - 2.1.x - Default Job #1667 (SECOAUTH-NIGHTLY-JOB1-1667)'
... running command line:
/opt/jdk-7/bin/java -cp /opt/maven-3.3/boot/plexus-classworlds-2.5.2.jar -Dclassworlds.conf=/tmp/artifactoryM28132616860549221978conf -DbuildInfoConfig.propertiesFile=/tmp/buildInfo6523078775971650426.properties -Xmx1256m -Xms128m -Dmaven.home=/opt/maven-3.3 -Dmaven.multiModuleProjectDirectory=/opt/bamboo-home/xml-data/build-dir/SECOAUTH-NIGHTLY-JOB1 org.codehaus.plexus.classworlds.launcher.Launcher clean install -P bootstrap -Dartifactory.publish.password=********
... in: /opt/bamboo-home/xml-data/build-dir/SECOAUTH-NIGHTLY-JOB1
... using extra environment variables:
bamboo_planRepository_1_branch=master
bamboo_repository_94273667_previous_revision_number=3d37444a991104dd7f23edb2812e9f57620a1395
bamboo_********_username_password=********
bamboo_signing_store_password=********
bamboo_capability_system_builder_ant_Ant_1_9=/opt/ant-1.9
bamboo_capability_system_builder_ant_Ant_1_8=/opt/ant-1.8
bamboo_planRepository_1_branchDisplayName=master
bamboo_artifactory_override_resolve_repo=libs-milestone
bamboo_capability_system_builder_node_Node_js_10_16=/opt/node-10.16/bin/node
bamboo_repository_revision_number=3d37444a991104dd7f23edb2812e9f57620a1395
bamboo_RIAK_BIN=/usr/sbin/riak
bamboo_repository_94273667_revision_number=3d37444a991104dd7f23edb2812e9f57620a1395
WRAPPER_BITS=32
bamboo_buildKey=SECOAUTH-NIGHTLY-JOB1
bamboo_repository_94273667_git_branch=master
bamboo_bintray_password=********
bamboo_sonar_token_password=********
PWD=/opt/bamboo-home/bin
bamboo_shortJobName=Default Job
bamboo_artifactory_override_resolver_password=********
bamboo_capability_system_builder_gradle___gradlew=./gradlew
bamboo_buildResultsUrl=https://build.spring.io/browse/SECOAUTH-NIGHTLY-JOB1-1667
bamboo_capability_system_builder_mvn3_Maven_3_3=/opt/maven-3.3
bamboo_capability_system_builder_mvn3_Maven_3_2=/opt/maven-3.2
bamboo_capability_system_builder_mvn3_Maven_3_1=/opt/maven-3.1
bamboo_planRepository_repositoryUrl=git://github.com/SpringSource/spring-security-oauth.git
bamboo_capability_system_builder_mvn3_Maven_3_6=/opt/maven-3.6
bamboo_agentId=286195718
bamboo_capability_system_builder_mvn3_Maven_3_5=/opt/maven-3.5
bamboo_capability_system_builder_mvn3_Maven_3_0=/opt/maven-3.0
bamboo_planRepository_revision=3d37444a991104dd7f23edb2812e9f57620a1395
bamboo_planRepository_previousRevision=3d37444a991104dd7f23edb2812e9f57620a1395
bamboo_capability_remote_build=true
bamboo_repository_branch_name=master
bamboo_sonatype_token_password=********
SHLVL=1
bamboo_org_jfrog_bamboo_buildInfo_serverUrl=https://repo.spring.io
bamboo_scdf_acceptance_tests_password=********
bamboo_repository_94273667_branch_name=master
WRAPPER_OS=linux
TERM=linux
XDG_SESSION_ID=c1
bamboo_planRepository_branch=master
bamboo_org_jfrog_bamboo_release_activated=false
bamboo_planRepository_1_type=gitv2
bamboo_planRepository_branchName=master
bamboo_capability_system_jdk_JDK_12=/opt/jdk-12
WRAPPER_FILE_SEPARATOR=/
_=/opt/bamboo-home/bin/bamboo-agent.sh
bamboo_capability_system_builder_ant_Ant_1_10=/opt/ant-1.10
bamboo_repository_94273667_name=Plan Repository
WRAPPER_PATH_SEPARATOR=:
bamboo_sonar_password=********
bamboo_hg_cache_directory=/opt/bamboo-home/xml-data/build-dir/_hg-repositories-cache
bamboo_planRepository_1_username=
bamboo_planRepository_type=gitv2
bamboo_git_cache_directory=/opt/bamboo-home/xml-data/build-dir/_git-repositories-cache
bamboo_artifactory_username=buildmaster
bamboo_tmp_directory=/opt/bamboo-home/temp
bamboo_planKey=SECOAUTH-NIGHTLY
bamboo_planRepository_username=
bamboo_JDK8_HOME=/opt/jdk-8
bamboo_repository_94273667_git_username=
bamboo_planRepository_1_branchName=master
bamboo_sonar_version=5.6.3
bamboo_sonar_jdbc_password=********
bamboo_bintray_api_key_password=********
XDG_DATA_DIRS=/usr/local/share:/usr/share:/var/lib/snapd/desktop
bamboo_capability_system_jdk_JDK_1_11=/opt/jdk-11
bamboo_resultsUrl=https://build.spring.io/browse/SECOAUTH-NIGHTLY-JOB1-1667
bamboo_capability_system_jdk_JDK_1_10=/opt/jdk-10
bamboo_build_working_directory=/opt/bamboo-home/xml-data/build-dir/SECOAUTH-NIGHTLY-JOB1
bamboo_planRepository_1_name=Plan Repository
bamboo_capability_system_os=ubuntu1804
bamboo_nexusPush_stagingProfile=buildmaster
bamboo_shortPlanName=2.1.x
MAIL=/var/mail/bamboo
bamboo_planRepository_name=Plan Repository
LOGNAME=bamboo
bamboo_buildNumber=1667
SHELL=/bin/bash
bamboo_planName=Spring Security OAuth - 2.1.x
bamboo_JDK7_HOME=/opt/jdk-7
bamboo_repository_94273667_git_repositoryUrl=git://github.com/SpringSource/spring-security-oauth.git
bamboo_shortPlanKey=NIGHTLY
OLDPWD=/opt/users/bamboo
bamboo_shortJobKey=JOB1
bamboo_artifactory_password=********
bamboo_buildTimeStamp=2019-06-07T00:00:06.898Z
bamboo_repository_previous_revision_number=3d37444a991104dd7f23edb2812e9f57620a1395
bamboo_sonar_username=buildmaster
bamboo_********_password=********
bamboo_repository_git_branch=master
bamboo_buildResultKey=SECOAUTH-NIGHTLY-JOB1-1667
bamboo_nexusPush_close=true
bamboo_artifactory_override_resolver_username=buildmaster
bamboo_buildPlanName=Spring Security OAuth - 2.1.x - Default Job
bamboo_planRepository_1_revision=3d37444a991104dd7f23edb2812e9f57620a1395
bamboo_repository_name=Plan Repository
bamboo_signing_key_password=********
bamboo_capability_system_builder_groovy_Groovy_2_5=/opt/groovy-2.5
LANG=en_US.UTF-8
bamboo_buildFailed=false
bamboo_capability_system_docker_executable=/usr/bin/docker
DISPLAY=localhost:1.0
bamboo_capability_system_jdk_OpenJDK_7=/opt/jdk-7
bamboo_capability_system_builder_groovy_Groovy_2_4=/opt/groovy-2.4
bamboo_artifactory_override_deployer_username=buildmaster
bamboo_capability_system_builder_command_Bash=/bin/bash
bamboo_artifactory_password_mask_a=********
bamboo_agentWorkingDirectory=/opt/bamboo-home/xml-data/build-dir
bamboo_capability_system_git_executable=/usr/bin/git
bamboo_repository_git_username=
bamboo_planRepository_1_previousRevision=3d37444a991104dd7f23edb2812e9f57620a1395
bamboo_capability_os_family=unix
bamboo_planRepository_branchDisplayName=master
bamboo_capability_system_builder_maven_Artifactory_Maven_3_6=/opt/maven-3.6
bamboo_capability_system_builder_maven_Artifactory_Maven_3_5=/opt/maven-3.5
GIT_SSL_NO_VERIFY=true
bamboo_capability_system_builder_maven_Artifactory_Maven_3_3=/opt/maven-3.3
bamboo_capability_system_builder_maven_Artifactory_Maven_3_2=/opt/maven-3.2
bamboo_s3_properties=/home/bamboo/tools/s3.properties
bamboo_capability_system_builder_maven_Artifactory_Maven_3_1=/opt/maven-3.1
bamboo_artifactory_override_deploy_repo=libs-snapshot-local
bamboo_capability_system_builder_maven_Artifactory_Maven_3_0=/opt/maven-3.0
bamboo_plan_storageTag=SECOAUTH-NIGHTLY
bamboo_bintray_username_password=********
USER=bamboo
bamboo_repository_git_repositoryUrl=git://github.com/SpringSource/spring-security-oauth.git
bamboo_working_directory=/opt/bamboo-home/xml-data/build-dir/SECOAUTH-NIGHTLY-JOB1
bamboo_org_jfrog_bamboo_buildInfo_activated=true
bamboo_planRepository_1_repositoryUrl=git://github.com/SpringSource/spring-security-oauth.git
bamboo_capability_system_jdk_JDK_1_8=/opt/jdk-8
bamboo_artifactory_override_deployer_password=********
bamboo_capability_system_jdk_JDK_1_9=/opt/jdk-9
WRAPPER_ARCH=x86
bamboo_capability_system_jdk_JDK_1_6=/opt/jdk-6
bamboo_sonatype_password=********
bamboo_capability_system_jdk_JDK_1_7=/opt/jdk-7
bamboo_sonar_ip=10.194.6.9
XDG_RUNTIME_DIR=/run/user/1002
HOME=/home/bamboo
PATH=/bin:/home/bamboo/bin:/usr/local/sbin:/usr/local/bin:/usr/sbin:/usr/bin:/sbin:/bin:/usr/games:/usr/local/games:/snap/bin:/home/bamboo/bin:/usr/local/bin:/bin:/home/bamboo/bin:/usr/local/sbin:/usr/local/bin:/usr/sbin:/usr/bin:/sbin:/bin:/usr/games:/usr/local/games:/snap/bin:/home/bamboo/bin:/usr/local/bin
07-Jun-2019 00:00:18 [INFO] Scanning for projects...
07-Jun-2019 00:00:18 Downloading: https://repo.spring.io/libs-snapshot-local/org/springframework/boot/spring-boot-starter-parent/1.5.1.RELEASE/spring-boot-starter-parent-1.5.1.RELEASE.pom
07-Jun-2019 00:00:18
07-Jun-2019 00:00:18 Downloading: https://repo.spring.io/libs-milestone-local/org/springframework/boot/spring-boot-starter-parent/1.5.1.RELEASE/spring-boot-starter-parent-1.5.1.RELEASE.pom
07-Jun-2019 00:00:18
07-Jun-2019 00:00:18 Downloading: https://repo.spring.io/release/org/springframework/boot/spring-boot-starter-parent/1.5.1.RELEASE/spring-boot-starter-parent-1.5.1.RELEASE.pom
07-Jun-2019 00:00:19 1/8 KB   
07-Jun-2019 00:00:19 3/8 KB   
07-Jun-2019 00:00:19 4/8 KB   
07-Jun-2019 00:00:19 5/8 KB   
07-Jun-2019 00:00:19 7/8 KB   
07-Jun-2019 00:00:19 8/8 KB   
07-Jun-2019 00:00:19          
07-Jun-2019 00:00:19 Downloaded: https://repo.spring.io/release/org/springframework/boot/spring-boot-starter-parent/1.5.1.RELEASE/spring-boot-starter-parent-1.5.1.RELEASE.pom (8 KB at 25.1 KB/sec)
07-Jun-2019 00:00:19 Downloading: https://repo.spring.io/libs-snapshot-local/org/springframework/boot/spring-boot-dependencies/1.5.1.RELEASE/spring-boot-dependencies-1.5.1.RELEASE.pom
07-Jun-2019 00:00:19          
07-Jun-2019 00:00:19 Downloading: https://repo.spring.io/libs-milestone-local/org/springframework/boot/spring-boot-dependencies/1.5.1.RELEASE/spring-boot-dependencies-1.5.1.RELEASE.pom
07-Jun-2019 00:00:19          
07-Jun-2019 00:00:19 Downloading: https://repo.spring.io/release/org/springframework/boot/spring-boot-dependencies/1.5.1.RELEASE/spring-boot-dependencies-1.5.1.RELEASE.pom
07-Jun-2019 00:00:19 1/88 KB   
07-Jun-2019 00:00:19 3/88 KB   
07-Jun-2019 00:00:19 4/88 KB   
07-Jun-2019 00:00:19 5/88 KB   
07-Jun-2019 00:00:19 7/88 KB   
07-Jun-2019 00:00:19 8/88 KB   
07-Jun-2019 00:00:19 9/88 KB   
07-Jun-2019 00:00:19 11/88 KB   
07-Jun-2019 00:00:19 12/88 KB   
07-Jun-2019 00:00:19 13/88 KB   
07-Jun-2019 00:00:19 14/88 KB   
07-Jun-2019 00:00:19 15/88 KB   
07-Jun-2019 00:00:19 16/88 KB   
07-Jun-2019 00:00:19 18/88 KB   
07-Jun-2019 00:00:19 19/88 KB   
07-Jun-2019 00:00:19 20/88 KB   
07-Jun-2019 00:00:19 22/88 KB   
07-Jun-2019 00:00:19 23/88 KB   
07-Jun-2019 00:00:19 23/88 KB   
07-Jun-2019 00:00:19 25/88 KB   
07-Jun-2019 00:00:19 26/88 KB   
07-Jun-2019 00:00:19 27/88 KB   
07-Jun-2019 00:00:19 29/88 KB   
07-Jun-2019 00:00:19 30/88 KB   
07-Jun-2019 00:00:19 31/88 KB   
07-Jun-2019 00:00:19 32/88 KB   
07-Jun-2019 00:00:19 33/88 KB   
07-Jun-2019 00:00:19 35/88 KB   
07-Jun-2019 00:00:19 36/88 KB   
07-Jun-2019 00:00:19 37/88 KB   
07-Jun-2019 00:00:19 39/88 KB   
07-Jun-2019 00:00:19 40/88 KB   
07-Jun-2019 00:00:19 41/88 KB   
07-Jun-2019 00:00:19 43/88 KB   
07-Jun-2019 00:00:19 44/88 KB   
07-Jun-2019 00:00:19 45/88 KB   
07-Jun-2019 00:00:19 47/88 KB   
07-Jun-2019 00:00:19 48/88 KB   
07-Jun-2019 00:00:19 49/88 KB   
07-Jun-2019 00:00:19 51/88 KB   
07-Jun-2019 00:00:19 52/88 KB   
07-Jun-2019 00:00:19 53/88 KB   
07-Jun-2019 00:00:19 55/88 KB   
07-Jun-2019 00:00:19 56/88 KB   
07-Jun-2019 00:00:19 57/88 KB   
07-Jun-2019 00:00:19 59/88 KB   
07-Jun-2019 00:00:19 59/88 KB   
07-Jun-2019 00:00:19 61/88 KB   
07-Jun-2019 00:00:19 62/88 KB   
07-Jun-2019 00:00:19 63/88 KB   
07-Jun-2019 00:00:19 63/88 KB   
07-Jun-2019 00:00:19 65/88 KB   
07-Jun-2019 00:00:19 66/88 KB   
07-Jun-2019 00:00:19 67/88 KB   
07-Jun-2019 00:00:19 69/88 KB   
07-Jun-2019 00:00:19 70/88 KB   
07-Jun-2019 00:00:19 71/88 KB   
07-Jun-2019 00:00:19 73/88 KB   
07-Jun-2019 00:00:19 74/88 KB   
07-Jun-2019 00:00:19 75/88 KB   
07-Jun-2019 00:00:19 77/88 KB   
07-Jun-2019 00:00:19 78/88 KB   
07-Jun-2019 00:00:19 79/88 KB   
07-Jun-2019 00:00:19 81/88 KB   
07-Jun-2019 00:00:19 82/88 KB   
07-Jun-2019 00:00:19 83/88 KB   
07-Jun-2019 00:00:19 85/88 KB   
07-Jun-2019 00:00:19 86/88 KB   
07-Jun-2019 00:00:19 87/88 KB   
07-Jun-2019 00:00:19 88/88 KB   
07-Jun-2019 00:00:19            
07-Jun-2019 00:00:19 Downloaded: https://repo.spring.io/release/org/springframework/boot/spring-boot-dependencies/1.5.1.RELEASE/spring-boot-dependencies-1.5.1.RELEASE.pom (88 KB at 245.4 KB/sec)
07-Jun-2019 00:00:21 [INFO] Initializing Artifactory Build-Info Recording
07-Jun-2019 00:00:21 [INFO] ------------------------------------------------------------------------
07-Jun-2019 00:00:21 [INFO] Reactor Build Order:
07-Jun-2019 00:00:21 [INFO]
07-Jun-2019 00:00:21 [INFO] OAuth for Spring Security
07-Jun-2019 00:00:21 [INFO] OAuth 1(a) for Spring Security
07-Jun-2019 00:00:21 [INFO] OAuth2 for Spring Security
07-Jun-2019 00:00:21 [INFO] spring-oauth2-tests
07-Jun-2019 00:00:21 [INFO] spring-oauth2-tests-common
07-Jun-2019 00:00:21 [INFO] spring-oauth2-tests-vanilla
07-Jun-2019 00:00:21 [INFO] spring-oauth2-tests-mappings
07-Jun-2019 00:00:21 [INFO] spring-oauth2-tests-form
07-Jun-2019 00:00:21 [INFO] spring-oauth2-tests-jwt
07-Jun-2019 00:00:21 [INFO] spring-oauth2-tests-approval
07-Jun-2019 00:00:21 [INFO] spring-oauth2-tests-jdbc
07-Jun-2019 00:00:21 [INFO] spring-oauth2-tests-jpa
07-Jun-2019 00:00:21 [INFO] spring-oauth2-tests-jaxb
07-Jun-2019 00:00:21 [INFO] spring-oauth-tests-custom-grant
07-Jun-2019 00:00:21 [INFO] spring-oauth2-tests-multi
07-Jun-2019 00:00:21 [INFO] spring-oauth2-tests-client
07-Jun-2019 00:00:21 [INFO] spring-oauth2-tests-resource
07-Jun-2019 00:00:21 [INFO] spring-oauth2-tests-custom-authentication
07-Jun-2019 00:00:21 [INFO] spring-oauth2-tests-xml
07-Jun-2019 00:00:21 [INFO] spring-oauth2-tests-xml-common
07-Jun-2019 00:00:21 [INFO] spring-oauth2-tests-xml-vanilla
07-Jun-2019 00:00:21 [INFO] spring-oauth2-tests-xml-mappings
07-Jun-2019 00:00:21 [INFO] spring-oauth2-tests-xml-form
07-Jun-2019 00:00:21 [INFO] spring-oauth2-tests-xml-jwt
07-Jun-2019 00:00:21 [INFO] spring-oauth2-tests-xml-approval
07-Jun-2019 00:00:21 [INFO] spring-oauth2-tests-xml-jdbc
07-Jun-2019 00:00:21 [INFO] spring-oauth2-tests-xml-client
07-Jun-2019 00:00:21 [INFO] OAuth for Spring Security - Integration Tests
07-Jun-2019 00:00:21 [INFO] OAuth for Spring Security - Sparklr (OAuth 1 Provider Example)
07-Jun-2019 00:00:21 [INFO] OAuth for Spring Security - Tonr (OAuth 1 Consumer Example)
07-Jun-2019 00:00:21 [INFO] OAuth for Spring Security - Sparklr2 (OAuth 2 Provider Example)
07-Jun-2019 00:00:21 [INFO] OAuth for Spring Security - Tonr2 (OAuth 2 Client Example)
07-Jun-2019 00:00:21 [INFO] OAuth for Spring Security - Samples
07-Jun-2019 00:00:21 [INFO]                                                                         
07-Jun-2019 00:00:21 [INFO] ------------------------------------------------------------------------
07-Jun-2019 00:00:21 [INFO] Building OAuth for Spring Security 2.3.7.BUILD-SNAPSHOT
07-Jun-2019 00:00:21 [INFO] ------------------------------------------------------------------------
07-Jun-2019 00:00:21 [INFO]
07-Jun-2019 00:00:21 [INFO] --- maven-clean-plugin:2.5:clean (default-clean) @ spring-security-oauth-parent ---
07-Jun-2019 00:00:21 [INFO]
07-Jun-2019 00:00:21 [INFO] >>> maven-source-plugin:2.1.2:jar (attach-sources) > generate-sources @ spring-security-oauth-parent >>>
07-Jun-2019 00:00:21 [INFO]
07-Jun-2019 00:00:21 [INFO] <<< maven-source-plugin:2.1.2:jar (attach-sources) < generate-sources @ spring-security-oauth-parent <<<
07-Jun-2019 00:00:21 [INFO]
07-Jun-2019 00:00:21 [INFO] --- maven-source-plugin:2.1.2:jar (attach-sources) @ spring-security-oauth-parent ---
07-Jun-2019 00:00:21 [INFO]
07-Jun-2019 00:00:21 [INFO] --- maven-javadoc-plugin:2.9.1:jar (javadoc) @ spring-security-oauth-parent ---
07-Jun-2019 00:00:21 [INFO] Not executing Javadoc as the project is not a Java classpath-capable package
07-Jun-2019 00:00:21 [INFO]
07-Jun-2019 00:00:21 [INFO] --- maven-install-plugin:2.4:install (default-install) @ spring-security-oauth-parent ---
07-Jun-2019 00:00:21 [INFO] Installing /opt/bamboo-home/xml-data/build-dir/SECOAUTH-NIGHTLY-JOB1/pom.xml to /home/bamboo/.m2/repository/org/springframework/security/oauth/spring-security-oauth-parent/2.3.7.BUILD-SNAPSHOT/spring-security-oauth-parent-2.3.7.BUILD-SNAPSHOT.pom
07-Jun-2019 00:00:21 [INFO]                                                                         
07-Jun-2019 00:00:21 [INFO] ------------------------------------------------------------------------
07-Jun-2019 00:00:21 [INFO] Building OAuth 1(a) for Spring Security 2.3.7.BUILD-SNAPSHOT
07-Jun-2019 00:00:21 [INFO] ------------------------------------------------------------------------
07-Jun-2019 00:00:22 [INFO]
07-Jun-2019 00:00:22 [INFO] --- maven-clean-plugin:2.5:clean (default-clean) @ spring-security-oauth ---
07-Jun-2019 00:00:22 [INFO]
07-Jun-2019 00:00:22 [INFO] --- maven-resources-plugin:2.6:resources (default-resources) @ spring-security-oauth ---
07-Jun-2019 00:00:22 [INFO] Using 'UTF-8' encoding to copy filtered resources.
07-Jun-2019 00:00:22 [INFO] Copying 3 resources
07-Jun-2019 00:00:22 [INFO]
07-Jun-2019 00:00:22 [INFO] --- maven-compiler-plugin:2.3.2:compile (default-compile) @ spring-security-oauth ---
07-Jun-2019 00:00:22 [INFO] Compiling 108 source files to /opt/bamboo-home/xml-data/build-dir/SECOAUTH-NIGHTLY-JOB1/spring-security-oauth/target/classes
07-Jun-2019 00:00:23 [WARNING] /opt/bamboo-home/xml-data/build-dir/SECOAUTH-NIGHTLY-JOB1/spring-security-oauth/src/main/java/org/springframework/security/oauth/consumer/net/OAuthOverHttpsURLStreamHandler.java:[36,78] Handler is internal proprietary API and may be removed in a future release
07-Jun-2019 00:00:23 [WARNING] /opt/bamboo-home/xml-data/build-dir/SECOAUTH-NIGHTLY-JOB1/spring-security-oauth/src/main/java/org/springframework/security/oauth/consumer/net/OAuthOverHttpURLStreamHandler.java:[36,76] Handler is internal proprietary API and may be removed in a future release
07-Jun-2019 00:00:23 [INFO]
07-Jun-2019 00:00:23 [INFO] --- maven-resources-plugin:2.6:testResources (default-testResources) @ spring-security-oauth ---
07-Jun-2019 00:00:23 [INFO] Using 'UTF-8' encoding to copy filtered resources.
07-Jun-2019 00:00:23 [INFO] Copying 8 resources
07-Jun-2019 00:00:23 [INFO]
07-Jun-2019 00:00:23 [INFO] --- maven-compiler-plugin:2.3.2:testCompile (default-testCompile) @ spring-security-oauth ---
07-Jun-2019 00:00:23 [INFO] Compiling 22 source files to /opt/bamboo-home/xml-data/build-dir/SECOAUTH-NIGHTLY-JOB1/spring-security-oauth/target/test-classes
07-Jun-2019 00:00:24 [WARNING] /opt/bamboo-home/xml-data/build-dir/SECOAUTH-NIGHTLY-JOB1/spring-security-oauth/src/test/java/org/springframework/security/oauth/consumer/client/CoreOAuthConsumerSupportTests.java:[65,32] Handler is internal proprietary API and may be removed in a future release
07-Jun-2019 00:00:24 [WARNING] /opt/bamboo-home/xml-data/build-dir/SECOAUTH-NIGHTLY-JOB1/spring-security-oauth/src/test/java/org/springframework/security/oauth/consumer/client/CoreOAuthConsumerSupportTests.java:[483,54] Handler is internal proprietary API and may be removed in a future release
07-Jun-2019 00:00:24 [INFO]
07-Jun-2019 00:00:24 [INFO] --- maven-surefire-plugin:2.12.4:test (default-test) @ spring-security-oauth ---
07-Jun-2019 00:00:24 [INFO] Surefire report directory: /opt/bamboo-home/xml-data/build-dir/SECOAUTH-NIGHTLY-JOB1/spring-security-oauth/target/surefire-reports
07-Jun-2019 00:00:24
07-Jun-2019 00:00:24 -------------------------------------------------------
07-Jun-2019 00:00:24 T E S T S
07-Jun-2019 00:00:24 -------------------------------------------------------
07-Jun-2019 00:00:24 Running org.springframework.security.oauth.config.FilterChainInitializationTests
07-Jun-2019 00:00:25 Tests run: 1, Failures: 0, Errors: 0, Skipped: 0, Time elapsed: 1.007 sec
07-Jun-2019 00:00:25 Running org.springframework.security.oauth.config.AuthorizationServerBeanDefinitionParserTests
07-Jun-2019 00:00:26 Tests run: 2, Failures: 0, Errors: 0, Skipped: 0, Time elapsed: 0.329 sec
07-Jun-2019 00:00:26 Running org.springframework.security.oauth.config.ConsumerServiceBeanDefinitionParserTests
07-Jun-2019 00:00:26 Tests run: 2, Failures: 0, Errors: 0, Skipped: 0, Time elapsed: 0.253 sec
07-Jun-2019 00:00:26 Running org.springframework.security.oauth.provider.nonce.InMemoryNonceServicesTests
07-Jun-2019 00:00:26 Tests run: 5, Failures: 0, Errors: 0, Skipped: 0, Time elapsed: 0.006 sec
07-Jun-2019 00:00:26 Running org.springframework.security.oauth.provider.filter.ProtectedResourceProcessingFilterTests
07-Jun-2019 00:00:26 Tests run: 1, Failures: 0, Errors: 0, Skipped: 0, Time elapsed: 0.138 sec
07-Jun-2019 00:00:26 Running org.springframework.security.oauth.provider.filter.OAuthProcessingFilterTests
07-Jun-2019 00:00:26 Tests run: 3, Failures: 0, Errors: 0, Skipped: 0, Time elapsed: 0.046 sec
07-Jun-2019 00:00:26 Running org.springframework.security.oauth.provider.filter.OAuthUserAuthorizationProcessingFilterTests
07-Jun-2019 00:00:26 Tests run: 1, Failures: 0, Errors: 0, Skipped: 0, Time elapsed: 0.005 sec
07-Jun-2019 00:00:26 Running org.springframework.security.oauth.provider.filter.UserAuthorizationSuccessfulAuthenticationHandlerTests
07-Jun-2019 00:00:26 Tests run: 1, Failures: 0, Errors: 0, Skipped: 0, Time elapsed: 0.004 sec
07-Jun-2019 00:00:26 Running org.springframework.security.oauth.provider.filter.AccessTokenProcessingFilterTests
07-Jun-2019 00:00:26 Tests run: 2, Failures: 0, Errors: 0, Skipped: 0, Time elapsed: 0.005 sec
07-Jun-2019 00:00:26 Running org.springframework.security.oauth.provider.filter.UnauthenticatedRequestTokenProcessingFilterTests
07-Jun-2019 00:00:26 Tests run: 2, Failures: 0, Errors: 0, Skipped: 0, Time elapsed: 0.003 sec
07-Jun-2019 00:00:26 Running org.springframework.security.oauth.provider.CoreOAuthProviderSupportTests
07-Jun-2019 00:00:26 Tests run: 2, Failures: 0, Errors: 0, Skipped: 0, Time elapsed: 0.004 sec
07-Jun-2019 00:00:26 Running org.springframework.security.oauth.common.signature.PlainTextSignatureMethodTests
07-Jun-2019 00:00:26 Tests run: 1, Failures: 0, Errors: 0, Skipped: 0, Time elapsed: 0.001 sec
07-Jun-2019 00:00:26 Running org.springframework.security.oauth.common.signature.CoreOAuthSignatureMethodFactoryTests
07-Jun-2019 00:00:26 Tests run: 1, Failures: 0, Errors: 0, Skipped: 0, Time elapsed: 0.238 sec
07-Jun-2019 00:00:26 Running org.springframework.security.oauth.common.signature.RSA_SHA1SignatureMethodTests
07-Jun-2019 00:00:26 Tests run: 2, Failures: 0, Errors: 0, Skipped: 0, Time elapsed: 0.043 sec
07-Jun-2019 00:00:26 Running org.springframework.security.oauth.common.signature.HMAC_SHA1SignatureMethodTests
07-Jun-2019 00:00:26 Tests run: 3, Failures: 0, Errors: 0, Skipped: 0, Time elapsed: 0.027 sec
07-Jun-2019 00:00:26 Running org.springframework.security.oauth.common.OAuthCodecTests
07-Jun-2019 00:00:26 Tests run: 1, Failures: 0, Errors: 0, Skipped: 0, Time elapsed: 0.001 sec
07-Jun-2019 00:00:26 Running org.springframework.security.oauth.consumer.client.CoreOAuthConsumerSupportTests
07-Jun-2019 00:00:26 Tests run: 10, Failures: 0, Errors: 0, Skipped: 0, Time elapsed: 0.021 sec
07-Jun-2019 00:00:26 Running org.springframework.security.oauth.consumer.client.OAuthRestTemplateTests
07-Jun-2019 00:00:26 Tests run: 2, Failures: 0, Errors: 0, Skipped: 0, Time elapsed: 0.131 sec
07-Jun-2019 00:00:26 Running org.springframework.security.oauth.consumer.GoogleOAuthTests
07-Jun-2019 00:00:26 Tests run: 1, Failures: 0, Errors: 0, Skipped: 0, Time elapsed: 0.002 sec
07-Jun-2019 00:00:26 Running org.springframework.security.oauth.consumer.filter.OAuthConsumerContextFilterTests
07-Jun-2019 00:00:26 Tests run: 2, Failures: 0, Errors: 0, Skipped: 0, Time elapsed: 0.018 sec
07-Jun-2019 00:00:26 Running org.springframework.security.oauth.consumer.rememberme.HttpSessionOAuthRememberMeServicesTests
07-Jun-2019 00:00:27 Tests run: 4, Failures: 0, Errors: 0, Skipped: 0, Time elapsed: 0.01 sec
07-Jun-2019 00:00:27 Running net.oauth.signature.GoogleCodeCompatibilityTests
07-Jun-2019 00:00:27 Tests run: 2, Failures: 0, Errors: 0, Skipped: 0, Time elapsed: 0.013 sec
07-Jun-2019 00:00:27
07-Jun-2019 00:00:27 Results :
07-Jun-2019 00:00:27
07-Jun-2019 00:00:27 Tests run: 51, Failures: 0, Errors: 0, Skipped: 0
07-Jun-2019 00:00:27
07-Jun-2019 00:00:27 [INFO]
07-Jun-2019 00:00:27 [INFO] --- maven-jar-plugin:2.4:jar (default-jar) @ spring-security-oauth ---
07-Jun-2019 00:00:27 [INFO] Building jar: /opt/bamboo-home/xml-data/build-dir/SECOAUTH-NIGHTLY-JOB1/spring-security-oauth/target/spring-security-oauth-2.3.7.BUILD-SNAPSHOT.jar
07-Jun-2019 00:00:27 [INFO]
07-Jun-2019 00:00:27 [INFO] >>> maven-source-plugin:2.1.2:jar (attach-sources) > generate-sources @ spring-security-oauth >>>
07-Jun-2019 00:00:27 [INFO]
07-Jun-2019 00:00:27 [INFO] <<< maven-source-plugin:2.1.2:jar (attach-sources) < generate-sources @ spring-security-oauth <<<
07-Jun-2019 00:00:27 [INFO]
07-Jun-2019 00:00:27 [INFO] --- maven-source-plugin:2.1.2:jar (attach-sources) @ spring-security-oauth ---
07-Jun-2019 00:00:27 [INFO] org already added, skipping
07-Jun-2019 00:00:27 [INFO] org/springframework already added, skipping
07-Jun-2019 00:00:27 [INFO] org/springframework/security already added, skipping
07-Jun-2019 00:00:27 [INFO] org/springframework/security/oauth already added, skipping
07-Jun-2019 00:00:27 [INFO] Building jar: /opt/bamboo-home/xml-data/build-dir/SECOAUTH-NIGHTLY-JOB1/spring-security-oauth/target/spring-security-oauth-2.3.7.BUILD-SNAPSHOT-sources.jar
07-Jun-2019 00:00:27 [INFO] org already added, skipping
07-Jun-2019 00:00:27 [INFO] org/springframework already added, skipping
07-Jun-2019 00:00:27 [INFO] org/springframework/security already added, skipping
07-Jun-2019 00:00:27 [INFO] org/springframework/security/oauth already added, skipping
07-Jun-2019 00:00:27 [INFO]
07-Jun-2019 00:00:27 [INFO] --- maven-javadoc-plugin:2.9.1:jar (javadoc) @ spring-security-oauth ---
07-Jun-2019 00:00:30 [INFO]
07-Jun-2019 00:00:30 2 warnings
07-Jun-2019 00:00:30 [WARNING] Javadoc Warnings
07-Jun-2019 00:00:30 [WARNING] /opt/bamboo-home/xml-data/build-dir/SECOAUTH-NIGHTLY-JOB1/spring-security-oauth/src/main/java/org/springframework/security/oauth/consumer/net/OAuthOverHttpURLStreamHandler.java:36: warning: Handler is internal proprietary API and may be removed in a future release
07-Jun-2019 00:00:30 [WARNING] public class OAuthOverHttpURLStreamHandler extends sun.net.www.protocol.http.Handler {
07-Jun-2019 00:00:30 [WARNING] ^
07-Jun-2019 00:00:30 [WARNING] /opt/bamboo-home/xml-data/build-dir/SECOAUTH-NIGHTLY-JOB1/spring-security-oauth/src/main/java/org/springframework/security/oauth/consumer/net/OAuthOverHttpsURLStreamHandler.java:36: warning: Handler is internal proprietary API and may be removed in a future release
07-Jun-2019 00:00:30 [WARNING] public class OAuthOverHttpsURLStreamHandler extends sun.net.www.protocol.https.Handler {
07-Jun-2019 00:00:30 [WARNING] ^
07-Jun-2019 00:00:30 [INFO] Building jar: /opt/bamboo-home/xml-data/build-dir/SECOAUTH-NIGHTLY-JOB1/spring-security-oauth/target/spring-security-oauth-2.3.7.BUILD-SNAPSHOT-javadoc.jar
07-Jun-2019 00:00:30 [INFO]
07-Jun-2019 00:00:30 [INFO] --- maven-install-plugin:2.4:install (default-install) @ spring-security-oauth ---
07-Jun-2019 00:00:30 [INFO] Installing /opt/bamboo-home/xml-data/build-dir/SECOAUTH-NIGHTLY-JOB1/spring-security-oauth/target/spring-security-oauth-2.3.7.BUILD-SNAPSHOT.jar to /home/bamboo/.m2/repository/org/springframework/security/oauth/spring-security-oauth/2.3.7.BUILD-SNAPSHOT/spring-security-oauth-2.3.7.BUILD-SNAPSHOT.jar
07-Jun-2019 00:00:30 [INFO] Installing /opt/bamboo-home/xml-data/build-dir/SECOAUTH-NIGHTLY-JOB1/spring-security-oauth/pom.xml to /home/bamboo/.m2/repository/org/springframework/security/oauth/spring-security-oauth/2.3.7.BUILD-SNAPSHOT/spring-security-oauth-2.3.7.BUILD-SNAPSHOT.pom
07-Jun-2019 00:00:30 [INFO] Installing /opt/bamboo-home/xml-data/build-dir/SECOAUTH-NIGHTLY-JOB1/spring-security-oauth/target/spring-security-oauth-2.3.7.BUILD-SNAPSHOT-sources.jar to /home/bamboo/.m2/repository/org/springframework/security/oauth/spring-security-oauth/2.3.7.BUILD-SNAPSHOT/spring-security-oauth-2.3.7.BUILD-SNAPSHOT-sources.jar
07-Jun-2019 00:00:30 [INFO] Installing /opt/bamboo-home/xml-data/build-dir/SECOAUTH-NIGHTLY-JOB1/spring-security-oauth/target/spring-security-oauth-2.3.7.BUILD-SNAPSHOT-javadoc.jar to /home/bamboo/.m2/repository/org/springframework/security/oauth/spring-security-oauth/2.3.7.BUILD-SNAPSHOT/spring-security-oauth-2.3.7.BUILD-SNAPSHOT-javadoc.jar
07-Jun-2019 00:00:30 [INFO]                                                                         
07-Jun-2019 00:00:30 [INFO] ------------------------------------------------------------------------
07-Jun-2019 00:00:30 [INFO] Building OAuth2 for Spring Security 2.3.7.BUILD-SNAPSHOT
07-Jun-2019 00:00:30 [INFO] ------------------------------------------------------------------------
07-Jun-2019 00:00:30 [INFO]
07-Jun-2019 00:00:30 [INFO] --- maven-clean-plugin:2.5:clean (default-clean) @ spring-security-oauth2 ---
07-Jun-2019 00:00:30 [INFO]
07-Jun-2019 00:00:30 [INFO] --- maven-resources-plugin:2.6:resources (default-resources) @ spring-security-oauth2 ---
07-Jun-2019 00:00:30 [INFO] Using 'UTF-8' encoding to copy filtered resources.
07-Jun-2019 00:00:30 [INFO] Copying 4 resources
07-Jun-2019 00:00:30 [INFO]
07-Jun-2019 00:00:30 [INFO] --- maven-compiler-plugin:2.3.2:compile (default-compile) @ spring-security-oauth2 ---
07-Jun-2019 00:00:31 [INFO] Compiling 249 source files to /opt/bamboo-home/xml-data/build-dir/SECOAUTH-NIGHTLY-JOB1/spring-security-oauth2/target/classes
07-Jun-2019 00:00:33 [INFO]
07-Jun-2019 00:00:33 [INFO] --- maven-resources-plugin:2.6:testResources (default-testResources) @ spring-security-oauth2 ---
07-Jun-2019 00:00:33 [INFO] Using 'UTF-8' encoding to copy filtered resources.
07-Jun-2019 00:00:33 [INFO] Copying 21 resources
07-Jun-2019 00:00:33 [INFO]
07-Jun-2019 00:00:33 [INFO] --- maven-compiler-plugin:2.3.2:testCompile (default-testCompile) @ spring-security-oauth2 ---
07-Jun-2019 00:00:33 [INFO] Compiling 120 source files to /opt/bamboo-home/xml-data/build-dir/SECOAUTH-NIGHTLY-JOB1/spring-security-oauth2/target/test-classes
07-Jun-2019 00:00:35 [INFO]
07-Jun-2019 00:00:35 [INFO] --- maven-surefire-plugin:2.12.4:test (default-test) @ spring-security-oauth2 ---
07-Jun-2019 00:00:35 [INFO] Surefire report directory: /opt/bamboo-home/xml-data/build-dir/SECOAUTH-NIGHTLY-JOB1/spring-security-oauth2/target/surefire-reports
07-Jun-2019 00:00:35
07-Jun-2019 00:00:35 -------------------------------------------------------
07-Jun-2019 00:00:35 T E S T S
07-Jun-2019 00:00:35 -------------------------------------------------------
07-Jun-2019 00:00:36 Running org.springframework.security.oauth2.config.annotation.TokenServicesMultipleBeansTests
07-Jun-2019 00:00:37 Tests run: 1, Failures: 0, Errors: 0, Skipped: 0, Time elapsed: 1.412 sec
07-Jun-2019 00:00:37 Running org.springframework.security.oauth2.config.annotation.Gh501EnableAuthorizationServerTests
07-Jun-2019 00:00:38 Tests run: 1, Failures: 0, Errors: 0, Skipped: 0, Time elapsed: 0.66 sec
07-Jun-2019 00:00:38 Running org.springframework.security.oauth2.config.annotation.ClientConfigurationTests
07-Jun-2019 00:00:38 Tests run: 1, Failures: 0, Errors: 0, Skipped: 0, Time elapsed: 0.237 sec
07-Jun-2019 00:00:38 Running org.springframework.security.oauth2.config.annotation.ResourceServerConfigurationTests
07-Jun-2019 00:00:38 [WARN] TokenEndpoint - Handling error: InvalidRequestException, Missing grant type
07-Jun-2019 00:00:39 [WARN] PageNotFound - No mapping found for HTTP request with URI [/] in DispatcherServlet with name ''
07-Jun-2019 00:00:39 [WARN] PageNotFound - No mapping found for HTTP request with URI [/] in DispatcherServlet with name ''
07-Jun-2019 00:00:39 [WARN] PageNotFound - No mapping found for HTTP request with URI [/] in DispatcherServlet with name ''
07-Jun-2019 00:00:39 [WARN] PageNotFound - No mapping found for HTTP request with URI [/] in DispatcherServlet with name ''
07-Jun-2019 00:00:39 [WARN] TokenEndpoint - Handling error: InvalidRequestException, Missing grant type
07-Jun-2019 00:00:39 Tests run: 9, Failures: 0, Errors: 0, Skipped: 0, Time elapsed: 1.545 sec
07-Jun-2019 00:00:39 Running org.springframework.security.oauth2.config.annotation.AuthorizationServerConfigurationTests
07-Jun-2019 00:00:39 [WARN] AnnotationConfigWebApplicationContext - Exception encountered during context initialization - cancelling refresh attempt: org.springframework.beans.factory.UnsatisfiedDependencyException: Error creating bean with name 'org.springframework.security.config.annotation.web.configuration.WebSecurityConfiguration': Unsatisfied dependency expressed through method 'setFilterChainProxySecurityConfigurer' parameter 1; nested exception is org.springframework.beans.factory.BeanExpressionException: Expression parsing failed; nested exception is org.springframework.beans.factory.UnsatisfiedDependencyException: Error creating bean with name 'org.springframework.security.oauth2.config.annotation.web.configuration.AuthorizationServerSecurityConfiguration': Unsatisfied dependency expressed through field 'configurers'; nested exception is org.springframework.beans.factory.NoSuchBeanDefinitionException: No qualifying bean of type 'java.util.List<org.springframework.security.oauth2.config.annotation.web.configuration.AuthorizationServerConfigurer>' available: expected at least 1 bean which qualifies as autowire candidate. Dependency annotations: {@org.springframework.beans.factory.annotation.Autowired(required=true)}
07-Jun-2019 00:00:40 [WARN] JwtAccessTokenConverter - Unable to create an RSA verifier from verifierKey (ignoreable if using MAC)
07-Jun-2019 00:00:41 [WARN] AnnotationConfigWebApplicationContext - Exception encountered during context initialization - cancelling refresh attempt: org.springframework.beans.factory.UnsatisfiedDependencyException: Error creating bean with name 'authorizationServerConfigurationTests.AuthorizationServerTypes': Unsatisfied dependency expressed through field 'tokenServices'; nested exception is org.springframework.beans.factory.BeanCreationException: Error creating bean with name 'org.springframework.security.oauth2.config.annotation.web.configuration.AuthorizationServerEndpointsConfiguration': Invocation of init method failed; nested exception is java.lang.AssertionError
07-Jun-2019 00:00:42 Tests run: 20, Failures: 0, Errors: 0, Skipped: 0, Time elapsed: 2.147 sec
07-Jun-2019 00:00:42 Running org.springframework.security.oauth2.config.annotation.Gh808EnableAuthorizationServerTests
07-Jun-2019 00:00:42 Tests run: 2, Failures: 0, Errors: 0, Skipped: 0, Time elapsed: 0.138 sec
07-Jun-2019 00:00:42 Running org.springframework.security.oauth2.config.xml.ResourceServerBeanDefinitionParserTests
07-Jun-2019 00:00:42 Tests run: 2, Failures: 0, Errors: 0, Skipped: 0, Time elapsed: 0.178 sec
07-Jun-2019 00:00:42 Running org.springframework.security.oauth2.config.xml.AuthorizationServerInvalidParserTests
07-Jun-2019 00:00:42 Tests run: 1, Failures: 0, Errors: 0, Skipped: 0, Time elapsed: 0.027 sec
07-Jun-2019 00:00:42 Running org.springframework.security.oauth2.config.xml.AuthorizationServerBeanDefinitionParserTests
07-Jun-2019 00:00:42 Tests run: 12, Failures: 0, Errors: 0, Skipped: 0, Time elapsed: 0.462 sec
07-Jun-2019 00:00:42 Running org.springframework.security.oauth2.config.xml.ClientDetailsServiceBeanDefinitionParserTests
07-Jun-2019 00:00:42 Tests run: 3, Failures: 0, Errors: 0, Skipped: 0, Time elapsed: 0.034 sec
07-Jun-2019 00:00:42 Running org.springframework.security.oauth2.config.xml.ResourceBeanDefinitionParserTests
07-Jun-2019 00:00:42 Tests run: 7, Failures: 0, Errors: 0, Skipped: 0, Time elapsed: 0.064 sec
07-Jun-2019 00:00:42 Running org.springframework.security.oauth2.config.xml.InvalidResourceBeanDefinitionParserTests
07-Jun-2019 00:00:42 Tests run: 5, Failures: 0, Errors: 0, Skipped: 0, Time elapsed: 0.052 sec
07-Jun-2019 00:00:42 Running org.springframework.security.oauth2.config.xml.AuthorizationServerCustomGrantParserTests
07-Jun-2019 00:00:43 Tests run: 1, Failures: 0, Errors: 0, Skipped: 0, Time elapsed: 0.021 sec
07-Jun-2019 00:00:43 Running org.springframework.security.oauth2.config.xml.AuthorizationServerClientCredentialsPasswordInvalidXmlTests
07-Jun-2019 00:00:43 Tests run: 2, Failures: 0, Errors: 0, Skipped: 0, Time elapsed: 0.306 sec
07-Jun-2019 00:00:43 Running org.springframework.security.oauth2.config.xml.AuthorizationServerClientCredentialsPasswordValidXmlTests
07-Jun-2019 00:00:43 Tests run: 2, Failures: 0, Errors: 0, Skipped: 0, Time elapsed: 0.206 sec
07-Jun-2019 00:00:43 Running org.springframework.security.oauth2.http.converter.jaxb.JaxbOAuth2ExceptionMessageConverterTests
07-Jun-2019 00:00:44 Tests run: 22, Failures: 0, Errors: 0, Skipped: 0, Time elapsed: 1.401 sec
07-Jun-2019 00:00:44 Running org.springframework.security.oauth2.http.converter.jaxb.JaxbOAuth2AccessTokenMessageConverterTests
07-Jun-2019 00:00:45 Tests run: 8, Failures: 0, Errors: 0, Skipped: 0, Time elapsed: 0.823 sec
07-Jun-2019 00:00:45 Running org.springframework.security.oauth2.client.http.OAuth2ErrorHandlerTests
07-Jun-2019 00:00:45 Tests run: 12, Failures: 0, Errors: 0, Skipped: 0, Time elapsed: 0.057 sec
07-Jun-2019 00:00:45 Running org.springframework.security.oauth2.client.DefaultOAuth2RequestAuthenticatorTests
07-Jun-2019 00:00:45 Tests run: 6, Failures: 0, Errors: 0, Skipped: 0, Time elapsed: 0.003 sec
07-Jun-2019 00:00:45 Running org.springframework.security.oauth2.client.token.grant.password.ResourceOwnerPasswordAccessTokenProviderTests
07-Jun-2019 00:00:45 Tests run: 3, Failures: 0, Errors: 0, Skipped: 0, Time elapsed: 0.002 sec
07-Jun-2019 00:00:45 Running org.springframework.security.oauth2.client.token.grant.implicit.ImplicitAccessTokenProviderTests
07-Jun-2019 00:00:45 Tests run: 2, Failures: 0, Errors: 0, Skipped: 0, Time elapsed: 0.001 sec
07-Jun-2019 00:00:45 Running org.springframework.security.oauth2.client.token.grant.code.AuthorizationCodeAccessTokenProviderWithConversionTests
07-Jun-2019 00:00:45 Tests run: 4, Failures: 0, Errors: 0, Skipped: 0, Time elapsed: 0.124 sec
07-Jun-2019 00:00:45 Running org.springframework.security.oauth2.client.token.grant.code.AuthorizationCodeAccessTokenProviderTests
07-Jun-2019 00:00:45 Tests run: 5, Failures: 0, Errors: 0, Skipped: 0, Time elapsed: 0.001 sec
07-Jun-2019 00:00:45 Running org.springframework.security.oauth2.client.token.grant.code.AuthorizationCodeResourceDetailsTests
07-Jun-2019 00:00:45 Tests run: 2, Failures: 0, Errors: 0, Skipped: 0, Time elapsed: 0 sec
07-Jun-2019 00:00:45 Running org.springframework.security.oauth2.client.token.JdbcClientTokenServicesTests
07-Jun-2019 00:00:46 Tests run: 3, Failures: 0, Errors: 0, Skipped: 0, Time elapsed: 0.318 sec
07-Jun-2019 00:00:46 Running org.springframework.security.oauth2.client.token.OAuth2AccessTokenSupportTests
07-Jun-2019 00:00:46 Tests run: 5, Failures: 0, Errors: 0, Skipped: 0, Time elapsed: 0.026 sec
07-Jun-2019 00:00:46 Running org.springframework.security.oauth2.client.token.AccessTokenProviderChainTests
07-Jun-2019 00:00:46 Tests run: 15, Failures: 0, Errors: 0, Skipped: 0, Time elapsed: 0.028 sec
07-Jun-2019 00:00:46 Running org.springframework.security.oauth2.client.filter.OAuth2ClientContextFilterTests
07-Jun-2019 00:00:46 Tests run: 11, Failures: 0, Errors: 0, Skipped: 0, Time elapsed: 0.007 sec
07-Jun-2019 00:00:46 Running org.springframework.security.oauth2.client.filter.OAuth2ClientAuthenticationProcessingFilterTests
07-Jun-2019 00:00:46 Tests run: 5, Failures: 0, Errors: 0, Skipped: 0, Time elapsed: 0.017 sec
07-Jun-2019 00:00:46 Running org.springframework.security.oauth2.client.OAuth2RestTemplateTests
07-Jun-2019 00:00:46 Tests run: 12, Failures: 0, Errors: 0, Skipped: 0, Time elapsed: 0.201 sec
07-Jun-2019 00:00:46 Running org.springframework.security.oauth2.provider.request.DefaultAuthorizationRequestFactoryTests
07-Jun-2019 00:00:46 Tests run: 9, Failures: 0, Errors: 0, Skipped: 0, Time elapsed: 0.003 sec
07-Jun-2019 00:00:46 Running org.springframework.security.oauth2.provider.request.DefaultOAuth2RequestValidatorTests
07-Jun-2019 00:00:46 Tests run: 3, Failures: 0, Errors: 0, Skipped: 0, Time elapsed: 0.001 sec
07-Jun-2019 00:00:46 Running org.springframework.security.oauth2.provider.password.ResourceOwnerPasswordTokenGranterTests
07-Jun-2019 00:00:46 Tests run: 7, Failures: 0, Errors: 0, Skipped: 0, Time elapsed: 0.004 sec
07-Jun-2019 00:00:46 Running org.springframework.security.oauth2.provider.client.BaseClientDetailsTests
07-Jun-2019 00:00:46 Tests run: 11, Failures: 0, Errors: 0, Skipped: 0, Time elapsed: 0.046 sec
07-Jun-2019 00:00:46 Running org.springframework.security.oauth2.provider.client.JdbcClientDetailsServiceTests
07-Jun-2019 00:00:46 Tests run: 14, Failures: 0, Errors: 0, Skipped: 0, Time elapsed: 0.263 sec
07-Jun-2019 00:00:46 Running org.springframework.security.oauth2.provider.client.ClientCredentialsTokenEndpointFilterTests
07-Jun-2019 00:00:46 Tests run: 3, Failures: 0, Errors: 0, Skipped: 0, Time elapsed: 0.021 sec
07-Jun-2019 00:00:46 Running org.springframework.security.oauth2.provider.client.ClientDetailsUserDetailsServiceTests
07-Jun-2019 00:00:46 Tests run: 2, Failures: 0, Errors: 0, Skipped: 0, Time elapsed: 0.005 sec
07-Jun-2019 00:00:46 Running org.springframework.security.oauth2.provider.approval.ApprovalStoreUserApprovalHandlerTests
07-Jun-2019 00:00:46 Tests run: 10, Failures: 0, Errors: 0, Skipped: 0, Time elapsed: 0.005 sec
07-Jun-2019 00:00:46 Running org.springframework.security.oauth2.provider.approval.DefaultUserApprovalHandlerTests
07-Jun-2019 00:00:46 Tests run: 1, Failures: 0, Errors: 0, Skipped: 0, Time elapsed: 0 sec
07-Jun-2019 00:00:46 Running org.springframework.security.oauth2.provider.approval.TokenStoreUserApprovalHandlerTests
07-Jun-2019 00:00:46 Tests run: 3, Failures: 0, Errors: 0, Skipped: 0, Time elapsed: 0.001 sec
07-Jun-2019 00:00:46 Running org.springframework.security.oauth2.provider.approval.JdbcApprovalStoreTests
07-Jun-2019 00:00:46 Tests run: 6, Failures: 0, Errors: 0, Skipped: 0, Time elapsed: 0.073 sec
07-Jun-2019 00:00:46 Running org.springframework.security.oauth2.provider.approval.InMemoryApprovalStoreTests
07-Jun-2019 00:00:46 Tests run: 5, Failures: 0, Errors: 0, Skipped: 0, Time elapsed: 0.001 sec
07-Jun-2019 00:00:46 Running org.springframework.security.oauth2.provider.approval.TokenApprovalStoreTests
07-Jun-2019 00:00:46 Tests run: 5, Failures: 0, Errors: 0, Skipped: 0, Time elapsed: 0.003 sec
07-Jun-2019 00:00:46 Running org.springframework.security.oauth2.provider.vote.ClientScopeVoterTests
07-Jun-2019 00:00:46 Tests run: 3, Failures: 0, Errors: 0, Skipped: 0, Time elapsed: 0.002 sec
07-Jun-2019 00:00:46 Running org.springframework.security.oauth2.provider.vote.ScopeVoterTests
07-Jun-2019 00:00:46 Tests run: 6, Failures: 0, Errors: 0, Skipped: 0, Time elapsed: 0.002 sec
07-Jun-2019 00:00:46 Running org.springframework.security.oauth2.provider.test.OAuth2RequestTests
07-Jun-2019 00:00:46 Tests run: 4, Failures: 0, Errors: 0, Skipped: 0, Time elapsed: 0.001 sec
07-Jun-2019 00:00:46 Running org.springframework.security.oauth2.provider.token.DefaultTokenServicesWithJdbcTests
07-Jun-2019 00:00:47 Tests run: 19, Failures: 0, Errors: 0, Skipped: 0, Time elapsed: 0.365 sec
07-Jun-2019 00:00:47 Running org.springframework.security.oauth2.provider.token.store.JwtAccessTokenConverterTests
07-Jun-2019 00:00:47 [WARN] JwtAccessTokenConverter - Unable to create an RSA verifier from verifierKey (ignoreable if using MAC)
07-Jun-2019 00:00:47 [WARN] JwtAccessTokenConverter - Unable to create an RSA verifier from verifierKey (ignoreable if using MAC)
07-Jun-2019 00:00:47 [WARN] JwtAccessTokenConverter - Unable to create an RSA verifier from verifierKey (ignoreable if using MAC)
07-Jun-2019 00:00:47 Tests run: 14, Failures: 0, Errors: 0, Skipped: 0, Time elapsed: 0.177 sec
07-Jun-2019 00:00:47 Running org.springframework.security.oauth2.provider.token.store.InMemoryTokenStoreTests
07-Jun-2019 00:00:47 Tests run: 16, Failures: 0, Errors: 0, Skipped: 0, Time elapsed: 0.013 sec
07-Jun-2019 00:00:47 Running org.springframework.security.oauth2.provider.token.store.JwtTokenStoreTests
07-Jun-2019 00:00:47 [WARN] JwtAccessTokenConverter - Unable to create an RSA verifier from verifierKey (ignoreable if using MAC)
07-Jun-2019 00:00:47 [WARN] JwtAccessTokenConverter - Unable to create an RSA verifier from verifierKey (ignoreable if using MAC)
07-Jun-2019 00:00:47 [WARN] JwtAccessTokenConverter - Unable to create an RSA verifier from verifierKey (ignoreable if using MAC)
07-Jun-2019 00:00:47 [WARN] JwtAccessTokenConverter - Unable to create an RSA verifier from verifierKey (ignoreable if using MAC)
07-Jun-2019 00:00:47 [WARN] JwtAccessTokenConverter - Unable to create an RSA verifier from verifierKey (ignoreable if using MAC)
07-Jun-2019 00:00:47 [WARN] JwtAccessTokenConverter - Unable to create an RSA verifier from verifierKey (ignoreable if using MAC)
07-Jun-2019 00:00:47 [WARN] JwtAccessTokenConverter - Unable to create an RSA verifier from verifierKey (ignoreable if using MAC)
07-Jun-2019 00:00:47 [WARN] JwtAccessTokenConverter - Unable to create an RSA verifier from verifierKey (ignoreable if using MAC)
07-Jun-2019 00:00:47 [WARN] JwtAccessTokenConverter - Unable to create an RSA verifier from verifierKey (ignoreable if using MAC)
07-Jun-2019 00:00:47 [WARN] JwtAccessTokenConverter - Unable to create an RSA verifier from verifierKey (ignoreable if using MAC)
07-Jun-2019 00:00:47 [WARN] JwtAccessTokenConverter - Unable to create an RSA verifier from verifierKey (ignoreable if using MAC)
07-Jun-2019 00:00:47 [WARN] JwtAccessTokenConverter - Unable to create an RSA verifier from verifierKey (ignoreable if using MAC)
07-Jun-2019 00:00:47 [WARN] JwtAccessTokenConverter - Unable to create an RSA verifier from verifierKey (ignoreable if using MAC)
07-Jun-2019 00:00:47 [WARN] JwtAccessTokenConverter - Unable to create an RSA verifier from verifierKey (ignoreable if using MAC)
07-Jun-2019 00:00:47 [WARN] JwtAccessTokenConverter - Unable to create an RSA verifier from verifierKey (ignoreable if using MAC)
07-Jun-2019 00:00:47 [WARN] JwtAccessTokenConverter - Unable to create an RSA verifier from verifierKey (ignoreable if using MAC)
07-Jun-2019 00:00:47 [WARN] JwtAccessTokenConverter - Unable to create an RSA verifier from verifierKey (ignoreable if using MAC)
07-Jun-2019 00:00:47 [WARN] JwtAccessTokenConverter - Unable to create an RSA verifier from verifierKey (ignoreable if using MAC)
07-Jun-2019 00:00:47 Tests run: 18, Failures: 0, Errors: 0, Skipped: 0, Time elapsed: 0.037 sec
07-Jun-2019 00:00:47 Running org.springframework.security.oauth2.provider.token.store.redis.RedisTokenStorePrefixTests
07-Jun-2019 00:00:50 Tests run: 15, Failures: 0, Errors: 0, Skipped: 0, Time elapsed: 3.119 sec
07-Jun-2019 00:00:50 Running org.springframework.security.oauth2.provider.token.store.redis.RedisTokenStoreMockTests
07-Jun-2019 00:00:50 Tests run: 2, Failures: 0, Errors: 0, Skipped: 0, Time elapsed: 0.066 sec
07-Jun-2019 00:00:50 Running org.springframework.security.oauth2.provider.token.store.redis.RedisTokenStoreTests
07-Jun-2019 00:00:53 Tests run: 16, Failures: 0, Errors: 0, Skipped: 0, Time elapsed: 3.055 sec
07-Jun-2019 00:00:53 Running org.springframework.security.oauth2.provider.token.store.JdbcTokenStoreTests
07-Jun-2019 00:00:53 Tests run: 14, Failures: 0, Errors: 0, Skipped: 0, Time elapsed: 0.155 sec
07-Jun-2019 00:00:53 Running org.springframework.security.oauth2.provider.token.DefaultTokenServicesAuthoritiesChangeTests
07-Jun-2019 00:00:53 Tests run: 1, Failures: 0, Errors: 0, Skipped: 0, Time elapsed: 0.001 sec
07-Jun-2019 00:00:53 Running org.springframework.security.oauth2.provider.token.DefaultUserAuthenticationConverterTests
07-Jun-2019 00:00:53 Tests run: 3, Failures: 0, Errors: 0, Skipped: 0, Time elapsed: 0.003 sec
07-Jun-2019 00:00:53 Running org.springframework.security.oauth2.provider.token.TokenServicesWithTokenEnhancerTests
07-Jun-2019 00:00:53 [WARN] JwtAccessTokenConverter - Unable to create an RSA verifier from verifierKey (ignoreable if using MAC)
07-Jun-2019 00:00:53 [WARN] JwtAccessTokenConverter - Unable to create an RSA verifier from verifierKey (ignoreable if using MAC)
07-Jun-2019 00:00:53 [WARN] JwtAccessTokenConverter - Unable to create an RSA verifier from verifierKey (ignoreable if using MAC)
07-Jun-2019 00:00:53 [WARN] JwtAccessTokenConverter - Unable to create an RSA verifier from verifierKey (ignoreable if using MAC)
07-Jun-2019 00:00:53 [WARN] JwtAccessTokenConverter - Unable to create an RSA verifier from verifierKey (ignoreable if using MAC)
07-Jun-2019 00:00:53 Tests run: 5, Failures: 0, Errors: 0, Skipped: 0, Time elapsed: 0.015 sec
07-Jun-2019 00:00:53 Running org.springframework.security.oauth2.provider.token.DefaultTokenServicesWithJwtTests
07-Jun-2019 00:00:53 [WARN] JwtAccessTokenConverter - Unable to create an RSA verifier from verifierKey (ignoreable if using MAC)
07-Jun-2019 00:00:54 [WARN] JwtAccessTokenConverter - Unable to create an RSA verifier from verifierKey (ignoreable if using MAC)
07-Jun-2019 00:00:54 [WARN] JwtAccessTokenConverter - Unable to create an RSA verifier from verifierKey (ignoreable if using MAC)
07-Jun-2019 00:00:54 [WARN] JwtAccessTokenConverter - Unable to create an RSA verifier from verifierKey (ignoreable if using MAC)
07-Jun-2019 00:00:54 [WARN] JwtAccessTokenConverter - Unable to create an RSA verifier from verifierKey (ignoreable if using MAC)
07-Jun-2019 00:00:54 [WARN] JwtAccessTokenConverter - Unable to create an RSA verifier from verifierKey (ignoreable if using MAC)
07-Jun-2019 00:00:54 [WARN] JwtAccessTokenConverter - Unable to create an RSA verifier from verifierKey (ignoreable if using MAC)
07-Jun-2019 00:00:54 [WARN] JwtAccessTokenConverter - Unable to create an RSA verifier from verifierKey (ignoreable if using MAC)
07-Jun-2019 00:00:54 [WARN] JwtAccessTokenConverter - Unable to create an RSA verifier from verifierKey (ignoreable if using MAC)
07-Jun-2019 00:00:54 [WARN] JwtAccessTokenConverter - Unable to create an RSA verifier from verifierKey (ignoreable if using MAC)
07-Jun-2019 00:00:54 [WARN] JwtAccessTokenConverter - Unable to create an RSA verifier from verifierKey (ignoreable if using MAC)
07-Jun-2019 00:00:54 [WARN] JwtAccessTokenConverter - Unable to create an RSA verifier from verifierKey (ignoreable if using MAC)
07-Jun-2019 00:00:54 [WARN] JwtAccessTokenConverter - Unable to create an RSA verifier from verifierKey (ignoreable if using MAC)
07-Jun-2019 00:00:54 [WARN] JwtAccessTokenConverter - Unable to create an RSA verifier from verifierKey (ignoreable if using MAC)
07-Jun-2019 00:00:54 [WARN] JwtAccessTokenConverter - Unable to create an RSA verifier from verifierKey (ignoreable if using MAC)
07-Jun-2019 00:00:54 Tests run: 15, Failures: 0, Errors: 0, Skipped: 0, Time elapsed: 0.044 sec
07-Jun-2019 00:00:54 Running org.springframework.security.oauth2.provider.token.DefaultTokenServicesTests
07-Jun-2019 00:00:54 Tests run: 1, Failures: 0, Errors: 0, Skipped: 0, Time elapsed: 0.005 sec
07-Jun-2019 00:00:54 Running org.springframework.security.oauth2.provider.token.DefaultTokenServicesWithInMemoryTests
07-Jun-2019 00:00:54 Tests run: 25, Failures: 0, Errors: 0, Skipped: 0, Time elapsed: 0.018 sec
07-Jun-2019 00:00:54 Running org.springframework.security.oauth2.provider.token.DefaultAccessTokenConverterTests
07-Jun-2019 00:00:54 Tests run: 15, Failures: 0, Errors: 0, Skipped: 0, Time elapsed: 0.004 sec
07-Jun-2019 00:00:54 Running org.springframework.security.oauth2.provider.implicit.InMemoryImplicitGrantServiceTests
07-Jun-2019 00:00:54 Tests run: 2, Failures: 0, Errors: 0, Skipped: 0, Time elapsed: 0.001 sec
07-Jun-2019 00:00:54 Running org.springframework.security.oauth2.provider.error.DefaultWebResponseExceptionTranslatorTests
07-Jun-2019 00:00:54 Tests run: 1, Failures: 0, Errors: 0, Skipped: 0, Time elapsed: 0 sec
07-Jun-2019 00:00:54 Running org.springframework.security.oauth2.provider.error.OAuth2AuthenticationEntryPointTests
07-Jun-2019 00:00:54 [WARN] DefaultHandlerExceptionResolver - Resolved exception caused by handler execution: org.springframework.web.HttpMediaTypeNotAcceptableException: Could not find acceptable representation
07-Jun-2019 00:00:54 Tests run: 7, Failures: 0, Errors: 0, Skipped: 0, Time elapsed: 0.035 sec
07-Jun-2019 00:00:54 Running org.springframework.security.oauth2.provider.error.OAuth2AccessDeniedHandlerTests
07-Jun-2019 00:00:54 Tests run: 1, Failures: 0, Errors: 0, Skipped: 0, Time elapsed: 0.004 sec
07-Jun-2019 00:00:54 Running org.springframework.security.oauth2.provider.authentication.OAuth2AuthenticationProcessingFilterTests
07-Jun-2019 00:00:54 Tests run: 8, Failures: 0, Errors: 0, Skipped: 0, Time elapsed: 0.04 sec
07-Jun-2019 00:00:54 Running org.springframework.security.oauth2.provider.authentication.OAuth2AuthenticationDetailsTests
07-Jun-2019 00:00:54 Tests run: 1, Failures: 0, Errors: 0, Skipped: 0, Time elapsed: 0.001 sec
07-Jun-2019 00:00:54 Running org.springframework.security.oauth2.provider.authentication.OAuth2AuthenticationManagerTests
07-Jun-2019 00:00:54 Tests run: 3, Failures: 0, Errors: 0, Skipped: 0, Time elapsed: 0.002 sec
07-Jun-2019 00:00:54 Running org.springframework.security.oauth2.provider.endpoint.FrameworkEndpointHandlerMappingTests
07-Jun-2019 00:00:54 Tests run: 4, Failures: 0, Errors: 0, Skipped: 0, Time elapsed: 0.001 sec
07-Jun-2019 00:00:54 Running org.springframework.security.oauth2.provider.endpoint.WhitelabelApprovalEndpointTests
07-Jun-2019 00:00:54 Tests run: 6, Failures: 0, Errors: 0, Skipped: 0, Time elapsed: 0.003 sec
07-Jun-2019 00:00:54 Running org.springframework.security.oauth2.provider.endpoint.ExactMatchRedirectResolverTests
07-Jun-2019 00:00:54 Tests run: 3, Failures: 0, Errors: 0, Skipped: 0, Time elapsed: 0.001 sec
07-Jun-2019 00:00:54 Running org.springframework.security.oauth2.provider.endpoint.AuthorizationEndpointTests
07-Jun-2019 00:00:54 Tests run: 34, Failures: 0, Errors: 0, Skipped: 0, Time elapsed: 0.023 sec
07-Jun-2019 00:00:54 Running org.springframework.security.oauth2.provider.endpoint.TokenEndpointTests
07-Jun-2019 00:00:54 Tests run: 6, Failures: 0, Errors: 0, Skipped: 0, Time elapsed: 0.01 sec
07-Jun-2019 00:00:54 Running org.springframework.security.oauth2.provider.endpoint.DefaultRedirectResolverTests
07-Jun-2019 00:00:54 Tests run: 31, Failures: 0, Errors: 0, Skipped: 0, Time elapsed: 0.01 sec
07-Jun-2019 00:00:54 Running org.springframework.security.oauth2.provider.endpoint.WhitelabelErrorEndpointTests
07-Jun-2019 00:00:54 Tests run: 3, Failures: 0, Errors: 0, Skipped: 0, Time elapsed: 0.001 sec
07-Jun-2019 00:00:54 Running org.springframework.security.oauth2.provider.endpoint.TokenEndpointAuthenticationFilterTests
07-Jun-2019 00:00:54 Tests run: 3, Failures: 0, Errors: 0, Skipped: 0, Time elapsed: 0.015 sec
07-Jun-2019 00:00:54 Running org.springframework.security.oauth2.provider.AuthorizationRequestTests
07-Jun-2019 00:00:54 Tests run: 9, Failures: 0, Errors: 0, Skipped: 0, Time elapsed: 0.004 sec
07-Jun-2019 00:00:54 Running org.springframework.security.oauth2.provider.OAuth2AuthenticationTests
07-Jun-2019 00:00:54 {"authorities":[{"authority":"ROLE_USER"}],"details":null,"authenticated":false,"userAuthentication":{"authorities":[{"authority":"ROLE_USER"}],"details":null,"authenticated":true,"principal":"foo","credentials":"bar","name":"foo"},"clientOnly":false,"oauth2Request":{"clientId":"id","scope":["read"],"requestParameters":{},"resourceIds":[],"authorities":[],"approved":false,"refresh":false,"redirectUri":null,"responseTypes":[],"extensions":{},"grantType":null,"refreshTokenRequest":null},"principal":"foo","credentials":"","name":"foo"}
07-Jun-2019 00:00:54 Tests run: 8, Failures: 0, Errors: 0, Skipped: 0, Time elapsed: 0.015 sec
07-Jun-2019 00:00:54 Running org.springframework.security.oauth2.provider.expression.OAuth2MethodSecurityExpressionHandlerTests
07-Jun-2019 00:00:54 Tests run: 9, Failures: 0, Errors: 0, Skipped: 0, Time elapsed: 0.006 sec
07-Jun-2019 00:00:54 Running org.springframework.security.oauth2.provider.expression.OAuth2SecurityExpressionMethodsTests
07-Jun-2019 00:00:54 Tests run: 10, Failures: 0, Errors: 0, Skipped: 0, Time elapsed: 0.002 sec
07-Jun-2019 00:00:54 Running org.springframework.security.oauth2.provider.expression.OAuth2WebSecurityExpressionHandlerTests
07-Jun-2019 00:00:54 Tests run: 6, Failures: 0, Errors: 0, Skipped: 0, Time elapsed: 0.003 sec
07-Jun-2019 00:00:54 Running org.springframework.security.oauth2.provider.expression.OAuth2ExpressionParserTests
07-Jun-2019 00:00:54 Tests run: 3, Failures: 0, Errors: 0, Skipped: 0, Time elapsed: 0.007 sec
07-Jun-2019 00:00:54 Running org.springframework.security.oauth2.provider.OAuth2RequestTests
07-Jun-2019 00:00:54 Tests run: 4, Failures: 0, Errors: 0, Skipped: 0, Time elapsed: 0.001 sec
07-Jun-2019 00:00:54 Running org.springframework.security.oauth2.provider.code.AuthorizationCodeTokenGranterTests
07-Jun-2019 00:00:54 Tests run: 5, Failures: 0, Errors: 0, Skipped: 0, Time elapsed: 0.003 sec
07-Jun-2019 00:00:54 Running org.springframework.security.oauth2.provider.code.InMemoryAuthorizationCodeServicesTests
07-Jun-2019 00:00:54 Tests run: 3, Failures: 0, Errors: 0, Skipped: 0, Time elapsed: 0.001 sec
07-Jun-2019 00:00:54 Running org.springframework.security.oauth2.provider.code.JdbcAuthorizationCodeServicesTests
07-Jun-2019 00:00:54 Tests run: 3, Failures: 0, Errors: 0, Skipped: 0, Time elapsed: 0.031 sec
07-Jun-2019 00:00:54 Running org.springframework.security.oauth2.provider.code.SubdomainRedirectResolverTests
07-Jun-2019 00:00:54 Tests run: 2, Failures: 0, Errors: 0, Skipped: 0, Time elapsed: 0.001 sec
07-Jun-2019 00:00:54 Running org.springframework.security.oauth2.common.OAuth2AccessTokenJackson1DeserializerTests
07-Jun-2019 00:00:55 Tests run: 8, Failures: 0, Errors: 0, Skipped: 0, Time elapsed: 1.098 sec
07-Jun-2019 00:00:55 Running org.springframework.security.oauth2.common.OAuth2AccessTokenJackson2DeserializerTests
07-Jun-2019 00:00:56 Tests run: 9, Failures: 0, Errors: 0, Skipped: 0, Time elapsed: 1.036 sec
07-Jun-2019 00:00:56 Running org.springframework.security.oauth2.common.exception.OAuth2ExceptionDeserializerTests
07-Jun-2019 00:00:56 Tests run: 13, Failures: 0, Errors: 0, Skipped: 0, Time elapsed: 0.007 sec
07-Jun-2019 00:00:56 Running org.springframework.security.oauth2.common.exception.OAuth2ExceptionSerializerTests
07-Jun-2019 00:00:56 Tests run: 11, Failures: 0, Errors: 0, Skipped: 0, Time elapsed: 0.008 sec
07-Jun-2019 00:00:56 Running org.springframework.security.oauth2.common.exception.OAuth2ExceptionJackson2DeserializerTests
07-Jun-2019 00:00:56 Tests run: 14, Failures: 0, Errors: 0, Skipped: 0, Time elapsed: 0.005 sec
07-Jun-2019 00:00:56 Running org.springframework.security.oauth2.common.OAuth2AccessTokenJackson2SerializerTests
07-Jun-2019 00:00:57 Tests run: 10, Failures: 0, Errors: 0, Skipped: 0, Time elapsed: 0.907 sec
07-Jun-2019 00:00:57 Running org.springframework.security.oauth2.common.OAuth2AccessTokenJackson1SerializerTests
07-Jun-2019 00:01:01 Tests run: 1, Failures: 0, Errors: 0, Skipped: 0, Time elapsed: 3.976 sec
07-Jun-2019 00:01:01 org.apache.maven.surefire.util.SurefireReflectionException: java.lang.reflect.InvocationTargetException; nested exception is java.lang.reflect.InvocationTargetException: null
07-Jun-2019 00:01:02 Exception: java.lang.OutOfMemoryError thrown from the UncaughtExceptionHandler in thread "main"
07-Jun-2019 00:01:03
07-Jun-2019 00:01:03 Results :
07-Jun-2019 00:01:03
07-Jun-2019 00:01:03 Tests run: 696, Failures: 0, Errors: 0, Skipped: 0
07-Jun-2019 00:01:03
07-Jun-2019 00:01:03 [INFO] ------------------------------------------------------------------------
07-Jun-2019 00:01:03 [INFO] Reactor Summary:
07-Jun-2019 00:01:03 [INFO]
07-Jun-2019 00:01:03 [INFO] OAuth for Spring Security .......................... SUCCESS [  0.949 s]
07-Jun-2019 00:01:03 [INFO] OAuth 1(a) for Spring Security ..................... SUCCESS [  8.806 s]
07-Jun-2019 00:01:03 [INFO] OAuth2 for Spring Security ......................... FAILURE [ 32.111 s]
07-Jun-2019 00:01:03 [INFO] spring-oauth2-tests ................................ SKIPPED
07-Jun-2019 00:01:03 [INFO] spring-oauth2-tests-common ......................... SKIPPED
07-Jun-2019 00:01:03 [INFO] spring-oauth2-tests-vanilla ........................ SKIPPED
07-Jun-2019 00:01:03 [INFO] spring-oauth2-tests-mappings ....................... SKIPPED
07-Jun-2019 00:01:03 [INFO] spring-oauth2-tests-form ........................... SKIPPED
07-Jun-2019 00:01:03 [INFO] spring-oauth2-tests-jwt ............................ SKIPPED
07-Jun-2019 00:01:03 [INFO] spring-oauth2-tests-approval ....................... SKIPPED
07-Jun-2019 00:01:03 [INFO] spring-oauth2-tests-jdbc ........................... SKIPPED
07-Jun-2019 00:01:03 [INFO] spring-oauth2-tests-jpa ............................ SKIPPED
07-Jun-2019 00:01:03 [INFO] spring-oauth2-tests-jaxb ........................... SKIPPED
07-Jun-2019 00:01:03 [INFO] spring-oauth-tests-custom-grant .................... SKIPPED
07-Jun-2019 00:01:03 [INFO] spring-oauth2-tests-multi .......................... SKIPPED
07-Jun-2019 00:01:03 [INFO] spring-oauth2-tests-client ......................... SKIPPED
07-Jun-2019 00:01:03 [INFO] spring-oauth2-tests-resource ....................... SKIPPED
07-Jun-2019 00:01:03 [INFO] spring-oauth2-tests-custom-authentication .......... SKIPPED
07-Jun-2019 00:01:03 [INFO] spring-oauth2-tests-xml ............................ SKIPPED
07-Jun-2019 00:01:03 [INFO] spring-oauth2-tests-xml-common ..................... SKIPPED
07-Jun-2019 00:01:03 [INFO] spring-oauth2-tests-xml-vanilla .................... SKIPPED
07-Jun-2019 00:01:03 [INFO] spring-oauth2-tests-xml-mappings ................... SKIPPED
07-Jun-2019 00:01:03 [INFO] spring-oauth2-tests-xml-form ....................... SKIPPED
07-Jun-2019 00:01:03 [INFO] spring-oauth2-tests-xml-jwt ........................ SKIPPED
07-Jun-2019 00:01:03 [INFO] spring-oauth2-tests-xml-approval ................... SKIPPED
07-Jun-2019 00:01:03 [INFO] spring-oauth2-tests-xml-jdbc ....................... SKIPPED
07-Jun-2019 00:01:03 [INFO] spring-oauth2-tests-xml-client ..................... SKIPPED
07-Jun-2019 00:01:03 [INFO] OAuth for Spring Security - Integration Tests ...... SKIPPED
07-Jun-2019 00:01:03 [INFO] OAuth for Spring Security - Sparklr (OAuth 1 Provider Example) SKIPPED
07-Jun-2019 00:01:03 [INFO] OAuth for Spring Security - Tonr (OAuth 1 Consumer Example) SKIPPED
07-Jun-2019 00:01:03 [INFO] OAuth for Spring Security - Sparklr2 (OAuth 2 Provider Example) SKIPPED
07-Jun-2019 00:01:03 [INFO] OAuth for Spring Security - Tonr2 (OAuth 2 Client Example) SKIPPED
07-Jun-2019 00:01:03 [INFO] OAuth for Spring Security - Samples ................ SKIPPED
07-Jun-2019 00:01:03 [INFO] ------------------------------------------------------------------------
07-Jun-2019 00:01:03 [INFO] BUILD FAILURE
07-Jun-2019 00:01:03 [INFO] ------------------------------------------------------------------------
07-Jun-2019 00:01:03 [INFO] Total time: 45.019 s
07-Jun-2019 00:01:03 [INFO] Finished at: 2019-06-07T00:01:03+00:00
07-Jun-2019 00:01:03 [INFO] Final Memory: 75M/529M
07-Jun-2019 00:01:03 [INFO] ------------------------------------------------------------------------
07-Jun-2019 00:01:03 [ERROR] Failed to execute goal org.apache.maven.plugins:maven-surefire-plugin:2.12.4:test (default-test) on project spring-security-oauth2: Execution default-test of goal org.apache.maven.plugins:maven-surefire-plugin:2.12.4:test failed: The forked VM terminated without saying properly goodbye. VM crash or System.exit called ? -> [Help 1]
07-Jun-2019 00:01:03 [ERROR]
07-Jun-2019 00:01:03 [ERROR] To see the full stack trace of the errors, re-run Maven with the -e switch.
07-Jun-2019 00:01:03 [ERROR] Re-run Maven using the -X switch to enable full debug logging.
07-Jun-2019 00:01:03 [ERROR]
07-Jun-2019 00:01:03 [ERROR] For more information about the errors and possible solutions, please read the following articles:
07-Jun-2019 00:01:03 [ERROR] [Help 1] http://cwiki.apache.org/confluence/display/MAVEN/PluginExecutionException
07-Jun-2019 00:01:03 [ERROR]
07-Jun-2019 00:01:03 [ERROR] After correcting the problems, you can resume the build with the command
07-Jun-2019 00:01:03 [ERROR]   mvn <goals> -rf :spring-security-oauth2
07-Jun-2019 00:01:03 Exception in thread "main"
07-Jun-2019 00:01:03
07-Jun-2019 00:01:03 Failing task since return code of [/opt/jdk-7/bin/java -cp /opt/maven-3.3/boot/plexus-classworlds-2.5.2.jar -Dclassworlds.conf=/tmp/artifactoryM28132616860549221978conf -DbuildInfoConfig.propertiesFile=/tmp/buildInfo6523078775971650426.properties -Xmx1256m -Xms128m -Dmaven.home=/opt/maven-3.3 -Dmaven.multiModuleProjectDirectory=/opt/bamboo-home/xml-data/build-dir/SECOAUTH-NIGHTLY-JOB1 org.codehaus.plexus.classworlds.launcher.Launcher clean install -P bootstrap -Dartifactory.publish.password=********] was 1 while expected 0
07-Jun-2019 00:01:03 Finished task 'Artifactory Maven 3' with result: Failed
07-Jun-2019 00:01:03 Running post build plugin 'Docker Container Cleanup'
07-Jun-2019 00:01:03 Running post build plugin 'NCover Results Collector'
07-Jun-2019 00:01:03 Running post build plugin 'Artifactory Release Management Staging'
07-Jun-2019 00:01:03 Running post build plugin 'Artifactory Build Info Copier'
07-Jun-2019 00:01:03 Running post build plugin 'Artifactory Gradle Properties Info Copier'
07-Jun-2019 00:01:03 Running post build plugin 'Clover Results Collector'
07-Jun-2019 00:01:03 Running post build plugin 'npm Cache Cleanup'
07-Jun-2019 00:01:03 Running post build plugin 'Artifact Copier'
07-Jun-2019 00:01:03 Successfully removed working directory at '/opt/bamboo-home/xml-data/build-dir/SECOAUTH-NIGHTLY-JOB1'
07-Jun-2019 00:01:03 Finalising the build...
07-Jun-2019 00:01:03 Stopping timer.
07-Jun-2019 00:01:03 Build SECOAUTH-NIGHTLY-JOB1-1667 completed.
07-Jun-2019 00:01:03 Running on server: post build plugin 'NCover Results Collector'
07-Jun-2019 00:01:03 Running on server: post build plugin 'Build Hanging Detection Configuration'
07-Jun-2019 00:01:03 Running on server: post build plugin 'Clover Delta Calculator'
07-Jun-2019 00:01:03 Running on server: post build plugin 'Maven Dependencies Postprocessor'
07-Jun-2019 00:01:03 All post build plugins have finished
07-Jun-2019 00:01:03 Generating build results summary...
07-Jun-2019 00:01:03 Saving build results to disk...
07-Jun-2019 00:01:03 Logging substituted variables...
07-Jun-2019 00:01:03 Indexing build results...
07-Jun-2019 00:01:03 Finished building SECOAUTH-NIGHTLY-JOB1-1667.