Build: #1668 failed

Job: Default Job failed

Stages & jobs

  1. Default Stage

Build log

The build generated 637 lines of output. Download or view full build log

08-Jun-2019 00:00:16 Build Spring Security OAuth - 2.1.x - Default Job #1668 (SECOAUTH-NIGHTLY-JOB1-1668) started building on agent bamboo-21.af.pivotal.io
08-Jun-2019 00:00:16 Remote agent on host bamboo-21.af.pivotal.io
08-Jun-2019 00:00:17 Build working directory is /opt/bamboo-home/xml-data/build-dir/SECOAUTH-NIGHTLY-JOB1
08-Jun-2019 00:00:17 Executing build Spring Security OAuth - 2.1.x - Default Job #1668 (SECOAUTH-NIGHTLY-JOB1-1668)
08-Jun-2019 00:00:17 Starting task 'Checkout Default Repository' of type 'com.atlassian.bamboo.plugins.vcs:task.vcs.checkout'
08-Jun-2019 00:00:17 Build always requires a clean checkout
08-Jun-2019 00:00:17 Cleaning build directory '/opt/bamboo-home/xml-data/build-dir/SECOAUTH-NIGHTLY-JOB1'
08-Jun-2019 00:00:17 Checking out into /opt/bamboo-home/xml-data/build-dir/SECOAUTH-NIGHTLY-JOB1
08-Jun-2019 00:00:17 Updating source code to revision: 3d37444a991104dd7f23edb2812e9f57620a1395
08-Jun-2019 00:00:17 Creating local git repository in '/opt/bamboo-home/xml-data/build-dir/SECOAUTH-NIGHTLY-JOB1/.git'.
08-Jun-2019 00:00:17 Initialized empty Git repository in /opt/bamboo-home/xml-data/build-dir/SECOAUTH-NIGHTLY-JOB1/.git/
08-Jun-2019 00:00:18 Fetching 'refs/heads/master' from 'git://github.com/SpringSource/spring-security-oauth.git'. Will try to do a shallow fetch.
08-Jun-2019 00:00:22 From git://github.com/SpringSource/spring-security-oauth
08-Jun-2019 00:00:22 * [new branch]      master     -> master
08-Jun-2019 00:00:22 Checking out revision 3d37444a991104dd7f23edb2812e9f57620a1395.
08-Jun-2019 00:00:23 Already on 'master'
08-Jun-2019 00:00:23 Updated source code to revision: 3d37444a991104dd7f23edb2812e9f57620a1395
08-Jun-2019 00:00:23 Finished task 'Checkout Default Repository' with result: Success
08-Jun-2019 00:00:23 Running pre-build action: Artifactory Release Staging
08-Jun-2019 00:00:23 Running pre-build action: VCS Version Collector
08-Jun-2019 00:00:23 Skipping execution of task 'Build' as it is disabled
08-Jun-2019 00:00:23 Starting task 'Artifactory Maven 3' of type 'org.jfrog.bamboo.bamboo-artifactory-plugin:maven3Task'
08-Jun-2019 00:00:23 Bamboo Artifactory Plugin version: 2.6.3
08-Jun-2019 00:00:23
Beginning to execute external process for build 'Spring Security OAuth - 2.1.x - Default Job #1668 (SECOAUTH-NIGHTLY-JOB1-1668)'
... running command line:
/opt/jdk-7/bin/java -cp /opt/maven-3.3/boot/plexus-classworlds-2.5.2.jar -Dclassworlds.conf=/tmp/artifactoryM2767764974873316953conf -DbuildInfoConfig.propertiesFile=/tmp/buildInfo1714487480409415623.properties -Xmx1256m -Xms128m -Dmaven.home=/opt/maven-3.3 -Dmaven.multiModuleProjectDirectory=/opt/bamboo-home/xml-data/build-dir/SECOAUTH-NIGHTLY-JOB1 org.codehaus.plexus.classworlds.launcher.Launcher clean install -P bootstrap -Dartifactory.publish.password=********
... in: /opt/bamboo-home/xml-data/build-dir/SECOAUTH-NIGHTLY-JOB1
... using extra environment variables:
bamboo_planRepository_1_branch=master
bamboo_repository_94273667_previous_revision_number=3d37444a991104dd7f23edb2812e9f57620a1395
bamboo_********_username_password=********
bamboo_signing_store_password=********
bamboo_capability_system_builder_ant_Ant_1_9=/opt/ant-1.9
bamboo_capability_system_builder_ant_Ant_1_8=/opt/ant-1.8
bamboo_planRepository_1_branchDisplayName=master
bamboo_artifactory_override_resolve_repo=libs-milestone
bamboo_capability_system_builder_node_Node_js_10_16=/opt/node-10.16/bin/node
bamboo_repository_revision_number=3d37444a991104dd7f23edb2812e9f57620a1395
bamboo_RIAK_BIN=/usr/sbin/riak
bamboo_repository_94273667_revision_number=3d37444a991104dd7f23edb2812e9f57620a1395
WRAPPER_BITS=32
bamboo_buildKey=SECOAUTH-NIGHTLY-JOB1
bamboo_repository_94273667_git_branch=master
bamboo_bintray_password=********
bamboo_sonar_token_password=********
PWD=/opt/bamboo-home/bin
bamboo_shortJobName=Default Job
bamboo_artifactory_override_resolver_password=********
bamboo_capability_system_builder_gradle___gradlew=./gradlew
bamboo_buildResultsUrl=https://build.spring.io/browse/SECOAUTH-NIGHTLY-JOB1-1668
bamboo_capability_system_builder_mvn3_Maven_3_3=/opt/maven-3.3
bamboo_capability_system_builder_mvn3_Maven_3_2=/opt/maven-3.2
bamboo_capability_system_builder_mvn3_Maven_3_1=/opt/maven-3.1
bamboo_planRepository_repositoryUrl=git://github.com/SpringSource/spring-security-oauth.git
bamboo_capability_system_builder_mvn3_Maven_3_6=/opt/maven-3.6
bamboo_agentId=286195722
bamboo_capability_system_builder_mvn3_Maven_3_5=/opt/maven-3.5
bamboo_capability_system_builder_mvn3_Maven_3_0=/opt/maven-3.0
bamboo_planRepository_revision=3d37444a991104dd7f23edb2812e9f57620a1395
bamboo_planRepository_previousRevision=3d37444a991104dd7f23edb2812e9f57620a1395
bamboo_capability_remote_build=true
bamboo_repository_branch_name=master
bamboo_sonatype_token_password=********
SHLVL=1
bamboo_org_jfrog_bamboo_buildInfo_serverUrl=https://repo.spring.io
bamboo_scdf_acceptance_tests_password=********
bamboo_repository_94273667_branch_name=master
WRAPPER_OS=linux
TERM=linux
XDG_SESSION_ID=c1
bamboo_planRepository_branch=master
bamboo_org_jfrog_bamboo_release_activated=false
bamboo_planRepository_1_type=gitv2
bamboo_planRepository_branchName=master
bamboo_capability_system_jdk_JDK_12=/opt/jdk-12
WRAPPER_FILE_SEPARATOR=/
_=/opt/bamboo-home/bin/bamboo-agent.sh
bamboo_capability_system_builder_ant_Ant_1_10=/opt/ant-1.10
bamboo_repository_94273667_name=Plan Repository
WRAPPER_PATH_SEPARATOR=:
bamboo_sonar_password=********
bamboo_hg_cache_directory=/opt/bamboo-home/xml-data/build-dir/_hg-repositories-cache
bamboo_planRepository_1_username=
bamboo_planRepository_type=gitv2
bamboo_git_cache_directory=/opt/bamboo-home/xml-data/build-dir/_git-repositories-cache
bamboo_artifactory_username=buildmaster
bamboo_tmp_directory=/opt/bamboo-home/temp
bamboo_planKey=SECOAUTH-NIGHTLY
bamboo_planRepository_username=
bamboo_JDK8_HOME=/opt/jdk-8
bamboo_repository_94273667_git_username=
bamboo_planRepository_1_branchName=master
bamboo_sonar_version=5.6.3
bamboo_sonar_jdbc_password=********
bamboo_bintray_api_key_password=********
XDG_DATA_DIRS=/usr/local/share:/usr/share:/var/lib/snapd/desktop
bamboo_capability_system_jdk_JDK_1_11=/opt/jdk-11
bamboo_resultsUrl=https://build.spring.io/browse/SECOAUTH-NIGHTLY-JOB1-1668
bamboo_capability_system_jdk_JDK_1_10=/opt/jdk-10
bamboo_build_working_directory=/opt/bamboo-home/xml-data/build-dir/SECOAUTH-NIGHTLY-JOB1
bamboo_planRepository_1_name=Plan Repository
bamboo_capability_system_os=ubuntu1804
bamboo_nexusPush_stagingProfile=buildmaster
bamboo_shortPlanName=2.1.x
MAIL=/var/mail/bamboo
bamboo_planRepository_name=Plan Repository
LOGNAME=bamboo
bamboo_buildNumber=1668
SHELL=/bin/bash
bamboo_planName=Spring Security OAuth - 2.1.x
bamboo_JDK7_HOME=/opt/jdk-7
bamboo_repository_94273667_git_repositoryUrl=git://github.com/SpringSource/spring-security-oauth.git
bamboo_shortPlanKey=NIGHTLY
OLDPWD=/opt/users/bamboo
bamboo_shortJobKey=JOB1
bamboo_artifactory_password=********
bamboo_buildTimeStamp=2019-06-08T00:00:07.002Z
bamboo_repository_previous_revision_number=3d37444a991104dd7f23edb2812e9f57620a1395
bamboo_sonar_username=buildmaster
bamboo_********_password=********
bamboo_repository_git_branch=master
bamboo_buildResultKey=SECOAUTH-NIGHTLY-JOB1-1668
bamboo_nexusPush_close=true
bamboo_artifactory_override_resolver_username=buildmaster
bamboo_buildPlanName=Spring Security OAuth - 2.1.x - Default Job
bamboo_planRepository_1_revision=3d37444a991104dd7f23edb2812e9f57620a1395
bamboo_repository_name=Plan Repository
bamboo_signing_key_password=********
bamboo_capability_system_builder_groovy_Groovy_2_5=/opt/groovy-2.5
LANG=en_US.UTF-8
bamboo_buildFailed=false
bamboo_capability_system_docker_executable=/usr/bin/docker
DISPLAY=localhost:1.0
bamboo_capability_system_jdk_OpenJDK_7=/opt/jdk-7
bamboo_capability_system_builder_groovy_Groovy_2_4=/opt/groovy-2.4
bamboo_artifactory_override_deployer_username=buildmaster
bamboo_capability_system_builder_command_Bash=/bin/bash
bamboo_artifactory_password_mask_a=********
bamboo_agentWorkingDirectory=/opt/bamboo-home/xml-data/build-dir
bamboo_capability_system_git_executable=/usr/bin/git
bamboo_repository_git_username=
bamboo_planRepository_1_previousRevision=3d37444a991104dd7f23edb2812e9f57620a1395
bamboo_capability_os_family=unix
bamboo_planRepository_branchDisplayName=master
bamboo_capability_system_builder_maven_Artifactory_Maven_3_6=/opt/maven-3.6
bamboo_capability_system_builder_maven_Artifactory_Maven_3_5=/opt/maven-3.5
GIT_SSL_NO_VERIFY=true
bamboo_capability_system_builder_maven_Artifactory_Maven_3_3=/opt/maven-3.3
bamboo_capability_system_builder_maven_Artifactory_Maven_3_2=/opt/maven-3.2
bamboo_s3_properties=/home/bamboo/tools/s3.properties
bamboo_capability_system_builder_maven_Artifactory_Maven_3_1=/opt/maven-3.1
bamboo_artifactory_override_deploy_repo=libs-snapshot-local
bamboo_capability_system_builder_maven_Artifactory_Maven_3_0=/opt/maven-3.0
bamboo_plan_storageTag=SECOAUTH-NIGHTLY
bamboo_bintray_username_password=********
USER=bamboo
bamboo_repository_git_repositoryUrl=git://github.com/SpringSource/spring-security-oauth.git
bamboo_working_directory=/opt/bamboo-home/xml-data/build-dir/SECOAUTH-NIGHTLY-JOB1
bamboo_org_jfrog_bamboo_buildInfo_activated=true
bamboo_planRepository_1_repositoryUrl=git://github.com/SpringSource/spring-security-oauth.git
bamboo_capability_system_jdk_JDK_1_8=/opt/jdk-8
bamboo_artifactory_override_deployer_password=********
bamboo_capability_system_jdk_JDK_1_9=/opt/jdk-9
WRAPPER_ARCH=x86
bamboo_capability_system_jdk_JDK_1_6=/opt/jdk-6
bamboo_sonatype_password=********
bamboo_capability_system_jdk_JDK_1_7=/opt/jdk-7
bamboo_sonar_ip=10.194.6.9
XDG_RUNTIME_DIR=/run/user/1002
HOME=/home/bamboo
PATH=/bin:/home/bamboo/bin:/usr/local/sbin:/usr/local/bin:/usr/sbin:/usr/bin:/sbin:/bin:/usr/games:/usr/local/games:/snap/bin:/home/bamboo/bin:/usr/local/bin:/bin:/home/bamboo/bin:/usr/local/sbin:/usr/local/bin:/usr/sbin:/usr/bin:/sbin:/bin:/usr/games:/usr/local/games:/snap/bin:/home/bamboo/bin:/usr/local/bin
08-Jun-2019 00:00:24 [INFO] Scanning for projects...
08-Jun-2019 00:00:24 Downloading: https://repo.spring.io/libs-snapshot-local/org/springframework/boot/spring-boot-starter-parent/1.5.1.RELEASE/spring-boot-starter-parent-1.5.1.RELEASE.pom
08-Jun-2019 00:00:25
08-Jun-2019 00:00:25 Downloading: https://repo.spring.io/libs-milestone-local/org/springframework/boot/spring-boot-starter-parent/1.5.1.RELEASE/spring-boot-starter-parent-1.5.1.RELEASE.pom
08-Jun-2019 00:00:25
08-Jun-2019 00:00:25 Downloading: https://repo.spring.io/release/org/springframework/boot/spring-boot-starter-parent/1.5.1.RELEASE/spring-boot-starter-parent-1.5.1.RELEASE.pom
08-Jun-2019 00:00:25 1/8 KB   
08-Jun-2019 00:00:25 3/8 KB   
08-Jun-2019 00:00:25 4/8 KB   
08-Jun-2019 00:00:25 5/8 KB   
08-Jun-2019 00:00:25 7/8 KB   
08-Jun-2019 00:00:25 8/8 KB   
08-Jun-2019 00:00:25          
08-Jun-2019 00:00:25 Downloaded: https://repo.spring.io/release/org/springframework/boot/spring-boot-starter-parent/1.5.1.RELEASE/spring-boot-starter-parent-1.5.1.RELEASE.pom (8 KB at 37.6 KB/sec)
08-Jun-2019 00:00:25 Downloading: https://repo.spring.io/libs-snapshot-local/org/springframework/boot/spring-boot-dependencies/1.5.1.RELEASE/spring-boot-dependencies-1.5.1.RELEASE.pom
08-Jun-2019 00:00:25          
08-Jun-2019 00:00:25 Downloading: https://repo.spring.io/libs-milestone-local/org/springframework/boot/spring-boot-dependencies/1.5.1.RELEASE/spring-boot-dependencies-1.5.1.RELEASE.pom
08-Jun-2019 00:00:25          
08-Jun-2019 00:00:25 Downloading: https://repo.spring.io/release/org/springframework/boot/spring-boot-dependencies/1.5.1.RELEASE/spring-boot-dependencies-1.5.1.RELEASE.pom
08-Jun-2019 00:00:25 1/88 KB   
08-Jun-2019 00:00:25 3/88 KB   
08-Jun-2019 00:00:25 4/88 KB   
08-Jun-2019 00:00:25 5/88 KB   
08-Jun-2019 00:00:25 7/88 KB   
08-Jun-2019 00:00:25 8/88 KB   
08-Jun-2019 00:00:25 9/88 KB   
08-Jun-2019 00:00:25 11/88 KB   
08-Jun-2019 00:00:25 12/88 KB   
08-Jun-2019 00:00:25 13/88 KB   
08-Jun-2019 00:00:25 14/88 KB   
08-Jun-2019 00:00:25 15/88 KB   
08-Jun-2019 00:00:25 16/88 KB   
08-Jun-2019 00:00:25 18/88 KB   
08-Jun-2019 00:00:25 19/88 KB   
08-Jun-2019 00:00:25 20/88 KB   
08-Jun-2019 00:00:25 22/88 KB   
08-Jun-2019 00:00:25 23/88 KB   
08-Jun-2019 00:00:25 24/88 KB   
08-Jun-2019 00:00:25 26/88 KB   
08-Jun-2019 00:00:25 27/88 KB   
08-Jun-2019 00:00:25 28/88 KB   
08-Jun-2019 00:00:25 30/88 KB   
08-Jun-2019 00:00:25 31/88 KB   
08-Jun-2019 00:00:25 32/88 KB   
08-Jun-2019 00:00:25 34/88 KB   
08-Jun-2019 00:00:25 35/88 KB   
08-Jun-2019 00:00:25 36/88 KB   
08-Jun-2019 00:00:25 38/88 KB   
08-Jun-2019 00:00:25 39/88 KB   
08-Jun-2019 00:00:25 40/88 KB   
08-Jun-2019 00:00:25 41/88 KB   
08-Jun-2019 00:00:25 43/88 KB   
08-Jun-2019 00:00:25 44/88 KB   
08-Jun-2019 00:00:25 45/88 KB   
08-Jun-2019 00:00:25 47/88 KB   
08-Jun-2019 00:00:25 48/88 KB   
08-Jun-2019 00:00:25 49/88 KB   
08-Jun-2019 00:00:25 51/88 KB   
08-Jun-2019 00:00:25 52/88 KB   
08-Jun-2019 00:00:25 53/88 KB   
08-Jun-2019 00:00:25 55/88 KB   
08-Jun-2019 00:00:25 56/88 KB   
08-Jun-2019 00:00:25 57/88 KB   
08-Jun-2019 00:00:25 59/88 KB   
08-Jun-2019 00:00:25 60/88 KB   
08-Jun-2019 00:00:25 61/88 KB   
08-Jun-2019 00:00:25 63/88 KB   
08-Jun-2019 00:00:25 63/88 KB   
08-Jun-2019 00:00:25 64/88 KB   
08-Jun-2019 00:00:25 66/88 KB   
08-Jun-2019 00:00:25 66/88 KB   
08-Jun-2019 00:00:25 67/88 KB   
08-Jun-2019 00:00:25 69/88 KB   
08-Jun-2019 00:00:25 70/88 KB   
08-Jun-2019 00:00:25 71/88 KB   
08-Jun-2019 00:00:25 73/88 KB   
08-Jun-2019 00:00:25 74/88 KB   
08-Jun-2019 00:00:25 75/88 KB   
08-Jun-2019 00:00:25 77/88 KB   
08-Jun-2019 00:00:25 78/88 KB   
08-Jun-2019 00:00:25 79/88 KB   
08-Jun-2019 00:00:25 81/88 KB   
08-Jun-2019 00:00:25 82/88 KB   
08-Jun-2019 00:00:25 83/88 KB   
08-Jun-2019 00:00:25 85/88 KB   
08-Jun-2019 00:00:25 86/88 KB   
08-Jun-2019 00:00:25 87/88 KB   
08-Jun-2019 00:00:25 88/88 KB   
08-Jun-2019 00:00:25            
08-Jun-2019 00:00:25 Downloaded: https://repo.spring.io/release/org/springframework/boot/spring-boot-dependencies/1.5.1.RELEASE/spring-boot-dependencies-1.5.1.RELEASE.pom (88 KB at 343.0 KB/sec)
08-Jun-2019 00:00:27 [INFO] Initializing Artifactory Build-Info Recording
08-Jun-2019 00:00:27 [INFO] ------------------------------------------------------------------------
08-Jun-2019 00:00:27 [INFO] Reactor Build Order:
08-Jun-2019 00:00:27 [INFO]
08-Jun-2019 00:00:27 [INFO] OAuth for Spring Security
08-Jun-2019 00:00:27 [INFO] OAuth 1(a) for Spring Security
08-Jun-2019 00:00:27 [INFO] OAuth2 for Spring Security
08-Jun-2019 00:00:27 [INFO] spring-oauth2-tests
08-Jun-2019 00:00:27 [INFO] spring-oauth2-tests-common
08-Jun-2019 00:00:27 [INFO] spring-oauth2-tests-vanilla
08-Jun-2019 00:00:27 [INFO] spring-oauth2-tests-mappings
08-Jun-2019 00:00:27 [INFO] spring-oauth2-tests-form
08-Jun-2019 00:00:27 [INFO] spring-oauth2-tests-jwt
08-Jun-2019 00:00:27 [INFO] spring-oauth2-tests-approval
08-Jun-2019 00:00:27 [INFO] spring-oauth2-tests-jdbc
08-Jun-2019 00:00:27 [INFO] spring-oauth2-tests-jpa
08-Jun-2019 00:00:27 [INFO] spring-oauth2-tests-jaxb
08-Jun-2019 00:00:27 [INFO] spring-oauth-tests-custom-grant
08-Jun-2019 00:00:27 [INFO] spring-oauth2-tests-multi
08-Jun-2019 00:00:27 [INFO] spring-oauth2-tests-client
08-Jun-2019 00:00:27 [INFO] spring-oauth2-tests-resource
08-Jun-2019 00:00:27 [INFO] spring-oauth2-tests-custom-authentication
08-Jun-2019 00:00:27 [INFO] spring-oauth2-tests-xml
08-Jun-2019 00:00:27 [INFO] spring-oauth2-tests-xml-common
08-Jun-2019 00:00:27 [INFO] spring-oauth2-tests-xml-vanilla
08-Jun-2019 00:00:27 [INFO] spring-oauth2-tests-xml-mappings
08-Jun-2019 00:00:27 [INFO] spring-oauth2-tests-xml-form
08-Jun-2019 00:00:27 [INFO] spring-oauth2-tests-xml-jwt
08-Jun-2019 00:00:27 [INFO] spring-oauth2-tests-xml-approval
08-Jun-2019 00:00:27 [INFO] spring-oauth2-tests-xml-jdbc
08-Jun-2019 00:00:27 [INFO] spring-oauth2-tests-xml-client
08-Jun-2019 00:00:27 [INFO] OAuth for Spring Security - Integration Tests
08-Jun-2019 00:00:27 [INFO] OAuth for Spring Security - Sparklr (OAuth 1 Provider Example)
08-Jun-2019 00:00:27 [INFO] OAuth for Spring Security - Tonr (OAuth 1 Consumer Example)
08-Jun-2019 00:00:27 [INFO] OAuth for Spring Security - Sparklr2 (OAuth 2 Provider Example)
08-Jun-2019 00:00:27 [INFO] OAuth for Spring Security - Tonr2 (OAuth 2 Client Example)
08-Jun-2019 00:00:27 [INFO] OAuth for Spring Security - Samples
08-Jun-2019 00:00:27 [INFO]                                                                         
08-Jun-2019 00:00:27 [INFO] ------------------------------------------------------------------------
08-Jun-2019 00:00:27 [INFO] Building OAuth for Spring Security 2.3.7.BUILD-SNAPSHOT
08-Jun-2019 00:00:27 [INFO] ------------------------------------------------------------------------
08-Jun-2019 00:00:27 [INFO]
08-Jun-2019 00:00:27 [INFO] --- maven-clean-plugin:2.5:clean (default-clean) @ spring-security-oauth-parent ---
08-Jun-2019 00:00:27 [INFO]
08-Jun-2019 00:00:27 [INFO] >>> maven-source-plugin:2.1.2:jar (attach-sources) > generate-sources @ spring-security-oauth-parent >>>
08-Jun-2019 00:00:27 [INFO]
08-Jun-2019 00:00:27 [INFO] <<< maven-source-plugin:2.1.2:jar (attach-sources) < generate-sources @ spring-security-oauth-parent <<<
08-Jun-2019 00:00:27 [INFO]
08-Jun-2019 00:00:27 [INFO] --- maven-source-plugin:2.1.2:jar (attach-sources) @ spring-security-oauth-parent ---
08-Jun-2019 00:00:27 [INFO]
08-Jun-2019 00:00:27 [INFO] --- maven-javadoc-plugin:2.9.1:jar (javadoc) @ spring-security-oauth-parent ---
08-Jun-2019 00:00:28 [INFO] Not executing Javadoc as the project is not a Java classpath-capable package
08-Jun-2019 00:00:28 [INFO]
08-Jun-2019 00:00:28 [INFO] --- maven-install-plugin:2.4:install (default-install) @ spring-security-oauth-parent ---
08-Jun-2019 00:00:28 [INFO] Installing /opt/bamboo-home/xml-data/build-dir/SECOAUTH-NIGHTLY-JOB1/pom.xml to /home/bamboo/.m2/repository/org/springframework/security/oauth/spring-security-oauth-parent/2.3.7.BUILD-SNAPSHOT/spring-security-oauth-parent-2.3.7.BUILD-SNAPSHOT.pom
08-Jun-2019 00:00:28 [INFO]                                                                         
08-Jun-2019 00:00:28 [INFO] ------------------------------------------------------------------------
08-Jun-2019 00:00:28 [INFO] Building OAuth 1(a) for Spring Security 2.3.7.BUILD-SNAPSHOT
08-Jun-2019 00:00:28 [INFO] ------------------------------------------------------------------------
08-Jun-2019 00:00:28 [INFO]
08-Jun-2019 00:00:28 [INFO] --- maven-clean-plugin:2.5:clean (default-clean) @ spring-security-oauth ---
08-Jun-2019 00:00:28 [INFO]
08-Jun-2019 00:00:28 [INFO] --- maven-resources-plugin:2.6:resources (default-resources) @ spring-security-oauth ---
08-Jun-2019 00:00:28 [INFO] Using 'UTF-8' encoding to copy filtered resources.
08-Jun-2019 00:00:28 [INFO] Copying 3 resources
08-Jun-2019 00:00:28 [INFO]
08-Jun-2019 00:00:28 [INFO] --- maven-compiler-plugin:2.3.2:compile (default-compile) @ spring-security-oauth ---
08-Jun-2019 00:00:28 [INFO] Compiling 108 source files to /opt/bamboo-home/xml-data/build-dir/SECOAUTH-NIGHTLY-JOB1/spring-security-oauth/target/classes
08-Jun-2019 00:00:29 [WARNING] /opt/bamboo-home/xml-data/build-dir/SECOAUTH-NIGHTLY-JOB1/spring-security-oauth/src/main/java/org/springframework/security/oauth/consumer/net/OAuthOverHttpsURLStreamHandler.java:[36,78] Handler is internal proprietary API and may be removed in a future release
08-Jun-2019 00:00:29 [WARNING] /opt/bamboo-home/xml-data/build-dir/SECOAUTH-NIGHTLY-JOB1/spring-security-oauth/src/main/java/org/springframework/security/oauth/consumer/net/OAuthOverHttpURLStreamHandler.java:[36,76] Handler is internal proprietary API and may be removed in a future release
08-Jun-2019 00:00:29 [INFO]
08-Jun-2019 00:00:29 [INFO] --- maven-resources-plugin:2.6:testResources (default-testResources) @ spring-security-oauth ---
08-Jun-2019 00:00:29 [INFO] Using 'UTF-8' encoding to copy filtered resources.
08-Jun-2019 00:00:29 [INFO] Copying 8 resources
08-Jun-2019 00:00:29 [INFO]
08-Jun-2019 00:00:29 [INFO] --- maven-compiler-plugin:2.3.2:testCompile (default-testCompile) @ spring-security-oauth ---
08-Jun-2019 00:00:29 [INFO] Compiling 22 source files to /opt/bamboo-home/xml-data/build-dir/SECOAUTH-NIGHTLY-JOB1/spring-security-oauth/target/test-classes
08-Jun-2019 00:00:30 [WARNING] /opt/bamboo-home/xml-data/build-dir/SECOAUTH-NIGHTLY-JOB1/spring-security-oauth/src/test/java/org/springframework/security/oauth/consumer/client/CoreOAuthConsumerSupportTests.java:[65,32] Handler is internal proprietary API and may be removed in a future release
08-Jun-2019 00:00:30 [WARNING] /opt/bamboo-home/xml-data/build-dir/SECOAUTH-NIGHTLY-JOB1/spring-security-oauth/src/test/java/org/springframework/security/oauth/consumer/client/CoreOAuthConsumerSupportTests.java:[483,54] Handler is internal proprietary API and may be removed in a future release
08-Jun-2019 00:00:30 [INFO]
08-Jun-2019 00:00:30 [INFO] --- maven-surefire-plugin:2.12.4:test (default-test) @ spring-security-oauth ---
08-Jun-2019 00:00:30 [INFO] Surefire report directory: /opt/bamboo-home/xml-data/build-dir/SECOAUTH-NIGHTLY-JOB1/spring-security-oauth/target/surefire-reports
08-Jun-2019 00:00:30
08-Jun-2019 00:00:30 -------------------------------------------------------
08-Jun-2019 00:00:30 T E S T S
08-Jun-2019 00:00:30 -------------------------------------------------------
08-Jun-2019 00:00:31 Running org.springframework.security.oauth.config.FilterChainInitializationTests
08-Jun-2019 00:00:32 Tests run: 1, Failures: 0, Errors: 0, Skipped: 0, Time elapsed: 0.963 sec
08-Jun-2019 00:00:32 Running org.springframework.security.oauth.config.AuthorizationServerBeanDefinitionParserTests
08-Jun-2019 00:00:32 Tests run: 2, Failures: 0, Errors: 0, Skipped: 0, Time elapsed: 0.332 sec
08-Jun-2019 00:00:32 Running org.springframework.security.oauth.config.ConsumerServiceBeanDefinitionParserTests
08-Jun-2019 00:00:32 Tests run: 2, Failures: 0, Errors: 0, Skipped: 0, Time elapsed: 0.249 sec
08-Jun-2019 00:00:32 Running org.springframework.security.oauth.provider.nonce.InMemoryNonceServicesTests
08-Jun-2019 00:00:32 Tests run: 5, Failures: 0, Errors: 0, Skipped: 0, Time elapsed: 0.004 sec
08-Jun-2019 00:00:32 Running org.springframework.security.oauth.provider.filter.ProtectedResourceProcessingFilterTests
08-Jun-2019 00:00:32 Tests run: 1, Failures: 0, Errors: 0, Skipped: 0, Time elapsed: 0.14 sec
08-Jun-2019 00:00:32 Running org.springframework.security.oauth.provider.filter.OAuthProcessingFilterTests
08-Jun-2019 00:00:32 Tests run: 3, Failures: 0, Errors: 0, Skipped: 0, Time elapsed: 0.043 sec
08-Jun-2019 00:00:32 Running org.springframework.security.oauth.provider.filter.OAuthUserAuthorizationProcessingFilterTests
08-Jun-2019 00:00:32 Tests run: 1, Failures: 0, Errors: 0, Skipped: 0, Time elapsed: 0.004 sec
08-Jun-2019 00:00:32 Running org.springframework.security.oauth.provider.filter.UserAuthorizationSuccessfulAuthenticationHandlerTests
08-Jun-2019 00:00:32 Tests run: 1, Failures: 0, Errors: 0, Skipped: 0, Time elapsed: 0.006 sec
08-Jun-2019 00:00:32 Running org.springframework.security.oauth.provider.filter.AccessTokenProcessingFilterTests
08-Jun-2019 00:00:32 Tests run: 2, Failures: 0, Errors: 0, Skipped: 0, Time elapsed: 0.001 sec
08-Jun-2019 00:00:32 Running org.springframework.security.oauth.provider.filter.UnauthenticatedRequestTokenProcessingFilterTests
08-Jun-2019 00:00:32 Tests run: 2, Failures: 0, Errors: 0, Skipped: 0, Time elapsed: 0.005 sec
08-Jun-2019 00:00:32 Running org.springframework.security.oauth.provider.CoreOAuthProviderSupportTests
08-Jun-2019 00:00:32 Tests run: 2, Failures: 0, Errors: 0, Skipped: 0, Time elapsed: 0.003 sec
08-Jun-2019 00:00:32 Running org.springframework.security.oauth.common.signature.PlainTextSignatureMethodTests
08-Jun-2019 00:00:32 Tests run: 1, Failures: 0, Errors: 0, Skipped: 0, Time elapsed: 0 sec
08-Jun-2019 00:00:32 Running org.springframework.security.oauth.common.signature.CoreOAuthSignatureMethodFactoryTests
08-Jun-2019 00:00:33 Tests run: 1, Failures: 0, Errors: 0, Skipped: 0, Time elapsed: 0.215 sec
08-Jun-2019 00:00:33 Running org.springframework.security.oauth.common.signature.RSA_SHA1SignatureMethodTests
08-Jun-2019 00:00:33 Tests run: 2, Failures: 0, Errors: 0, Skipped: 0, Time elapsed: 0.051 sec
08-Jun-2019 00:00:33 Running org.springframework.security.oauth.common.signature.HMAC_SHA1SignatureMethodTests
08-Jun-2019 00:00:33 Tests run: 3, Failures: 0, Errors: 0, Skipped: 0, Time elapsed: 0.028 sec
08-Jun-2019 00:00:33 Running org.springframework.security.oauth.common.OAuthCodecTests
08-Jun-2019 00:00:33 Tests run: 1, Failures: 0, Errors: 0, Skipped: 0, Time elapsed: 0.001 sec
08-Jun-2019 00:00:33 Running org.springframework.security.oauth.consumer.client.CoreOAuthConsumerSupportTests
08-Jun-2019 00:00:33 Tests run: 10, Failures: 0, Errors: 0, Skipped: 0, Time elapsed: 0.021 sec
08-Jun-2019 00:00:33 Running org.springframework.security.oauth.consumer.client.OAuthRestTemplateTests
08-Jun-2019 00:00:33 Tests run: 2, Failures: 0, Errors: 0, Skipped: 0, Time elapsed: 0.101 sec
08-Jun-2019 00:00:33 Running org.springframework.security.oauth.consumer.GoogleOAuthTests
08-Jun-2019 00:00:33 Tests run: 1, Failures: 0, Errors: 0, Skipped: 0, Time elapsed: 0.002 sec
08-Jun-2019 00:00:33 Running org.springframework.security.oauth.consumer.filter.OAuthConsumerContextFilterTests
08-Jun-2019 00:00:33 Tests run: 2, Failures: 0, Errors: 0, Skipped: 0, Time elapsed: 0.022 sec
08-Jun-2019 00:00:33 Running org.springframework.security.oauth.consumer.rememberme.HttpSessionOAuthRememberMeServicesTests
08-Jun-2019 00:00:33 Tests run: 4, Failures: 0, Errors: 0, Skipped: 0, Time elapsed: 0.01 sec
08-Jun-2019 00:00:33 Running net.oauth.signature.GoogleCodeCompatibilityTests
08-Jun-2019 00:00:33 Tests run: 2, Failures: 0, Errors: 0, Skipped: 0, Time elapsed: 0.014 sec
08-Jun-2019 00:00:33
08-Jun-2019 00:00:33 Results :
08-Jun-2019 00:00:33
08-Jun-2019 00:00:33 Tests run: 51, Failures: 0, Errors: 0, Skipped: 0
08-Jun-2019 00:00:33
08-Jun-2019 00:00:33 [INFO]
08-Jun-2019 00:00:33 [INFO] --- maven-jar-plugin:2.4:jar (default-jar) @ spring-security-oauth ---
08-Jun-2019 00:00:33 [INFO] Building jar: /opt/bamboo-home/xml-data/build-dir/SECOAUTH-NIGHTLY-JOB1/spring-security-oauth/target/spring-security-oauth-2.3.7.BUILD-SNAPSHOT.jar
08-Jun-2019 00:00:33 [INFO]
08-Jun-2019 00:00:33 [INFO] >>> maven-source-plugin:2.1.2:jar (attach-sources) > generate-sources @ spring-security-oauth >>>
08-Jun-2019 00:00:33 [INFO]
08-Jun-2019 00:00:33 [INFO] <<< maven-source-plugin:2.1.2:jar (attach-sources) < generate-sources @ spring-security-oauth <<<
08-Jun-2019 00:00:33 [INFO]
08-Jun-2019 00:00:33 [INFO] --- maven-source-plugin:2.1.2:jar (attach-sources) @ spring-security-oauth ---
08-Jun-2019 00:00:33 [INFO] org already added, skipping
08-Jun-2019 00:00:33 [INFO] org/springframework already added, skipping
08-Jun-2019 00:00:33 [INFO] org/springframework/security already added, skipping
08-Jun-2019 00:00:33 [INFO] org/springframework/security/oauth already added, skipping
08-Jun-2019 00:00:33 [INFO] Building jar: /opt/bamboo-home/xml-data/build-dir/SECOAUTH-NIGHTLY-JOB1/spring-security-oauth/target/spring-security-oauth-2.3.7.BUILD-SNAPSHOT-sources.jar
08-Jun-2019 00:00:34 [INFO] org already added, skipping
08-Jun-2019 00:00:34 [INFO] org/springframework already added, skipping
08-Jun-2019 00:00:34 [INFO] org/springframework/security already added, skipping
08-Jun-2019 00:00:34 [INFO] org/springframework/security/oauth already added, skipping
08-Jun-2019 00:00:34 [INFO]
08-Jun-2019 00:00:34 [INFO] --- maven-javadoc-plugin:2.9.1:jar (javadoc) @ spring-security-oauth ---
08-Jun-2019 00:00:36 [INFO]
08-Jun-2019 00:00:36 2 warnings
08-Jun-2019 00:00:36 [WARNING] Javadoc Warnings
08-Jun-2019 00:00:36 [WARNING] /opt/bamboo-home/xml-data/build-dir/SECOAUTH-NIGHTLY-JOB1/spring-security-oauth/src/main/java/org/springframework/security/oauth/consumer/net/OAuthOverHttpURLStreamHandler.java:36: warning: Handler is internal proprietary API and may be removed in a future release
08-Jun-2019 00:00:36 [WARNING] public class OAuthOverHttpURLStreamHandler extends sun.net.www.protocol.http.Handler {
08-Jun-2019 00:00:36 [WARNING] ^
08-Jun-2019 00:00:36 [WARNING] /opt/bamboo-home/xml-data/build-dir/SECOAUTH-NIGHTLY-JOB1/spring-security-oauth/src/main/java/org/springframework/security/oauth/consumer/net/OAuthOverHttpsURLStreamHandler.java:36: warning: Handler is internal proprietary API and may be removed in a future release
08-Jun-2019 00:00:36 [WARNING] public class OAuthOverHttpsURLStreamHandler extends sun.net.www.protocol.https.Handler {
08-Jun-2019 00:00:36 [WARNING] ^
08-Jun-2019 00:00:36 [INFO] Building jar: /opt/bamboo-home/xml-data/build-dir/SECOAUTH-NIGHTLY-JOB1/spring-security-oauth/target/spring-security-oauth-2.3.7.BUILD-SNAPSHOT-javadoc.jar
08-Jun-2019 00:00:37 [INFO]
08-Jun-2019 00:00:37 [INFO] --- maven-install-plugin:2.4:install (default-install) @ spring-security-oauth ---
08-Jun-2019 00:00:37 [INFO] Installing /opt/bamboo-home/xml-data/build-dir/SECOAUTH-NIGHTLY-JOB1/spring-security-oauth/target/spring-security-oauth-2.3.7.BUILD-SNAPSHOT.jar to /home/bamboo/.m2/repository/org/springframework/security/oauth/spring-security-oauth/2.3.7.BUILD-SNAPSHOT/spring-security-oauth-2.3.7.BUILD-SNAPSHOT.jar
08-Jun-2019 00:00:37 [INFO] Installing /opt/bamboo-home/xml-data/build-dir/SECOAUTH-NIGHTLY-JOB1/spring-security-oauth/pom.xml to /home/bamboo/.m2/repository/org/springframework/security/oauth/spring-security-oauth/2.3.7.BUILD-SNAPSHOT/spring-security-oauth-2.3.7.BUILD-SNAPSHOT.pom
08-Jun-2019 00:00:37 [INFO] Installing /opt/bamboo-home/xml-data/build-dir/SECOAUTH-NIGHTLY-JOB1/spring-security-oauth/target/spring-security-oauth-2.3.7.BUILD-SNAPSHOT-sources.jar to /home/bamboo/.m2/repository/org/springframework/security/oauth/spring-security-oauth/2.3.7.BUILD-SNAPSHOT/spring-security-oauth-2.3.7.BUILD-SNAPSHOT-sources.jar
08-Jun-2019 00:00:37 [INFO] Installing /opt/bamboo-home/xml-data/build-dir/SECOAUTH-NIGHTLY-JOB1/spring-security-oauth/target/spring-security-oauth-2.3.7.BUILD-SNAPSHOT-javadoc.jar to /home/bamboo/.m2/repository/org/springframework/security/oauth/spring-security-oauth/2.3.7.BUILD-SNAPSHOT/spring-security-oauth-2.3.7.BUILD-SNAPSHOT-javadoc.jar
08-Jun-2019 00:00:37 [INFO]                                                                         
08-Jun-2019 00:00:37 [INFO] ------------------------------------------------------------------------
08-Jun-2019 00:00:37 [INFO] Building OAuth2 for Spring Security 2.3.7.BUILD-SNAPSHOT
08-Jun-2019 00:00:37 [INFO] ------------------------------------------------------------------------
08-Jun-2019 00:00:37 [INFO]
08-Jun-2019 00:00:37 [INFO] --- maven-clean-plugin:2.5:clean (default-clean) @ spring-security-oauth2 ---
08-Jun-2019 00:00:37 [INFO]
08-Jun-2019 00:00:37 [INFO] --- maven-resources-plugin:2.6:resources (default-resources) @ spring-security-oauth2 ---
08-Jun-2019 00:00:37 [INFO] Using 'UTF-8' encoding to copy filtered resources.
08-Jun-2019 00:00:37 [INFO] Copying 4 resources
08-Jun-2019 00:00:37 [INFO]
08-Jun-2019 00:00:37 [INFO] --- maven-compiler-plugin:2.3.2:compile (default-compile) @ spring-security-oauth2 ---
08-Jun-2019 00:00:37 [INFO] Compiling 249 source files to /opt/bamboo-home/xml-data/build-dir/SECOAUTH-NIGHTLY-JOB1/spring-security-oauth2/target/classes
08-Jun-2019 00:00:39 [INFO]
08-Jun-2019 00:00:39 [INFO] --- maven-resources-plugin:2.6:testResources (default-testResources) @ spring-security-oauth2 ---
08-Jun-2019 00:00:39 [INFO] Using 'UTF-8' encoding to copy filtered resources.
08-Jun-2019 00:00:39 [INFO] Copying 21 resources
08-Jun-2019 00:00:39 [INFO]
08-Jun-2019 00:00:39 [INFO] --- maven-compiler-plugin:2.3.2:testCompile (default-testCompile) @ spring-security-oauth2 ---
08-Jun-2019 00:00:39 [INFO] Compiling 120 source files to /opt/bamboo-home/xml-data/build-dir/SECOAUTH-NIGHTLY-JOB1/spring-security-oauth2/target/test-classes
08-Jun-2019 00:00:42 [INFO]
08-Jun-2019 00:00:42 [INFO] --- maven-surefire-plugin:2.12.4:test (default-test) @ spring-security-oauth2 ---
08-Jun-2019 00:00:42 [INFO] Surefire report directory: /opt/bamboo-home/xml-data/build-dir/SECOAUTH-NIGHTLY-JOB1/spring-security-oauth2/target/surefire-reports
08-Jun-2019 00:00:42
08-Jun-2019 00:00:42 -------------------------------------------------------
08-Jun-2019 00:00:42 T E S T S
08-Jun-2019 00:00:42 -------------------------------------------------------
08-Jun-2019 00:00:42 Running org.springframework.security.oauth2.config.annotation.TokenServicesMultipleBeansTests
08-Jun-2019 00:00:44 Tests run: 1, Failures: 0, Errors: 0, Skipped: 0, Time elapsed: 1.433 sec
08-Jun-2019 00:00:44 Running org.springframework.security.oauth2.config.annotation.Gh501EnableAuthorizationServerTests
08-Jun-2019 00:00:44 Tests run: 1, Failures: 0, Errors: 0, Skipped: 0, Time elapsed: 0.695 sec
08-Jun-2019 00:00:44 Running org.springframework.security.oauth2.config.annotation.ClientConfigurationTests
08-Jun-2019 00:00:45 Tests run: 1, Failures: 0, Errors: 0, Skipped: 0, Time elapsed: 0.238 sec
08-Jun-2019 00:00:45 Running org.springframework.security.oauth2.config.annotation.ResourceServerConfigurationTests
08-Jun-2019 00:00:45 [WARN] TokenEndpoint - Handling error: InvalidRequestException, Missing grant type
08-Jun-2019 00:00:45 [WARN] PageNotFound - No mapping found for HTTP request with URI [/] in DispatcherServlet with name ''
08-Jun-2019 00:00:46 [WARN] PageNotFound - No mapping found for HTTP request with URI [/] in DispatcherServlet with name ''
08-Jun-2019 00:00:46 [WARN] PageNotFound - No mapping found for HTTP request with URI [/] in DispatcherServlet with name ''
08-Jun-2019 00:00:46 [WARN] PageNotFound - No mapping found for HTTP request with URI [/] in DispatcherServlet with name ''
08-Jun-2019 00:00:46 [WARN] TokenEndpoint - Handling error: InvalidRequestException, Missing grant type
08-Jun-2019 00:00:46 Tests run: 9, Failures: 0, Errors: 0, Skipped: 0, Time elapsed: 1.605 sec
08-Jun-2019 00:00:46 Running org.springframework.security.oauth2.config.annotation.AuthorizationServerConfigurationTests
08-Jun-2019 00:00:46 [WARN] AnnotationConfigWebApplicationContext - Exception encountered during context initialization - cancelling refresh attempt: org.springframework.beans.factory.UnsatisfiedDependencyException: Error creating bean with name 'org.springframework.security.config.annotation.web.configuration.WebSecurityConfiguration': Unsatisfied dependency expressed through method 'setFilterChainProxySecurityConfigurer' parameter 1; nested exception is org.springframework.beans.factory.BeanExpressionException: Expression parsing failed; nested exception is org.springframework.beans.factory.UnsatisfiedDependencyException: Error creating bean with name 'org.springframework.security.oauth2.config.annotation.web.configuration.AuthorizationServerSecurityConfiguration': Unsatisfied dependency expressed through field 'configurers'; nested exception is org.springframework.beans.factory.NoSuchBeanDefinitionException: No qualifying bean of type 'java.util.List<org.springframework.security.oauth2.config.annotation.web.configuration.AuthorizationServerConfigurer>' available: expected at least 1 bean which qualifies as autowire candidate. Dependency annotations: {@org.springframework.beans.factory.annotation.Autowired(required=true)}
08-Jun-2019 00:00:47 [WARN] JwtAccessTokenConverter - Unable to create an RSA verifier from verifierKey (ignoreable if using MAC)
08-Jun-2019 00:00:48 [WARN] AnnotationConfigWebApplicationContext - Exception encountered during context initialization - cancelling refresh attempt: org.springframework.beans.factory.UnsatisfiedDependencyException: Error creating bean with name 'authorizationServerConfigurationTests.AuthorizationServerTypes': Unsatisfied dependency expressed through field 'tokenServices'; nested exception is org.springframework.beans.factory.BeanCreationException: Error creating bean with name 'org.springframework.security.oauth2.config.annotation.web.configuration.AuthorizationServerEndpointsConfiguration': Invocation of init method failed; nested exception is java.lang.AssertionError
08-Jun-2019 00:00:48 Tests run: 20, Failures: 0, Errors: 0, Skipped: 0, Time elapsed: 2.21 sec
08-Jun-2019 00:00:48 Running org.springframework.security.oauth2.config.annotation.Gh808EnableAuthorizationServerTests
08-Jun-2019 00:00:49 Tests run: 2, Failures: 0, Errors: 0, Skipped: 0, Time elapsed: 0.145 sec
08-Jun-2019 00:00:49 Running org.springframework.security.oauth2.config.xml.ResourceServerBeanDefinitionParserTests
08-Jun-2019 00:00:49 Tests run: 2, Failures: 0, Errors: 0, Skipped: 0, Time elapsed: 0.19 sec
08-Jun-2019 00:00:49 Running org.springframework.security.oauth2.config.xml.AuthorizationServerInvalidParserTests
08-Jun-2019 00:00:49 Tests run: 1, Failures: 0, Errors: 0, Skipped: 0, Time elapsed: 0.029 sec
08-Jun-2019 00:00:49 Running org.springframework.security.oauth2.config.xml.AuthorizationServerBeanDefinitionParserTests
08-Jun-2019 00:00:49 Tests run: 12, Failures: 0, Errors: 0, Skipped: 0, Time elapsed: 0.475 sec
08-Jun-2019 00:00:49 Running org.springframework.security.oauth2.config.xml.ClientDetailsServiceBeanDefinitionParserTests
08-Jun-2019 00:00:49 Tests run: 3, Failures: 0, Errors: 0, Skipped: 0, Time elapsed: 0.035 sec
08-Jun-2019 00:00:49 Running org.springframework.security.oauth2.config.xml.ResourceBeanDefinitionParserTests
08-Jun-2019 00:00:49 Tests run: 7, Failures: 0, Errors: 0, Skipped: 0, Time elapsed: 0.063 sec
08-Jun-2019 00:00:49 Running org.springframework.security.oauth2.config.xml.InvalidResourceBeanDefinitionParserTests
08-Jun-2019 00:00:49 Tests run: 5, Failures: 0, Errors: 0, Skipped: 0, Time elapsed: 0.054 sec
08-Jun-2019 00:00:49 Running org.springframework.security.oauth2.config.xml.AuthorizationServerCustomGrantParserTests
08-Jun-2019 00:00:49 Tests run: 1, Failures: 0, Errors: 0, Skipped: 0, Time elapsed: 0.021 sec
08-Jun-2019 00:00:49 Running org.springframework.security.oauth2.config.xml.AuthorizationServerClientCredentialsPasswordInvalidXmlTests
08-Jun-2019 00:00:50 Tests run: 2, Failures: 0, Errors: 0, Skipped: 0, Time elapsed: 0.321 sec
08-Jun-2019 00:00:50 Running org.springframework.security.oauth2.config.xml.AuthorizationServerClientCredentialsPasswordValidXmlTests
08-Jun-2019 00:00:50 Tests run: 2, Failures: 0, Errors: 0, Skipped: 0, Time elapsed: 0.217 sec
08-Jun-2019 00:00:50 Running org.springframework.security.oauth2.http.converter.jaxb.JaxbOAuth2ExceptionMessageConverterTests
08-Jun-2019 00:00:51 Tests run: 22, Failures: 0, Errors: 0, Skipped: 0, Time elapsed: 1.442 sec
08-Jun-2019 00:00:51 Running org.springframework.security.oauth2.http.converter.jaxb.JaxbOAuth2AccessTokenMessageConverterTests
08-Jun-2019 00:00:52 Tests run: 8, Failures: 0, Errors: 0, Skipped: 0, Time elapsed: 0.837 sec
08-Jun-2019 00:00:52 Running org.springframework.security.oauth2.client.http.OAuth2ErrorHandlerTests
08-Jun-2019 00:00:52 Tests run: 12, Failures: 0, Errors: 0, Skipped: 0, Time elapsed: 0.056 sec
08-Jun-2019 00:00:52 Running org.springframework.security.oauth2.client.DefaultOAuth2RequestAuthenticatorTests
08-Jun-2019 00:00:52 Tests run: 6, Failures: 0, Errors: 0, Skipped: 0, Time elapsed: 0.002 sec
08-Jun-2019 00:00:52 Running org.springframework.security.oauth2.client.token.grant.password.ResourceOwnerPasswordAccessTokenProviderTests
08-Jun-2019 00:00:52 Tests run: 3, Failures: 0, Errors: 0, Skipped: 0, Time elapsed: 0 sec
08-Jun-2019 00:00:52 Running org.springframework.security.oauth2.client.token.grant.implicit.ImplicitAccessTokenProviderTests
08-Jun-2019 00:00:52 Tests run: 2, Failures: 0, Errors: 0, Skipped: 0, Time elapsed: 0.001 sec
08-Jun-2019 00:00:52 Running org.springframework.security.oauth2.client.token.grant.code.AuthorizationCodeAccessTokenProviderWithConversionTests
08-Jun-2019 00:00:52 Tests run: 4, Failures: 0, Errors: 0, Skipped: 0, Time elapsed: 0.121 sec
08-Jun-2019 00:00:52 Running org.springframework.security.oauth2.client.token.grant.code.AuthorizationCodeAccessTokenProviderTests
08-Jun-2019 00:00:52 Tests run: 5, Failures: 0, Errors: 0, Skipped: 0, Time elapsed: 0.001 sec
08-Jun-2019 00:00:52 Running org.springframework.security.oauth2.client.token.grant.code.AuthorizationCodeResourceDetailsTests
08-Jun-2019 00:00:52 Tests run: 2, Failures: 0, Errors: 0, Skipped: 0, Time elapsed: 0 sec
08-Jun-2019 00:00:53 Running org.springframework.security.oauth2.client.token.JdbcClientTokenServicesTests
08-Jun-2019 00:00:53 Tests run: 3, Failures: 0, Errors: 0, Skipped: 0, Time elapsed: 0.313 sec
08-Jun-2019 00:00:53 Running org.springframework.security.oauth2.client.token.OAuth2AccessTokenSupportTests
08-Jun-2019 00:00:53 Tests run: 5, Failures: 0, Errors: 0, Skipped: 0, Time elapsed: 0.025 sec
08-Jun-2019 00:00:53 Running org.springframework.security.oauth2.client.token.AccessTokenProviderChainTests
08-Jun-2019 00:00:53 Tests run: 15, Failures: 0, Errors: 0, Skipped: 0, Time elapsed: 0.027 sec
08-Jun-2019 00:00:53 Running org.springframework.security.oauth2.client.filter.OAuth2ClientContextFilterTests
08-Jun-2019 00:00:53 Tests run: 11, Failures: 0, Errors: 0, Skipped: 0, Time elapsed: 0.007 sec
08-Jun-2019 00:00:53 Running org.springframework.security.oauth2.client.filter.OAuth2ClientAuthenticationProcessingFilterTests
08-Jun-2019 00:00:53 Tests run: 5, Failures: 0, Errors: 0, Skipped: 0, Time elapsed: 0.017 sec
08-Jun-2019 00:00:53 Running org.springframework.security.oauth2.client.OAuth2RestTemplateTests
08-Jun-2019 00:00:53 Tests run: 12, Failures: 0, Errors: 0, Skipped: 0, Time elapsed: 0.199 sec
08-Jun-2019 00:00:53 Running org.springframework.security.oauth2.provider.request.DefaultAuthorizationRequestFactoryTests
08-Jun-2019 00:00:53 Tests run: 9, Failures: 0, Errors: 0, Skipped: 0, Time elapsed: 0.003 sec
08-Jun-2019 00:00:53 Running org.springframework.security.oauth2.provider.request.DefaultOAuth2RequestValidatorTests
08-Jun-2019 00:00:53 Tests run: 3, Failures: 0, Errors: 0, Skipped: 0, Time elapsed: 0.001 sec
08-Jun-2019 00:00:53 Running org.springframework.security.oauth2.provider.password.ResourceOwnerPasswordTokenGranterTests
08-Jun-2019 00:00:53 Tests run: 7, Failures: 0, Errors: 0, Skipped: 0, Time elapsed: 0.004 sec
08-Jun-2019 00:00:53 Running org.springframework.security.oauth2.provider.client.BaseClientDetailsTests
08-Jun-2019 00:00:53 Tests run: 11, Failures: 0, Errors: 0, Skipped: 0, Time elapsed: 0.045 sec
08-Jun-2019 00:00:53 Running org.springframework.security.oauth2.provider.client.JdbcClientDetailsServiceTests
08-Jun-2019 00:00:53 Tests run: 14, Failures: 0, Errors: 0, Skipped: 0, Time elapsed: 0.284 sec
08-Jun-2019 00:00:53 Running org.springframework.security.oauth2.provider.client.ClientCredentialsTokenEndpointFilterTests
08-Jun-2019 00:00:53 Tests run: 3, Failures: 0, Errors: 0, Skipped: 0, Time elapsed: 0.02 sec
08-Jun-2019 00:00:53 Running org.springframework.security.oauth2.provider.client.ClientDetailsUserDetailsServiceTests
08-Jun-2019 00:00:53 Tests run: 2, Failures: 0, Errors: 0, Skipped: 0, Time elapsed: 0.005 sec
08-Jun-2019 00:00:53 Running org.springframework.security.oauth2.provider.approval.ApprovalStoreUserApprovalHandlerTests
08-Jun-2019 00:00:53 Tests run: 10, Failures: 0, Errors: 0, Skipped: 0, Time elapsed: 0.004 sec
08-Jun-2019 00:00:53 Running org.springframework.security.oauth2.provider.approval.DefaultUserApprovalHandlerTests
08-Jun-2019 00:00:53 Tests run: 1, Failures: 0, Errors: 0, Skipped: 0, Time elapsed: 0 sec
08-Jun-2019 00:00:53 Running org.springframework.security.oauth2.provider.approval.TokenStoreUserApprovalHandlerTests
08-Jun-2019 00:00:53 Tests run: 3, Failures: 0, Errors: 0, Skipped: 0, Time elapsed: 0.002 sec
08-Jun-2019 00:00:53 Running org.springframework.security.oauth2.provider.approval.JdbcApprovalStoreTests
08-Jun-2019 00:00:54 Tests run: 6, Failures: 0, Errors: 0, Skipped: 0, Time elapsed: 0.072 sec
08-Jun-2019 00:00:54 Running org.springframework.security.oauth2.provider.approval.InMemoryApprovalStoreTests
08-Jun-2019 00:00:54 Tests run: 5, Failures: 0, Errors: 0, Skipped: 0, Time elapsed: 0.001 sec
08-Jun-2019 00:00:54 Running org.springframework.security.oauth2.provider.approval.TokenApprovalStoreTests
08-Jun-2019 00:00:54 Tests run: 5, Failures: 0, Errors: 0, Skipped: 0, Time elapsed: 0.003 sec
08-Jun-2019 00:00:54 Running org.springframework.security.oauth2.provider.vote.ClientScopeVoterTests
08-Jun-2019 00:00:54 Tests run: 3, Failures: 0, Errors: 0, Skipped: 0, Time elapsed: 0.001 sec
08-Jun-2019 00:00:54 Running org.springframework.security.oauth2.provider.vote.ScopeVoterTests
08-Jun-2019 00:00:54 Tests run: 6, Failures: 0, Errors: 0, Skipped: 0, Time elapsed: 0.003 sec
08-Jun-2019 00:00:54 Running org.springframework.security.oauth2.provider.test.OAuth2RequestTests
08-Jun-2019 00:00:54 Tests run: 4, Failures: 0, Errors: 0, Skipped: 0, Time elapsed: 0.001 sec
08-Jun-2019 00:00:54 Running org.springframework.security.oauth2.provider.token.DefaultTokenServicesWithJdbcTests
08-Jun-2019 00:00:54 Tests run: 19, Failures: 0, Errors: 0, Skipped: 0, Time elapsed: 0.383 sec
08-Jun-2019 00:00:54 Running org.springframework.security.oauth2.provider.token.store.JwtAccessTokenConverterTests
08-Jun-2019 00:00:54 [WARN] JwtAccessTokenConverter - Unable to create an RSA verifier from verifierKey (ignoreable if using MAC)
08-Jun-2019 00:00:54 [WARN] JwtAccessTokenConverter - Unable to create an RSA verifier from verifierKey (ignoreable if using MAC)
08-Jun-2019 00:00:54 [WARN] JwtAccessTokenConverter - Unable to create an RSA verifier from verifierKey (ignoreable if using MAC)
08-Jun-2019 00:00:54 Tests run: 14, Failures: 0, Errors: 0, Skipped: 0, Time elapsed: 0.177 sec
08-Jun-2019 00:00:54 Running org.springframework.security.oauth2.provider.token.store.InMemoryTokenStoreTests
08-Jun-2019 00:00:54 Tests run: 16, Failures: 0, Errors: 0, Skipped: 0, Time elapsed: 0.012 sec
08-Jun-2019 00:00:54 Running org.springframework.security.oauth2.provider.token.store.JwtTokenStoreTests
08-Jun-2019 00:00:54 [WARN] JwtAccessTokenConverter - Unable to create an RSA verifier from verifierKey (ignoreable if using MAC)
08-Jun-2019 00:00:54 [WARN] JwtAccessTokenConverter - Unable to create an RSA verifier from verifierKey (ignoreable if using MAC)
08-Jun-2019 00:00:54 [WARN] JwtAccessTokenConverter - Unable to create an RSA verifier from verifierKey (ignoreable if using MAC)
08-Jun-2019 00:00:54 [WARN] JwtAccessTokenConverter - Unable to create an RSA verifier from verifierKey (ignoreable if using MAC)
08-Jun-2019 00:00:54 [WARN] JwtAccessTokenConverter - Unable to create an RSA verifier from verifierKey (ignoreable if using MAC)
08-Jun-2019 00:00:54 [WARN] JwtAccessTokenConverter - Unable to create an RSA verifier from verifierKey (ignoreable if using MAC)
08-Jun-2019 00:00:54 [WARN] JwtAccessTokenConverter - Unable to create an RSA verifier from verifierKey (ignoreable if using MAC)
08-Jun-2019 00:00:54 [WARN] JwtAccessTokenConverter - Unable to create an RSA verifier from verifierKey (ignoreable if using MAC)
08-Jun-2019 00:00:54 [WARN] JwtAccessTokenConverter - Unable to create an RSA verifier from verifierKey (ignoreable if using MAC)
08-Jun-2019 00:00:54 [WARN] JwtAccessTokenConverter - Unable to create an RSA verifier from verifierKey (ignoreable if using MAC)
08-Jun-2019 00:00:54 [WARN] JwtAccessTokenConverter - Unable to create an RSA verifier from verifierKey (ignoreable if using MAC)
08-Jun-2019 00:00:54 [WARN] JwtAccessTokenConverter - Unable to create an RSA verifier from verifierKey (ignoreable if using MAC)
08-Jun-2019 00:00:54 [WARN] JwtAccessTokenConverter - Unable to create an RSA verifier from verifierKey (ignoreable if using MAC)
08-Jun-2019 00:00:54 [WARN] JwtAccessTokenConverter - Unable to create an RSA verifier from verifierKey (ignoreable if using MAC)
08-Jun-2019 00:00:54 [WARN] JwtAccessTokenConverter - Unable to create an RSA verifier from verifierKey (ignoreable if using MAC)
08-Jun-2019 00:00:54 [WARN] JwtAccessTokenConverter - Unable to create an RSA verifier from verifierKey (ignoreable if using MAC)
08-Jun-2019 00:00:54 [WARN] JwtAccessTokenConverter - Unable to create an RSA verifier from verifierKey (ignoreable if using MAC)
08-Jun-2019 00:00:54 [WARN] JwtAccessTokenConverter - Unable to create an RSA verifier from verifierKey (ignoreable if using MAC)
08-Jun-2019 00:00:54 Tests run: 18, Failures: 0, Errors: 0, Skipped: 0, Time elapsed: 0.038 sec
08-Jun-2019 00:00:54 Running org.springframework.security.oauth2.provider.token.store.redis.RedisTokenStorePrefixTests
08-Jun-2019 00:00:57 Tests run: 15, Failures: 0, Errors: 0, Skipped: 0, Time elapsed: 3.125 sec
08-Jun-2019 00:00:57 Running org.springframework.security.oauth2.provider.token.store.redis.RedisTokenStoreMockTests
08-Jun-2019 00:00:57 Tests run: 2, Failures: 0, Errors: 0, Skipped: 0, Time elapsed: 0.069 sec
08-Jun-2019 00:00:57 Running org.springframework.security.oauth2.provider.token.store.redis.RedisTokenStoreTests
08-Jun-2019 00:01:00 Tests run: 16, Failures: 0, Errors: 0, Skipped: 0, Time elapsed: 3.059 sec
08-Jun-2019 00:01:00 Running org.springframework.security.oauth2.provider.token.store.JdbcTokenStoreTests
08-Jun-2019 00:01:01 Tests run: 14, Failures: 0, Errors: 0, Skipped: 0, Time elapsed: 0.162 sec
08-Jun-2019 00:01:01 Running org.springframework.security.oauth2.provider.token.DefaultTokenServicesAuthoritiesChangeTests
08-Jun-2019 00:01:01 Tests run: 1, Failures: 0, Errors: 0, Skipped: 0, Time elapsed: 0.001 sec
08-Jun-2019 00:01:01 Running org.springframework.security.oauth2.provider.token.DefaultUserAuthenticationConverterTests
08-Jun-2019 00:01:01 Tests run: 3, Failures: 0, Errors: 0, Skipped: 0, Time elapsed: 0.003 sec
08-Jun-2019 00:01:01 Running org.springframework.security.oauth2.provider.token.TokenServicesWithTokenEnhancerTests
08-Jun-2019 00:01:01 [WARN] JwtAccessTokenConverter - Unable to create an RSA verifier from verifierKey (ignoreable if using MAC)
08-Jun-2019 00:01:01 [WARN] JwtAccessTokenConverter - Unable to create an RSA verifier from verifierKey (ignoreable if using MAC)
08-Jun-2019 00:01:01 [WARN] JwtAccessTokenConverter - Unable to create an RSA verifier from verifierKey (ignoreable if using MAC)
08-Jun-2019 00:01:01 [WARN] JwtAccessTokenConverter - Unable to create an RSA verifier from verifierKey (ignoreable if using MAC)
08-Jun-2019 00:01:01 [WARN] JwtAccessTokenConverter - Unable to create an RSA verifier from verifierKey (ignoreable if using MAC)
08-Jun-2019 00:01:01 Tests run: 5, Failures: 0, Errors: 0, Skipped: 0, Time elapsed: 0.016 sec
08-Jun-2019 00:01:01 Running org.springframework.security.oauth2.provider.token.DefaultTokenServicesWithJwtTests
08-Jun-2019 00:01:01 [WARN] JwtAccessTokenConverter - Unable to create an RSA verifier from verifierKey (ignoreable if using MAC)
08-Jun-2019 00:01:01 [WARN] JwtAccessTokenConverter - Unable to create an RSA verifier from verifierKey (ignoreable if using MAC)
08-Jun-2019 00:01:01 [WARN] JwtAccessTokenConverter - Unable to create an RSA verifier from verifierKey (ignoreable if using MAC)
08-Jun-2019 00:01:01 [WARN] JwtAccessTokenConverter - Unable to create an RSA verifier from verifierKey (ignoreable if using MAC)
08-Jun-2019 00:01:01 [WARN] JwtAccessTokenConverter - Unable to create an RSA verifier from verifierKey (ignoreable if using MAC)
08-Jun-2019 00:01:01 [WARN] JwtAccessTokenConverter - Unable to create an RSA verifier from verifierKey (ignoreable if using MAC)
08-Jun-2019 00:01:01 [WARN] JwtAccessTokenConverter - Unable to create an RSA verifier from verifierKey (ignoreable if using MAC)
08-Jun-2019 00:01:01 [WARN] JwtAccessTokenConverter - Unable to create an RSA verifier from verifierKey (ignoreable if using MAC)
08-Jun-2019 00:01:01 [WARN] JwtAccessTokenConverter - Unable to create an RSA verifier from verifierKey (ignoreable if using MAC)
08-Jun-2019 00:01:01 [WARN] JwtAccessTokenConverter - Unable to create an RSA verifier from verifierKey (ignoreable if using MAC)
08-Jun-2019 00:01:01 [WARN] JwtAccessTokenConverter - Unable to create an RSA verifier from verifierKey (ignoreable if using MAC)
08-Jun-2019 00:01:01 [WARN] JwtAccessTokenConverter - Unable to create an RSA verifier from verifierKey (ignoreable if using MAC)
08-Jun-2019 00:01:01 [WARN] JwtAccessTokenConverter - Unable to create an RSA verifier from verifierKey (ignoreable if using MAC)
08-Jun-2019 00:01:01 [WARN] JwtAccessTokenConverter - Unable to create an RSA verifier from verifierKey (ignoreable if using MAC)
08-Jun-2019 00:01:01 [WARN] JwtAccessTokenConverter - Unable to create an RSA verifier from verifierKey (ignoreable if using MAC)
08-Jun-2019 00:01:01 Tests run: 15, Failures: 0, Errors: 0, Skipped: 0, Time elapsed: 0.041 sec
08-Jun-2019 00:01:01 Running org.springframework.security.oauth2.provider.token.DefaultTokenServicesTests
08-Jun-2019 00:01:01 Tests run: 1, Failures: 0, Errors: 0, Skipped: 0, Time elapsed: 0.004 sec
08-Jun-2019 00:01:01 Running org.springframework.security.oauth2.provider.token.DefaultTokenServicesWithInMemoryTests
08-Jun-2019 00:01:01 Tests run: 25, Failures: 0, Errors: 0, Skipped: 0, Time elapsed: 0.018 sec
08-Jun-2019 00:01:01 Running org.springframework.security.oauth2.provider.token.DefaultAccessTokenConverterTests
08-Jun-2019 00:01:01 Tests run: 15, Failures: 0, Errors: 0, Skipped: 0, Time elapsed: 0.003 sec
08-Jun-2019 00:01:01 Running org.springframework.security.oauth2.provider.implicit.InMemoryImplicitGrantServiceTests
08-Jun-2019 00:01:01 Tests run: 2, Failures: 0, Errors: 0, Skipped: 0, Time elapsed: 0 sec
08-Jun-2019 00:01:01 Running org.springframework.security.oauth2.provider.error.DefaultWebResponseExceptionTranslatorTests
08-Jun-2019 00:01:01 Tests run: 1, Failures: 0, Errors: 0, Skipped: 0, Time elapsed: 0 sec
08-Jun-2019 00:01:01 Running org.springframework.security.oauth2.provider.error.OAuth2AuthenticationEntryPointTests
08-Jun-2019 00:01:01 [WARN] DefaultHandlerExceptionResolver - Resolved exception caused by handler execution: org.springframework.web.HttpMediaTypeNotAcceptableException: Could not find acceptable representation
08-Jun-2019 00:01:01 Tests run: 7, Failures: 0, Errors: 0, Skipped: 0, Time elapsed: 0.038 sec
08-Jun-2019 00:01:01 Running org.springframework.security.oauth2.provider.error.OAuth2AccessDeniedHandlerTests
08-Jun-2019 00:01:01 Tests run: 1, Failures: 0, Errors: 0, Skipped: 0, Time elapsed: 0.005 sec
08-Jun-2019 00:01:01 Running org.springframework.security.oauth2.provider.authentication.OAuth2AuthenticationProcessingFilterTests
08-Jun-2019 00:01:01 Tests run: 8, Failures: 0, Errors: 0, Skipped: 0, Time elapsed: 0.043 sec
08-Jun-2019 00:01:01 Running org.springframework.security.oauth2.provider.authentication.OAuth2AuthenticationDetailsTests
08-Jun-2019 00:01:01 Tests run: 1, Failures: 0, Errors: 0, Skipped: 0, Time elapsed: 0.001 sec
08-Jun-2019 00:01:01 Running org.springframework.security.oauth2.provider.authentication.OAuth2AuthenticationManagerTests
08-Jun-2019 00:01:01 Tests run: 3, Failures: 0, Errors: 0, Skipped: 0, Time elapsed: 0.001 sec
08-Jun-2019 00:01:01 Running org.springframework.security.oauth2.provider.endpoint.FrameworkEndpointHandlerMappingTests
08-Jun-2019 00:01:01 Tests run: 4, Failures: 0, Errors: 0, Skipped: 0, Time elapsed: 0 sec
08-Jun-2019 00:01:01 Running org.springframework.security.oauth2.provider.endpoint.WhitelabelApprovalEndpointTests
08-Jun-2019 00:01:01 Tests run: 6, Failures: 0, Errors: 0, Skipped: 0, Time elapsed: 0.004 sec
08-Jun-2019 00:01:01 Running org.springframework.security.oauth2.provider.endpoint.ExactMatchRedirectResolverTests
08-Jun-2019 00:01:01 Tests run: 3, Failures: 0, Errors: 0, Skipped: 0, Time elapsed: 0 sec
08-Jun-2019 00:01:01 Running org.springframework.security.oauth2.provider.endpoint.AuthorizationEndpointTests
08-Jun-2019 00:01:01 Tests run: 34, Failures: 0, Errors: 0, Skipped: 0, Time elapsed: 0.023 sec
08-Jun-2019 00:01:01 Running org.springframework.security.oauth2.provider.endpoint.TokenEndpointTests
08-Jun-2019 00:01:01 Tests run: 6, Failures: 0, Errors: 0, Skipped: 0, Time elapsed: 0.009 sec
08-Jun-2019 00:01:01 Running org.springframework.security.oauth2.provider.endpoint.DefaultRedirectResolverTests
08-Jun-2019 00:01:01 Tests run: 31, Failures: 0, Errors: 0, Skipped: 0, Time elapsed: 0.009 sec
08-Jun-2019 00:01:01 Running org.springframework.security.oauth2.provider.endpoint.WhitelabelErrorEndpointTests
08-Jun-2019 00:01:01 Tests run: 3, Failures: 0, Errors: 0, Skipped: 0, Time elapsed: 0.001 sec
08-Jun-2019 00:01:01 Running org.springframework.security.oauth2.provider.endpoint.TokenEndpointAuthenticationFilterTests
08-Jun-2019 00:01:01 Tests run: 3, Failures: 0, Errors: 0, Skipped: 0, Time elapsed: 0.015 sec
08-Jun-2019 00:01:01 Running org.springframework.security.oauth2.provider.AuthorizationRequestTests
08-Jun-2019 00:01:01 Tests run: 9, Failures: 0, Errors: 0, Skipped: 0, Time elapsed: 0.004 sec
08-Jun-2019 00:01:01 Running org.springframework.security.oauth2.provider.OAuth2AuthenticationTests
08-Jun-2019 00:01:01 {"authorities":[{"authority":"ROLE_USER"}],"details":null,"authenticated":false,"userAuthentication":{"authorities":[{"authority":"ROLE_USER"}],"details":null,"authenticated":true,"principal":"foo","credentials":"bar","name":"foo"},"clientOnly":false,"oauth2Request":{"clientId":"id","scope":["read"],"requestParameters":{},"resourceIds":[],"authorities":[],"approved":false,"refresh":false,"redirectUri":null,"responseTypes":[],"extensions":{},"grantType":null,"refreshTokenRequest":null},"principal":"foo","credentials":"","name":"foo"}
08-Jun-2019 00:01:01 Tests run: 8, Failures: 0, Errors: 0, Skipped: 0, Time elapsed: 0.015 sec
08-Jun-2019 00:01:01 Running org.springframework.security.oauth2.provider.expression.OAuth2MethodSecurityExpressionHandlerTests
08-Jun-2019 00:01:01 Tests run: 9, Failures: 0, Errors: 0, Skipped: 0, Time elapsed: 0.008 sec
08-Jun-2019 00:01:01 Running org.springframework.security.oauth2.provider.expression.OAuth2SecurityExpressionMethodsTests
08-Jun-2019 00:01:01 Tests run: 10, Failures: 0, Errors: 0, Skipped: 0, Time elapsed: 0.001 sec
08-Jun-2019 00:01:01 Running org.springframework.security.oauth2.provider.expression.OAuth2WebSecurityExpressionHandlerTests
08-Jun-2019 00:01:01 Tests run: 6, Failures: 0, Errors: 0, Skipped: 0, Time elapsed: 0.003 sec
08-Jun-2019 00:01:01 Running org.springframework.security.oauth2.provider.expression.OAuth2ExpressionParserTests
08-Jun-2019 00:01:01 Tests run: 3, Failures: 0, Errors: 0, Skipped: 0, Time elapsed: 0.006 sec
08-Jun-2019 00:01:01 Running org.springframework.security.oauth2.provider.OAuth2RequestTests
08-Jun-2019 00:01:01 Tests run: 4, Failures: 0, Errors: 0, Skipped: 0, Time elapsed: 0.001 sec
08-Jun-2019 00:01:01 Running org.springframework.security.oauth2.provider.code.AuthorizationCodeTokenGranterTests
08-Jun-2019 00:01:01 Tests run: 5, Failures: 0, Errors: 0, Skipped: 0, Time elapsed: 0.004 sec
08-Jun-2019 00:01:01 Running org.springframework.security.oauth2.provider.code.InMemoryAuthorizationCodeServicesTests
08-Jun-2019 00:01:01 Tests run: 3, Failures: 0, Errors: 0, Skipped: 0, Time elapsed: 0.001 sec
08-Jun-2019 00:01:01 Running org.springframework.security.oauth2.provider.code.JdbcAuthorizationCodeServicesTests
08-Jun-2019 00:01:01 Tests run: 3, Failures: 0, Errors: 0, Skipped: 0, Time elapsed: 0.03 sec
08-Jun-2019 00:01:01 Running org.springframework.security.oauth2.provider.code.SubdomainRedirectResolverTests
08-Jun-2019 00:01:01 Tests run: 2, Failures: 0, Errors: 0, Skipped: 0, Time elapsed: 0 sec
08-Jun-2019 00:01:01 Running org.springframework.security.oauth2.common.OAuth2AccessTokenJackson1DeserializerTests
08-Jun-2019 00:01:02 Tests run: 8, Failures: 0, Errors: 0, Skipped: 0, Time elapsed: 1.111 sec
08-Jun-2019 00:01:02 Running org.springframework.security.oauth2.common.OAuth2AccessTokenJackson2DeserializerTests
08-Jun-2019 00:01:03 Tests run: 9, Failures: 0, Errors: 0, Skipped: 0, Time elapsed: 1.067 sec
08-Jun-2019 00:01:03 Running org.springframework.security.oauth2.common.exception.OAuth2ExceptionDeserializerTests
08-Jun-2019 00:01:03 Tests run: 13, Failures: 0, Errors: 0, Skipped: 0, Time elapsed: 0.007 sec
08-Jun-2019 00:01:03 Running org.springframework.security.oauth2.common.exception.OAuth2ExceptionSerializerTests
08-Jun-2019 00:01:03 Tests run: 11, Failures: 0, Errors: 0, Skipped: 0, Time elapsed: 0.007 sec
08-Jun-2019 00:01:03 Running org.springframework.security.oauth2.common.exception.OAuth2ExceptionJackson2DeserializerTests
08-Jun-2019 00:01:03 Tests run: 14, Failures: 0, Errors: 0, Skipped: 0, Time elapsed: 0.004 sec
08-Jun-2019 00:01:03 Running org.springframework.security.oauth2.common.OAuth2AccessTokenJackson2SerializerTests
08-Jun-2019 00:01:04 Tests run: 10, Failures: 0, Errors: 0, Skipped: 0, Time elapsed: 0.958 sec
08-Jun-2019 00:01:04 Running org.springframework.security.oauth2.common.OAuth2AccessTokenJackson1SerializerTests
08-Jun-2019 00:01:07 Tests run: 1, Failures: 0, Errors: 0, Skipped: 0, Time elapsed: 3.429 sec
08-Jun-2019 00:01:09 Exception: java.lang.OutOfMemoryError thrown from the UncaughtExceptionHandler in thread "main"
08-Jun-2019 00:01:09
08-Jun-2019 00:01:09 Results :
08-Jun-2019 00:01:09
08-Jun-2019 00:01:09 Tests run: 696, Failures: 0, Errors: 0, Skipped: 0
08-Jun-2019 00:01:09
08-Jun-2019 00:01:09 [INFO] ------------------------------------------------------------------------
08-Jun-2019 00:01:09 [INFO] Reactor Summary:
08-Jun-2019 00:01:09 [INFO]
08-Jun-2019 00:01:09 [INFO] OAuth for Spring Security .......................... SUCCESS [  0.981 s]
08-Jun-2019 00:01:09 [INFO] OAuth 1(a) for Spring Security ..................... SUCCESS [  8.822 s]
08-Jun-2019 00:01:09 [INFO] OAuth2 for Spring Security ......................... FAILURE [ 32.318 s]
08-Jun-2019 00:01:09 [INFO] spring-oauth2-tests ................................ SKIPPED
08-Jun-2019 00:01:09 [INFO] spring-oauth2-tests-common ......................... SKIPPED
08-Jun-2019 00:01:09 [INFO] spring-oauth2-tests-vanilla ........................ SKIPPED
08-Jun-2019 00:01:09 [INFO] spring-oauth2-tests-mappings ....................... SKIPPED
08-Jun-2019 00:01:09 [INFO] spring-oauth2-tests-form ........................... SKIPPED
08-Jun-2019 00:01:09 [INFO] spring-oauth2-tests-jwt ............................ SKIPPED
08-Jun-2019 00:01:09 [INFO] spring-oauth2-tests-approval ....................... SKIPPED
08-Jun-2019 00:01:09 [INFO] spring-oauth2-tests-jdbc ........................... SKIPPED
08-Jun-2019 00:01:09 [INFO] spring-oauth2-tests-jpa ............................ SKIPPED
08-Jun-2019 00:01:09 [INFO] spring-oauth2-tests-jaxb ........................... SKIPPED
08-Jun-2019 00:01:09 [INFO] spring-oauth-tests-custom-grant .................... SKIPPED
08-Jun-2019 00:01:09 [INFO] spring-oauth2-tests-multi .......................... SKIPPED
08-Jun-2019 00:01:09 [INFO] spring-oauth2-tests-client ......................... SKIPPED
08-Jun-2019 00:01:09 [INFO] spring-oauth2-tests-resource ....................... SKIPPED
08-Jun-2019 00:01:09 [INFO] spring-oauth2-tests-custom-authentication .......... SKIPPED
08-Jun-2019 00:01:09 [INFO] spring-oauth2-tests-xml ............................ SKIPPED
08-Jun-2019 00:01:09 [INFO] spring-oauth2-tests-xml-common ..................... SKIPPED
08-Jun-2019 00:01:09 [INFO] spring-oauth2-tests-xml-vanilla .................... SKIPPED
08-Jun-2019 00:01:09 [INFO] spring-oauth2-tests-xml-mappings ................... SKIPPED
08-Jun-2019 00:01:09 [INFO] spring-oauth2-tests-xml-form ....................... SKIPPED
08-Jun-2019 00:01:09 [INFO] spring-oauth2-tests-xml-jwt ........................ SKIPPED
08-Jun-2019 00:01:09 [INFO] spring-oauth2-tests-xml-approval ................... SKIPPED
08-Jun-2019 00:01:09 [INFO] spring-oauth2-tests-xml-jdbc ....................... SKIPPED
08-Jun-2019 00:01:09 [INFO] spring-oauth2-tests-xml-client ..................... SKIPPED
08-Jun-2019 00:01:09 [INFO] OAuth for Spring Security - Integration Tests ...... SKIPPED
08-Jun-2019 00:01:09 [INFO] OAuth for Spring Security - Sparklr (OAuth 1 Provider Example) SKIPPED
08-Jun-2019 00:01:09 [INFO] OAuth for Spring Security - Tonr (OAuth 1 Consumer Example) SKIPPED
08-Jun-2019 00:01:09 [INFO] OAuth for Spring Security - Sparklr2 (OAuth 2 Provider Example) SKIPPED
08-Jun-2019 00:01:09 [INFO] OAuth for Spring Security - Tonr2 (OAuth 2 Client Example) SKIPPED
08-Jun-2019 00:01:09 [INFO] OAuth for Spring Security - Samples ................ SKIPPED
08-Jun-2019 00:01:09 [INFO] ------------------------------------------------------------------------
08-Jun-2019 00:01:09 [INFO] BUILD FAILURE
08-Jun-2019 00:01:09 [INFO] ------------------------------------------------------------------------
08-Jun-2019 00:01:09 [INFO] Total time: 45.159 s
08-Jun-2019 00:01:09 [INFO] Finished at: 2019-06-08T00:01:09+00:00
08-Jun-2019 00:01:09 [INFO] Final Memory: 75M/526M
08-Jun-2019 00:01:09 [INFO] ------------------------------------------------------------------------
08-Jun-2019 00:01:09 [ERROR] Failed to execute goal org.apache.maven.plugins:maven-surefire-plugin:2.12.4:test (default-test) on project spring-security-oauth2: Execution default-test of goal org.apache.maven.plugins:maven-surefire-plugin:2.12.4:test failed: The forked VM terminated without saying properly goodbye. VM crash or System.exit called ? -> [Help 1]
08-Jun-2019 00:01:09 [ERROR]
08-Jun-2019 00:01:09 [ERROR] To see the full stack trace of the errors, re-run Maven with the -e switch.
08-Jun-2019 00:01:09 [ERROR] Re-run Maven using the -X switch to enable full debug logging.
08-Jun-2019 00:01:09 [ERROR]
08-Jun-2019 00:01:09 [ERROR] For more information about the errors and possible solutions, please read the following articles:
08-Jun-2019 00:01:09 [ERROR] [Help 1] http://cwiki.apache.org/confluence/display/MAVEN/PluginExecutionException
08-Jun-2019 00:01:09 [ERROR]
08-Jun-2019 00:01:09 [ERROR] After correcting the problems, you can resume the build with the command
08-Jun-2019 00:01:09 [ERROR]   mvn <goals> -rf :spring-security-oauth2
08-Jun-2019 00:01:09 Exception in thread "main"
08-Jun-2019 00:01:09
08-Jun-2019 00:01:09 Failing task since return code of [/opt/jdk-7/bin/java -cp /opt/maven-3.3/boot/plexus-classworlds-2.5.2.jar -Dclassworlds.conf=/tmp/artifactoryM2767764974873316953conf -DbuildInfoConfig.propertiesFile=/tmp/buildInfo1714487480409415623.properties -Xmx1256m -Xms128m -Dmaven.home=/opt/maven-3.3 -Dmaven.multiModuleProjectDirectory=/opt/bamboo-home/xml-data/build-dir/SECOAUTH-NIGHTLY-JOB1 org.codehaus.plexus.classworlds.launcher.Launcher clean install -P bootstrap -Dartifactory.publish.password=********] was 1 while expected 0
08-Jun-2019 00:01:09 Finished task 'Artifactory Maven 3' with result: Failed
08-Jun-2019 00:01:09 Running post build plugin 'Docker Container Cleanup'
08-Jun-2019 00:01:09 Running post build plugin 'NCover Results Collector'
08-Jun-2019 00:01:09 Running post build plugin 'Artifactory Release Management Staging'
08-Jun-2019 00:01:09 Running post build plugin 'Artifactory Build Info Copier'
08-Jun-2019 00:01:09 Running post build plugin 'Artifactory Gradle Properties Info Copier'
08-Jun-2019 00:01:09 Running post build plugin 'Clover Results Collector'
08-Jun-2019 00:01:09 Running post build plugin 'npm Cache Cleanup'
08-Jun-2019 00:01:09 Running post build plugin 'Artifact Copier'
08-Jun-2019 00:01:09 Successfully removed working directory at '/opt/bamboo-home/xml-data/build-dir/SECOAUTH-NIGHTLY-JOB1'
08-Jun-2019 00:01:09 Finalising the build...
08-Jun-2019 00:01:09 Stopping timer.
08-Jun-2019 00:01:09 Build SECOAUTH-NIGHTLY-JOB1-1668 completed.
08-Jun-2019 00:01:09 Running on server: post build plugin 'NCover Results Collector'
08-Jun-2019 00:01:09 Running on server: post build plugin 'Build Hanging Detection Configuration'
08-Jun-2019 00:01:09 Running on server: post build plugin 'Clover Delta Calculator'
08-Jun-2019 00:01:09 Running on server: post build plugin 'Maven Dependencies Postprocessor'
08-Jun-2019 00:01:09 All post build plugins have finished
08-Jun-2019 00:01:09 Generating build results summary...
08-Jun-2019 00:01:09 Saving build results to disk...
08-Jun-2019 00:01:09 Logging substituted variables...
08-Jun-2019 00:01:10 Indexing build results...
08-Jun-2019 00:01:10 Finished building SECOAUTH-NIGHTLY-JOB1-1668.