Build: #1671 failed

Job: Default Job failed

Stages & jobs

  1. Default Stage

Build log

The build generated 8,006 lines of output.The output is too long and has been truncated to the last 1,000 lines. Download or view full build log

11-Jun-2019 00:01:44 386/386 KB   18/18 KB   392/2669 KB   
11-Jun-2019 00:01:44 386/386 KB   18/18 KB   396/2669 KB   
11-Jun-2019 00:01:44 386/386 KB   18/18 KB   400/2669 KB   
11-Jun-2019 00:01:44                                      
11-Jun-2019 00:01:44 Downloaded: https://repo.maven.apache.org/maven2/com/squareup/okhttp3/okhttp/3.7.0/okhttp-3.7.0.jar (386 KB at 5284.0 KB/sec)
11-Jun-2019 00:01:44 Downloading: https://repo.maven.apache.org/maven2/org/powermock/powermock-api-mockito/1.7.4/powermock-api-mockito-1.7.4.jar
11-Jun-2019 00:01:44 18/18 KB   404/2669 KB               
11-Jun-2019 00:01:44 18/18 KB   408/2669 KB   
11-Jun-2019 00:01:44 18/18 KB   412/2669 KB   
11-Jun-2019 00:01:44 18/18 KB   416/2669 KB   
11-Jun-2019 00:01:44 18/18 KB   420/2669 KB   
11-Jun-2019 00:01:44 18/18 KB   424/2669 KB   
11-Jun-2019 00:01:44 18/18 KB   428/2669 KB   
11-Jun-2019 00:01:44 18/18 KB   432/2669 KB   
11-Jun-2019 00:01:44 18/18 KB   436/2669 KB   
11-Jun-2019 00:01:44 18/18 KB   440/2669 KB   
11-Jun-2019 00:01:44 18/18 KB   444/2669 KB   
11-Jun-2019 00:01:44 18/18 KB   448/2669 KB   
11-Jun-2019 00:01:44 18/18 KB   452/2669 KB   
11-Jun-2019 00:01:44 18/18 KB   456/2669 KB   
11-Jun-2019 00:01:44 18/18 KB   460/2669 KB   
11-Jun-2019 00:01:44 18/18 KB   464/2669 KB   
11-Jun-2019 00:01:44 18/18 KB   468/2669 KB   
11-Jun-2019 00:01:44 18/18 KB   472/2669 KB   
11-Jun-2019 00:01:44 18/18 KB   476/2669 KB   
11-Jun-2019 00:01:44 18/18 KB   480/2669 KB   
11-Jun-2019 00:01:44 18/18 KB   484/2669 KB   
11-Jun-2019 00:01:44 18/18 KB   488/2669 KB   
11-Jun-2019 00:01:44 18/18 KB   492/2669 KB   
11-Jun-2019 00:01:44 18/18 KB   496/2669 KB   
11-Jun-2019 00:01:44 18/18 KB   496/2669 KB   4/65 KB   
11-Jun-2019 00:01:44 18/18 KB   496/2669 KB   8/65 KB   
11-Jun-2019 00:01:44 18/18 KB   500/2669 KB   8/65 KB   
11-Jun-2019 00:01:44 18/18 KB   500/2669 KB   12/65 KB   
11-Jun-2019 00:01:44 18/18 KB   504/2669 KB   12/65 KB   
11-Jun-2019 00:01:44 18/18 KB   504/2669 KB   16/65 KB   
11-Jun-2019 00:01:44 18/18 KB   508/2669 KB   16/65 KB   
11-Jun-2019 00:01:44 18/18 KB   512/2669 KB   16/65 KB   
11-Jun-2019 00:01:44 18/18 KB   512/2669 KB   20/65 KB   
11-Jun-2019 00:01:44 18/18 KB   512/2669 KB   24/65 KB   
11-Jun-2019 00:01:44 18/18 KB   512/2669 KB   28/65 KB   
11-Jun-2019 00:01:44 18/18 KB   512/2669 KB   32/65 KB   
11-Jun-2019 00:01:44 18/18 KB   516/2669 KB   32/65 KB   
11-Jun-2019 00:01:44 18/18 KB   520/2669 KB   32/65 KB   
11-Jun-2019 00:01:44 18/18 KB   524/2669 KB   32/65 KB   
11-Jun-2019 00:01:44 18/18 KB   528/2669 KB   32/65 KB   
11-Jun-2019 00:01:44 4/143 KB   18/18 KB   528/2669 KB   32/65 KB   
11-Jun-2019 00:01:44 4/143 KB   18/18 KB   528/2669 KB   36/65 KB   
11-Jun-2019 00:01:44 8/143 KB   18/18 KB   528/2669 KB   36/65 KB   
11-Jun-2019 00:01:44 12/143 KB   18/18 KB   528/2669 KB   40/65 KB   
11-Jun-2019 00:01:44 12/143 KB   18/18 KB   528/2669 KB   40/65 KB   
11-Jun-2019 00:01:44 12/143 KB   18/18 KB   528/2669 KB   44/65 KB   
11-Jun-2019 00:01:44 16/143 KB   18/18 KB   528/2669 KB   44/65 KB   
11-Jun-2019 00:01:44 16/143 KB   18/18 KB   532/2669 KB   44/65 KB   
11-Jun-2019 00:01:44 16/143 KB   18/18 KB   532/2669 KB   48/65 KB   
11-Jun-2019 00:01:44 16/143 KB   18/18 KB   536/2669 KB   48/65 KB   
11-Jun-2019 00:01:44 16/143 KB   18/18 KB   540/2669 KB   48/65 KB   
11-Jun-2019 00:01:44 16/143 KB   18/18 KB   544/2669 KB   48/65 KB   
11-Jun-2019 00:01:44 20/143 KB   18/18 KB   544/2669 KB   48/65 KB   
11-Jun-2019 00:01:44 24/143 KB   18/18 KB   544/2669 KB   48/65 KB   
11-Jun-2019 00:01:44 24/143 KB   18/18 KB   544/2669 KB   52/65 KB   
11-Jun-2019 00:01:44 28/143 KB   18/18 KB   544/2669 KB   52/65 KB   
11-Jun-2019 00:01:44 32/143 KB   18/18 KB   544/2669 KB   52/65 KB   
11-Jun-2019 00:01:44 32/143 KB   18/18 KB   548/2669 KB   56/65 KB   
11-Jun-2019 00:01:44 32/143 KB   18/18 KB   548/2669 KB   56/65 KB   
11-Jun-2019 00:01:44 32/143 KB   18/18 KB   552/2669 KB   56/65 KB   
11-Jun-2019 00:01:44 32/143 KB   18/18 KB   552/2669 KB   60/65 KB   
11-Jun-2019 00:01:44 32/143 KB   18/18 KB   556/2669 KB   60/65 KB   
11-Jun-2019 00:01:44 32/143 KB   18/18 KB   560/2669 KB   64/65 KB   
11-Jun-2019 00:01:44 32/143 KB   18/18 KB   560/2669 KB   64/65 KB   
11-Jun-2019 00:01:44 32/143 KB   18/18 KB   560/2669 KB   65/65 KB   
11-Jun-2019 00:01:44 32/143 KB   18/18 KB   564/2669 KB   65/65 KB   
11-Jun-2019 00:01:44 32/143 KB   18/18 KB   568/2669 KB   65/65 KB   
11-Jun-2019 00:01:44 32/143 KB   18/18 KB   572/2669 KB   65/65 KB   
11-Jun-2019 00:01:44 32/143 KB   18/18 KB   576/2669 KB   65/65 KB   
11-Jun-2019 00:01:44 32/143 KB   18/18 KB   580/2669 KB   65/65 KB   
11-Jun-2019 00:01:44 32/143 KB   18/18 KB   584/2669 KB   65/65 KB   
11-Jun-2019 00:01:44 32/143 KB   18/18 KB   588/2669 KB   65/65 KB   
11-Jun-2019 00:01:44 32/143 KB   18/18 KB   592/2669 KB   65/65 KB   
11-Jun-2019 00:01:44 32/143 KB   18/18 KB   596/2669 KB   65/65 KB   
11-Jun-2019 00:01:44 32/143 KB   18/18 KB   600/2669 KB   65/65 KB   
11-Jun-2019 00:01:44 32/143 KB   18/18 KB   604/2669 KB   65/65 KB   
11-Jun-2019 00:01:44 32/143 KB   18/18 KB   608/2669 KB   65/65 KB   
11-Jun-2019 00:01:44                                                
11-Jun-2019 00:01:44 Downloaded: https://repo.maven.apache.org/maven2/org/powermock/powermock-module-junit4-common/1.7.4/powermock-module-junit4-common-1.7.4.jar (18 KB at 210.3 KB/sec)
11-Jun-2019 00:01:44 Downloading: https://repo.maven.apache.org/maven2/org/powermock/powermock-api-mockito-common/1.7.4/powermock-api-mockito-common-1.7.4.jar
11-Jun-2019 00:01:44 32/143 KB   612/2669 KB   65/65 KB             
11-Jun-2019 00:01:44 32/143 KB   616/2669 KB   65/65 KB   
11-Jun-2019 00:01:44 32/143 KB   620/2669 KB   65/65 KB   
11-Jun-2019 00:01:44 32/143 KB   624/2669 KB   65/65 KB   
11-Jun-2019 00:01:44 32/143 KB   628/2669 KB   65/65 KB   
11-Jun-2019 00:01:44 32/143 KB   632/2669 KB   65/65 KB   
11-Jun-2019 00:01:44 32/143 KB   636/2669 KB   65/65 KB   
11-Jun-2019 00:01:44 32/143 KB   640/2669 KB   65/65 KB   
11-Jun-2019 00:01:44 32/143 KB   644/2669 KB   65/65 KB   
11-Jun-2019 00:01:44 32/143 KB   648/2669 KB   65/65 KB   
11-Jun-2019 00:01:44 32/143 KB   652/2669 KB   65/65 KB   
11-Jun-2019 00:01:44 32/143 KB   656/2669 KB   65/65 KB   
11-Jun-2019 00:01:44 32/143 KB   660/2669 KB   65/65 KB   
11-Jun-2019 00:01:44 32/143 KB   664/2669 KB   65/65 KB   
11-Jun-2019 00:01:44 32/143 KB   668/2669 KB   65/65 KB   
11-Jun-2019 00:01:44 32/143 KB   672/2669 KB   65/65 KB   
11-Jun-2019 00:01:44 32/143 KB   676/2669 KB   65/65 KB   
11-Jun-2019 00:01:44                                      
11-Jun-2019 00:01:44 Downloaded: https://repo.maven.apache.org/maven2/org/powermock/powermock-api-mockito/1.7.4/powermock-api-mockito-1.7.4.jar (0 B at 0.0 KB/sec)
11-Jun-2019 00:01:44 Downloading: https://repo.maven.apache.org/maven2/org/powermock/powermock-api-support/1.7.4/powermock-api-support-1.7.4.jar
11-Jun-2019 00:01:44 32/143 KB   680/2669 KB   65/65 KB   
11-Jun-2019 00:01:44 32/143 KB   684/2669 KB   65/65 KB   
11-Jun-2019 00:01:44 32/143 KB   688/2669 KB   65/65 KB   
11-Jun-2019 00:01:44 32/143 KB   692/2669 KB   65/65 KB   
11-Jun-2019 00:01:44 32/143 KB   696/2669 KB   65/65 KB   
11-Jun-2019 00:01:44 32/143 KB   700/2669 KB   65/65 KB   
11-Jun-2019 00:01:44 32/143 KB   704/2669 KB   65/65 KB   
11-Jun-2019 00:01:44 36/143 KB   704/2669 KB   65/65 KB   
11-Jun-2019 00:01:44 40/143 KB   704/2669 KB   65/65 KB   
11-Jun-2019 00:01:44 44/143 KB   704/2669 KB   65/65 KB   
11-Jun-2019 00:01:44 48/143 KB   704/2669 KB   65/65 KB   
11-Jun-2019 00:01:44 48/143 KB   708/2669 KB   65/65 KB   
11-Jun-2019 00:01:44 52/143 KB   708/2669 KB   65/65 KB   
11-Jun-2019 00:01:44 56/143 KB   708/2669 KB   65/65 KB   
11-Jun-2019 00:01:44 60/143 KB   708/2669 KB   65/65 KB   
11-Jun-2019 00:01:44 64/143 KB   708/2669 KB   65/65 KB   
11-Jun-2019 00:01:44 68/143 KB   708/2669 KB   65/65 KB   
11-Jun-2019 00:01:44 72/143 KB   708/2669 KB   65/65 KB   
11-Jun-2019 00:01:44 76/143 KB   708/2669 KB   65/65 KB   
11-Jun-2019 00:01:44 80/143 KB   708/2669 KB   65/65 KB   
11-Jun-2019 00:01:44 80/143 KB   712/2669 KB   65/65 KB   
11-Jun-2019 00:01:44 80/143 KB   716/2669 KB   65/65 KB   
11-Jun-2019 00:01:44 80/143 KB   720/2669 KB   65/65 KB   
11-Jun-2019 00:01:44 80/143 KB   724/2669 KB   65/65 KB   
11-Jun-2019 00:01:44 80/143 KB   728/2669 KB   65/65 KB   
11-Jun-2019 00:01:44 80/143 KB   732/2669 KB   65/65 KB   
11-Jun-2019 00:01:44 80/143 KB   736/2669 KB   65/65 KB   
11-Jun-2019 00:01:44 80/143 KB   740/2669 KB   65/65 KB   
11-Jun-2019 00:01:44 80/143 KB   744/2669 KB   65/65 KB   
11-Jun-2019 00:01:44 80/143 KB   748/2669 KB   65/65 KB   
11-Jun-2019 00:01:44 80/143 KB   752/2669 KB   65/65 KB   
11-Jun-2019 00:01:44 80/143 KB   756/2669 KB   65/65 KB   
11-Jun-2019 00:01:44 80/143 KB   760/2669 KB   65/65 KB   
11-Jun-2019 00:01:44 80/143 KB   764/2669 KB   65/65 KB   
11-Jun-2019 00:01:44 80/143 KB   768/2669 KB   65/65 KB   
11-Jun-2019 00:01:44                                      
11-Jun-2019 00:01:44 Downloaded: https://repo.maven.apache.org/maven2/org/powermock/powermock-reflect/1.7.4/powermock-reflect-1.7.4.jar (65 KB at 688.3 KB/sec)
11-Jun-2019 00:01:44 80/143 KB   772/2669 KB             
11-Jun-2019 00:01:44 80/143 KB   776/2669 KB   
11-Jun-2019 00:01:44 80/143 KB   780/2669 KB   
11-Jun-2019 00:01:44 80/143 KB   784/2669 KB   
11-Jun-2019 00:01:44 80/143 KB   788/2669 KB   
11-Jun-2019 00:01:44 80/143 KB   792/2669 KB   
11-Jun-2019 00:01:44 80/143 KB   796/2669 KB   
11-Jun-2019 00:01:44 80/143 KB   800/2669 KB   
11-Jun-2019 00:01:44 80/143 KB   804/2669 KB   
11-Jun-2019 00:01:44 80/143 KB   808/2669 KB   
11-Jun-2019 00:01:44 80/143 KB   812/2669 KB   
11-Jun-2019 00:01:44 80/143 KB   816/2669 KB   
11-Jun-2019 00:01:44 80/143 KB   820/2669 KB   
11-Jun-2019 00:01:44 80/143 KB   824/2669 KB   
11-Jun-2019 00:01:44 80/143 KB   828/2669 KB   
11-Jun-2019 00:01:44 80/143 KB   832/2669 KB   
11-Jun-2019 00:01:44                          
11-Jun-2019 00:01:44 Downloaded: https://repo.maven.apache.org/maven2/org/powermock/powermock-api-mockito-common/1.7.4/powermock-api-mockito-common-1.7.4.jar (0 B at 0.0 KB/sec)
11-Jun-2019 00:01:44 80/143 KB   836/2669 KB   
11-Jun-2019 00:01:44 80/143 KB   840/2669 KB   
11-Jun-2019 00:01:44 80/143 KB   844/2669 KB   
11-Jun-2019 00:01:44 80/143 KB   848/2669 KB   
11-Jun-2019 00:01:44 80/143 KB   852/2669 KB   
11-Jun-2019 00:01:44 80/143 KB   856/2669 KB   
11-Jun-2019 00:01:44 80/143 KB   860/2669 KB   
11-Jun-2019 00:01:44 80/143 KB   864/2669 KB   
11-Jun-2019 00:01:44 84/143 KB   864/2669 KB   
11-Jun-2019 00:01:44 88/143 KB   864/2669 KB   
11-Jun-2019 00:01:44 92/143 KB   864/2669 KB   
11-Jun-2019 00:01:44 96/143 KB   864/2669 KB   
11-Jun-2019 00:01:44 96/143 KB   868/2669 KB   
11-Jun-2019 00:01:44 100/143 KB   868/2669 KB   
11-Jun-2019 00:01:44 104/143 KB   868/2669 KB   
11-Jun-2019 00:01:44 108/143 KB   868/2669 KB   
11-Jun-2019 00:01:44 112/143 KB   868/2669 KB   
11-Jun-2019 00:01:44 116/143 KB   868/2669 KB   
11-Jun-2019 00:01:44 120/143 KB   868/2669 KB   
11-Jun-2019 00:01:44 124/143 KB   868/2669 KB   
11-Jun-2019 00:01:44 3/23 KB   124/143 KB   868/2669 KB   
11-Jun-2019 00:01:44 3/23 KB   128/143 KB   868/2669 KB   
11-Jun-2019 00:01:44 3/23 KB   128/143 KB   872/2669 KB   
11-Jun-2019 00:01:44 3/23 KB   128/143 KB   876/2669 KB   
11-Jun-2019 00:01:44 5/23 KB   128/143 KB   876/2669 KB   
11-Jun-2019 00:01:44 5/23 KB   128/143 KB   880/2669 KB   
11-Jun-2019 00:01:44 8/23 KB   128/143 KB   880/2669 KB   
11-Jun-2019 00:01:44 11/23 KB   128/143 KB   880/2669 KB   
11-Jun-2019 00:01:44 13/23 KB   128/143 KB   880/2669 KB   
11-Jun-2019 00:01:44 16/23 KB   128/143 KB   880/2669 KB   
11-Jun-2019 00:01:44 16/23 KB   128/143 KB   884/2669 KB   
11-Jun-2019 00:01:44 19/23 KB   128/143 KB   884/2669 KB   
11-Jun-2019 00:01:44 19/23 KB   128/143 KB   888/2669 KB   
11-Jun-2019 00:01:44 19/23 KB   128/143 KB   892/2669 KB   
11-Jun-2019 00:01:44 21/23 KB   128/143 KB   896/2669 KB   
11-Jun-2019 00:01:44 21/23 KB   128/143 KB   896/2669 KB   
11-Jun-2019 00:01:44 23/23 KB   128/143 KB   896/2669 KB   
11-Jun-2019 00:01:44 23/23 KB   128/143 KB   900/2669 KB   
11-Jun-2019 00:01:44 23/23 KB   128/143 KB   904/2669 KB   
11-Jun-2019 00:01:44 23/23 KB   128/143 KB   908/2669 KB   
11-Jun-2019 00:01:44 23/23 KB   128/143 KB   912/2669 KB   
11-Jun-2019 00:01:44 23/23 KB   128/143 KB   916/2669 KB   
11-Jun-2019 00:01:44 23/23 KB   128/143 KB   920/2669 KB   
11-Jun-2019 00:01:44 23/23 KB   128/143 KB   924/2669 KB   
11-Jun-2019 00:01:44 23/23 KB   128/143 KB   928/2669 KB   
11-Jun-2019 00:01:44 23/23 KB   128/143 KB   932/2669 KB   
11-Jun-2019 00:01:44 23/23 KB   128/143 KB   936/2669 KB   
11-Jun-2019 00:01:44 23/23 KB   128/143 KB   940/2669 KB   
11-Jun-2019 00:01:44 23/23 KB   128/143 KB   944/2669 KB   
11-Jun-2019 00:01:44 23/23 KB   128/143 KB   948/2669 KB   
11-Jun-2019 00:01:44 23/23 KB   128/143 KB   952/2669 KB   
11-Jun-2019 00:01:44 23/23 KB   128/143 KB   956/2669 KB   
11-Jun-2019 00:01:44 23/23 KB   128/143 KB   960/2669 KB   
11-Jun-2019 00:01:44 23/23 KB   128/143 KB   964/2669 KB   
11-Jun-2019 00:01:44 23/23 KB   128/143 KB   968/2669 KB   
11-Jun-2019 00:01:44 23/23 KB   128/143 KB   972/2669 KB   
11-Jun-2019 00:01:44 23/23 KB   128/143 KB   976/2669 KB   
11-Jun-2019 00:01:44 23/23 KB   128/143 KB   980/2669 KB   
11-Jun-2019 00:01:44 23/23 KB   128/143 KB   984/2669 KB   
11-Jun-2019 00:01:44 23/23 KB   128/143 KB   988/2669 KB   
11-Jun-2019 00:01:44 23/23 KB   128/143 KB   992/2669 KB   
11-Jun-2019 00:01:44 23/23 KB   128/143 KB   996/2669 KB   
11-Jun-2019 00:01:44 23/23 KB   128/143 KB   1000/2669 KB   
11-Jun-2019 00:01:44 23/23 KB   128/143 KB   1004/2669 KB   
11-Jun-2019 00:01:44 23/23 KB   128/143 KB   1008/2669 KB   
11-Jun-2019 00:01:44 23/23 KB   132/143 KB   1008/2669 KB   
11-Jun-2019 00:01:44 23/23 KB   136/143 KB   1008/2669 KB   
11-Jun-2019 00:01:44 23/23 KB   140/143 KB   1008/2669 KB   
11-Jun-2019 00:01:44 23/23 KB   143/143 KB   1008/2669 KB   
11-Jun-2019 00:01:44 23/23 KB   143/143 KB   1012/2669 KB   
11-Jun-2019 00:01:44 23/23 KB   143/143 KB   1016/2669 KB   
11-Jun-2019 00:01:44 23/23 KB   143/143 KB   1020/2669 KB   
11-Jun-2019 00:01:44 23/23 KB   143/143 KB   1024/2669 KB   
11-Jun-2019 00:01:44 23/23 KB   143/143 KB   1028/2669 KB   
11-Jun-2019 00:01:44 23/23 KB   143/143 KB   1032/2669 KB   
11-Jun-2019 00:01:44 23/23 KB   143/143 KB   1036/2669 KB   
11-Jun-2019 00:01:44 23/23 KB   143/143 KB   1040/2669 KB   
11-Jun-2019 00:01:44 23/23 KB   143/143 KB   1044/2669 KB   
11-Jun-2019 00:01:44 23/23 KB   143/143 KB   1048/2669 KB   
11-Jun-2019 00:01:44 23/23 KB   143/143 KB   1052/2669 KB   
11-Jun-2019 00:01:44 23/23 KB   143/143 KB   1056/2669 KB   
11-Jun-2019 00:01:44 23/23 KB   143/143 KB   1060/2669 KB   
11-Jun-2019 00:01:44 23/23 KB   143/143 KB   1064/2669 KB   
11-Jun-2019 00:01:44 23/23 KB   143/143 KB   1068/2669 KB   
11-Jun-2019 00:01:44 23/23 KB   143/143 KB   1072/2669 KB   
11-Jun-2019 00:01:44 23/23 KB   143/143 KB   1076/2669 KB   
11-Jun-2019 00:01:44 23/23 KB   143/143 KB   1080/2669 KB   
11-Jun-2019 00:01:44 23/23 KB   143/143 KB   1084/2669 KB   
11-Jun-2019 00:01:44 23/23 KB   143/143 KB   1088/2669 KB   
11-Jun-2019 00:01:44 23/23 KB   143/143 KB   1092/2669 KB   
11-Jun-2019 00:01:44 23/23 KB   143/143 KB   1096/2669 KB   
11-Jun-2019 00:01:44 23/23 KB   143/143 KB   1100/2669 KB   
11-Jun-2019 00:01:44 23/23 KB   143/143 KB   1104/2669 KB   
11-Jun-2019 00:01:44 23/23 KB   143/143 KB   1108/2669 KB   
11-Jun-2019 00:01:44 23/23 KB   143/143 KB   1112/2669 KB   
11-Jun-2019 00:01:44 23/23 KB   143/143 KB   1116/2669 KB   
11-Jun-2019 00:01:44 23/23 KB   143/143 KB   1120/2669 KB   
11-Jun-2019 00:01:44 23/23 KB   143/143 KB   1124/2669 KB   
11-Jun-2019 00:01:44 23/23 KB   143/143 KB   1128/2669 KB   
11-Jun-2019 00:01:44 23/23 KB   143/143 KB   1132/2669 KB   
11-Jun-2019 00:01:44 23/23 KB   143/143 KB   1136/2669 KB   
11-Jun-2019 00:01:44 23/23 KB   143/143 KB   1140/2669 KB   
11-Jun-2019 00:01:44 23/23 KB   143/143 KB   1144/2669 KB   
11-Jun-2019 00:01:44 23/23 KB   143/143 KB   1148/2669 KB   
11-Jun-2019 00:01:44 23/23 KB   143/143 KB   1152/2669 KB   
11-Jun-2019 00:01:44 23/23 KB   143/143 KB   1156/2669 KB   
11-Jun-2019 00:01:44 23/23 KB   143/143 KB   1160/2669 KB   
11-Jun-2019 00:01:44 23/23 KB   143/143 KB   1164/2669 KB   
11-Jun-2019 00:01:44 23/23 KB   143/143 KB   1168/2669 KB   
11-Jun-2019 00:01:44 23/23 KB   143/143 KB   1172/2669 KB   
11-Jun-2019 00:01:44 23/23 KB   143/143 KB   1176/2669 KB   
11-Jun-2019 00:01:44 23/23 KB   143/143 KB   1180/2669 KB   
11-Jun-2019 00:01:44 23/23 KB   143/143 KB   1184/2669 KB   
11-Jun-2019 00:01:44                                        
11-Jun-2019 00:01:44 Downloaded: https://repo.maven.apache.org/maven2/org/powermock/powermock-api-support/1.7.4/powermock-api-support-1.7.4.jar (23 KB at 195.0 KB/sec)
11-Jun-2019 00:01:44 143/143 KB   1188/2669 KB             
11-Jun-2019 00:01:44 143/143 KB   1192/2669 KB   
11-Jun-2019 00:01:44 143/143 KB   1196/2669 KB   
11-Jun-2019 00:01:44 143/143 KB   1200/2669 KB   
11-Jun-2019 00:01:44 143/143 KB   1204/2669 KB   
11-Jun-2019 00:01:44 143/143 KB   1208/2669 KB   
11-Jun-2019 00:01:44 143/143 KB   1212/2669 KB   
11-Jun-2019 00:01:44 143/143 KB   1216/2669 KB   
11-Jun-2019 00:01:44 143/143 KB   1220/2669 KB   
11-Jun-2019 00:01:44 143/143 KB   1224/2669 KB   
11-Jun-2019 00:01:44 143/143 KB   1228/2669 KB   
11-Jun-2019 00:01:44 143/143 KB   1232/2669 KB   
11-Jun-2019 00:01:44 143/143 KB   1236/2669 KB   
11-Jun-2019 00:01:44 143/143 KB   1240/2669 KB   
11-Jun-2019 00:01:44 143/143 KB   1244/2669 KB   
11-Jun-2019 00:01:44 143/143 KB   1248/2669 KB   
11-Jun-2019 00:01:44 143/143 KB   1252/2669 KB   
11-Jun-2019 00:01:44 143/143 KB   1256/2669 KB   
11-Jun-2019 00:01:44 143/143 KB   1260/2669 KB   
11-Jun-2019 00:01:44 143/143 KB   1264/2669 KB   
11-Jun-2019 00:01:44 143/143 KB   1268/2669 KB   
11-Jun-2019 00:01:44 143/143 KB   1272/2669 KB   
11-Jun-2019 00:01:44 143/143 KB   1276/2669 KB   
11-Jun-2019 00:01:44 143/143 KB   1280/2669 KB   
11-Jun-2019 00:01:44 143/143 KB   1284/2669 KB   
11-Jun-2019 00:01:44 143/143 KB   1288/2669 KB   
11-Jun-2019 00:01:44 143/143 KB   1292/2669 KB   
11-Jun-2019 00:01:44 143/143 KB   1296/2669 KB   
11-Jun-2019 00:01:44                            
11-Jun-2019 00:01:44 Downloaded: https://repo.maven.apache.org/maven2/org/powermock/powermock-core/1.7.4/powermock-core-1.7.4.jar (143 KB at 1184.8 KB/sec)
11-Jun-2019 00:01:44 1300/2669 KB               
11-Jun-2019 00:01:44 1304/2669 KB   
11-Jun-2019 00:01:44 1308/2669 KB   
11-Jun-2019 00:01:44 1312/2669 KB   
11-Jun-2019 00:01:44 1316/2669 KB   
11-Jun-2019 00:01:44 1320/2669 KB   
11-Jun-2019 00:01:44 1324/2669 KB   
11-Jun-2019 00:01:44 1328/2669 KB   
11-Jun-2019 00:01:44 1332/2669 KB   
11-Jun-2019 00:01:44 1336/2669 KB   
11-Jun-2019 00:01:44 1340/2669 KB   
11-Jun-2019 00:01:44 1344/2669 KB   
11-Jun-2019 00:01:44 1348/2669 KB   
11-Jun-2019 00:01:44 1352/2669 KB   
11-Jun-2019 00:01:44 1356/2669 KB   
11-Jun-2019 00:01:44 1360/2669 KB   
11-Jun-2019 00:01:44 1364/2669 KB   
11-Jun-2019 00:01:44 1368/2669 KB   
11-Jun-2019 00:01:44 1372/2669 KB   
11-Jun-2019 00:01:44 1376/2669 KB   
11-Jun-2019 00:01:44 1380/2669 KB   
11-Jun-2019 00:01:44 1384/2669 KB   
11-Jun-2019 00:01:44 1388/2669 KB   
11-Jun-2019 00:01:44 1392/2669 KB   
11-Jun-2019 00:01:44 1396/2669 KB   
11-Jun-2019 00:01:44 1400/2669 KB   
11-Jun-2019 00:01:44 1404/2669 KB   
11-Jun-2019 00:01:44 1408/2669 KB   
11-Jun-2019 00:01:44 1412/2669 KB   
11-Jun-2019 00:01:44 1416/2669 KB   
11-Jun-2019 00:01:44 1420/2669 KB   
11-Jun-2019 00:01:44 1424/2669 KB   
11-Jun-2019 00:01:44 1428/2669 KB   
11-Jun-2019 00:01:44 1432/2669 KB   
11-Jun-2019 00:01:44 1436/2669 KB   
11-Jun-2019 00:01:44 1440/2669 KB   
11-Jun-2019 00:01:44 1444/2669 KB   
11-Jun-2019 00:01:44 1448/2669 KB   
11-Jun-2019 00:01:44 1452/2669 KB   
11-Jun-2019 00:01:44 1456/2669 KB   
11-Jun-2019 00:01:44 1460/2669 KB   
11-Jun-2019 00:01:44 1464/2669 KB   
11-Jun-2019 00:01:44 1468/2669 KB   
11-Jun-2019 00:01:44 1472/2669 KB   
11-Jun-2019 00:01:44 1476/2669 KB   
11-Jun-2019 00:01:44 1480/2669 KB   
11-Jun-2019 00:01:44 1484/2669 KB   
11-Jun-2019 00:01:44 1488/2669 KB   
11-Jun-2019 00:01:44 1492/2669 KB   
11-Jun-2019 00:01:44 1496/2669 KB   
11-Jun-2019 00:01:44 1500/2669 KB   
11-Jun-2019 00:01:44 1504/2669 KB   
11-Jun-2019 00:01:44 1508/2669 KB   
11-Jun-2019 00:01:44 1512/2669 KB   
11-Jun-2019 00:01:44 1516/2669 KB   
11-Jun-2019 00:01:44 1520/2669 KB   
11-Jun-2019 00:01:44 1524/2669 KB   
11-Jun-2019 00:01:44 1528/2669 KB   
11-Jun-2019 00:01:44 1532/2669 KB   
11-Jun-2019 00:01:44 1536/2669 KB   
11-Jun-2019 00:01:44 1540/2669 KB   
11-Jun-2019 00:01:44 1544/2669 KB   
11-Jun-2019 00:01:44 1548/2669 KB   
11-Jun-2019 00:01:44 1552/2669 KB   
11-Jun-2019 00:01:44 1556/2669 KB   
11-Jun-2019 00:01:44 1560/2669 KB   
11-Jun-2019 00:01:44 1564/2669 KB   
11-Jun-2019 00:01:44 1568/2669 KB   
11-Jun-2019 00:01:44 1572/2669 KB   
11-Jun-2019 00:01:44 1576/2669 KB   
11-Jun-2019 00:01:44 1580/2669 KB   
11-Jun-2019 00:01:44 1584/2669 KB   
11-Jun-2019 00:01:44 1588/2669 KB   
11-Jun-2019 00:01:44 1592/2669 KB   
11-Jun-2019 00:01:44 1596/2669 KB   
11-Jun-2019 00:01:44 1600/2669 KB   
11-Jun-2019 00:01:44 1604/2669 KB   
11-Jun-2019 00:01:44 1608/2669 KB   
11-Jun-2019 00:01:44 1612/2669 KB   
11-Jun-2019 00:01:44 1616/2669 KB   
11-Jun-2019 00:01:44 1620/2669 KB   
11-Jun-2019 00:01:44 1624/2669 KB   
11-Jun-2019 00:01:44 1628/2669 KB   
11-Jun-2019 00:01:44 1632/2669 KB   
11-Jun-2019 00:01:44 1636/2669 KB   
11-Jun-2019 00:01:44 1640/2669 KB   
11-Jun-2019 00:01:44 1644/2669 KB   
11-Jun-2019 00:01:44 1648/2669 KB   
11-Jun-2019 00:01:44 1652/2669 KB   
11-Jun-2019 00:01:44 1656/2669 KB   
11-Jun-2019 00:01:44 1660/2669 KB   
11-Jun-2019 00:01:44 1664/2669 KB   
11-Jun-2019 00:01:44 1668/2669 KB   
11-Jun-2019 00:01:44 1672/2669 KB   
11-Jun-2019 00:01:44 1676/2669 KB   
11-Jun-2019 00:01:44 1680/2669 KB   
11-Jun-2019 00:01:44 1684/2669 KB   
11-Jun-2019 00:01:44 1688/2669 KB   
11-Jun-2019 00:01:44 1692/2669 KB   
11-Jun-2019 00:01:44 1696/2669 KB   
11-Jun-2019 00:01:44 1700/2669 KB   
11-Jun-2019 00:01:44 1704/2669 KB   
11-Jun-2019 00:01:44 1708/2669 KB   
11-Jun-2019 00:01:44 1712/2669 KB   
11-Jun-2019 00:01:44 1716/2669 KB   
11-Jun-2019 00:01:44 1720/2669 KB   
11-Jun-2019 00:01:44 1724/2669 KB   
11-Jun-2019 00:01:44 1728/2669 KB   
11-Jun-2019 00:01:44 1732/2669 KB   
11-Jun-2019 00:01:44 1736/2669 KB   
11-Jun-2019 00:01:44 1740/2669 KB   
11-Jun-2019 00:01:44 1744/2669 KB   
11-Jun-2019 00:01:44 1748/2669 KB   
11-Jun-2019 00:01:44 1752/2669 KB   
11-Jun-2019 00:01:44 1756/2669 KB   
11-Jun-2019 00:01:44 1760/2669 KB   
11-Jun-2019 00:01:44 1764/2669 KB   
11-Jun-2019 00:01:44 1768/2669 KB   
11-Jun-2019 00:01:44 1772/2669 KB   
11-Jun-2019 00:01:44 1776/2669 KB   
11-Jun-2019 00:01:44 1780/2669 KB   
11-Jun-2019 00:01:44 1784/2669 KB   
11-Jun-2019 00:01:44 1788/2669 KB   
11-Jun-2019 00:01:44 1792/2669 KB   
11-Jun-2019 00:01:44 1796/2669 KB   
11-Jun-2019 00:01:44 1800/2669 KB   
11-Jun-2019 00:01:44 1804/2669 KB   
11-Jun-2019 00:01:44 1808/2669 KB   
11-Jun-2019 00:01:44 1812/2669 KB   
11-Jun-2019 00:01:44 1816/2669 KB   
11-Jun-2019 00:01:44 1820/2669 KB   
11-Jun-2019 00:01:44 1824/2669 KB   
11-Jun-2019 00:01:44 1828/2669 KB   
11-Jun-2019 00:01:44 1832/2669 KB   
11-Jun-2019 00:01:44 1836/2669 KB   
11-Jun-2019 00:01:44 1840/2669 KB   
11-Jun-2019 00:01:44 1844/2669 KB   
11-Jun-2019 00:01:44 1848/2669 KB   
11-Jun-2019 00:01:44 1852/2669 KB   
11-Jun-2019 00:01:44 1856/2669 KB   
11-Jun-2019 00:01:44 1860/2669 KB   
11-Jun-2019 00:01:44 1864/2669 KB   
11-Jun-2019 00:01:44 1868/2669 KB   
11-Jun-2019 00:01:44 1872/2669 KB   
11-Jun-2019 00:01:44 1876/2669 KB   
11-Jun-2019 00:01:44 1880/2669 KB   
11-Jun-2019 00:01:44 1884/2669 KB   
11-Jun-2019 00:01:44 1888/2669 KB   
11-Jun-2019 00:01:44 1892/2669 KB   
11-Jun-2019 00:01:44 1896/2669 KB   
11-Jun-2019 00:01:44 1900/2669 KB   
11-Jun-2019 00:01:44 1904/2669 KB   
11-Jun-2019 00:01:44 1908/2669 KB   
11-Jun-2019 00:01:44 1912/2669 KB   
11-Jun-2019 00:01:44 1916/2669 KB   
11-Jun-2019 00:01:44 1920/2669 KB   
11-Jun-2019 00:01:44 1924/2669 KB   
11-Jun-2019 00:01:44 1928/2669 KB   
11-Jun-2019 00:01:44 1932/2669 KB   
11-Jun-2019 00:01:44 1936/2669 KB   
11-Jun-2019 00:01:44 1940/2669 KB   
11-Jun-2019 00:01:44 1944/2669 KB   
11-Jun-2019 00:01:44 1948/2669 KB   
11-Jun-2019 00:01:44 1952/2669 KB   
11-Jun-2019 00:01:44 1956/2669 KB   
11-Jun-2019 00:01:44 1960/2669 KB   
11-Jun-2019 00:01:44 1964/2669 KB   
11-Jun-2019 00:01:44 1968/2669 KB   
11-Jun-2019 00:01:44 1972/2669 KB   
11-Jun-2019 00:01:44 1976/2669 KB   
11-Jun-2019 00:01:44 1980/2669 KB   
11-Jun-2019 00:01:44 1984/2669 KB   
11-Jun-2019 00:01:44 1988/2669 KB   
11-Jun-2019 00:01:44 1992/2669 KB   
11-Jun-2019 00:01:44 1996/2669 KB   
11-Jun-2019 00:01:44 2000/2669 KB   
11-Jun-2019 00:01:44 2004/2669 KB   
11-Jun-2019 00:01:44 2008/2669 KB   
11-Jun-2019 00:01:44 2012/2669 KB   
11-Jun-2019 00:01:44 2016/2669 KB   
11-Jun-2019 00:01:44 2020/2669 KB   
11-Jun-2019 00:01:44 2024/2669 KB   
11-Jun-2019 00:01:44 2028/2669 KB   
11-Jun-2019 00:01:44 2032/2669 KB   
11-Jun-2019 00:01:44 2036/2669 KB   
11-Jun-2019 00:01:44 2040/2669 KB   
11-Jun-2019 00:01:44 2044/2669 KB   
11-Jun-2019 00:01:44 2048/2669 KB   
11-Jun-2019 00:01:44 2052/2669 KB   
11-Jun-2019 00:01:44 2056/2669 KB   
11-Jun-2019 00:01:44 2060/2669 KB   
11-Jun-2019 00:01:44 2064/2669 KB   
11-Jun-2019 00:01:44 2068/2669 KB   
11-Jun-2019 00:01:44 2072/2669 KB   
11-Jun-2019 00:01:44 2076/2669 KB   
11-Jun-2019 00:01:44 2080/2669 KB   
11-Jun-2019 00:01:44 2084/2669 KB   
11-Jun-2019 00:01:44 2088/2669 KB   
11-Jun-2019 00:01:44 2092/2669 KB   
11-Jun-2019 00:01:44 2096/2669 KB   
11-Jun-2019 00:01:44 2100/2669 KB   
11-Jun-2019 00:01:44 2104/2669 KB   
11-Jun-2019 00:01:44 2108/2669 KB   
11-Jun-2019 00:01:44 2112/2669 KB   
11-Jun-2019 00:01:44 2116/2669 KB   
11-Jun-2019 00:01:44 2120/2669 KB   
11-Jun-2019 00:01:44 2124/2669 KB   
11-Jun-2019 00:01:44 2128/2669 KB   
11-Jun-2019 00:01:44 2132/2669 KB   
11-Jun-2019 00:01:44 2136/2669 KB   
11-Jun-2019 00:01:44 2140/2669 KB   
11-Jun-2019 00:01:44 2144/2669 KB   
11-Jun-2019 00:01:44 2148/2669 KB   
11-Jun-2019 00:01:44 2152/2669 KB   
11-Jun-2019 00:01:44 2156/2669 KB   
11-Jun-2019 00:01:44 2160/2669 KB   
11-Jun-2019 00:01:44 2164/2669 KB   
11-Jun-2019 00:01:44 2168/2669 KB   
11-Jun-2019 00:01:44 2172/2669 KB   
11-Jun-2019 00:01:44 2176/2669 KB   
11-Jun-2019 00:01:44 2180/2669 KB   
11-Jun-2019 00:01:44 2184/2669 KB   
11-Jun-2019 00:01:44 2188/2669 KB   
11-Jun-2019 00:01:44 2192/2669 KB   
11-Jun-2019 00:01:44 2196/2669 KB   
11-Jun-2019 00:01:44 2200/2669 KB   
11-Jun-2019 00:01:44 2204/2669 KB   
11-Jun-2019 00:01:44 2208/2669 KB   
11-Jun-2019 00:01:44 2212/2669 KB   
11-Jun-2019 00:01:44 2216/2669 KB   
11-Jun-2019 00:01:44 2220/2669 KB   
11-Jun-2019 00:01:44 2224/2669 KB   
11-Jun-2019 00:01:44 2228/2669 KB   
11-Jun-2019 00:01:44 2232/2669 KB   
11-Jun-2019 00:01:44 2236/2669 KB   
11-Jun-2019 00:01:44 2240/2669 KB   
11-Jun-2019 00:01:44 2244/2669 KB   
11-Jun-2019 00:01:44 2248/2669 KB   
11-Jun-2019 00:01:44 2252/2669 KB   
11-Jun-2019 00:01:44 2256/2669 KB   
11-Jun-2019 00:01:44 2260/2669 KB   
11-Jun-2019 00:01:44 2264/2669 KB   
11-Jun-2019 00:01:44 2268/2669 KB   
11-Jun-2019 00:01:44 2272/2669 KB   
11-Jun-2019 00:01:44 2276/2669 KB   
11-Jun-2019 00:01:44 2280/2669 KB   
11-Jun-2019 00:01:44 2284/2669 KB   
11-Jun-2019 00:01:44 2288/2669 KB   
11-Jun-2019 00:01:44 2292/2669 KB   
11-Jun-2019 00:01:44 2296/2669 KB   
11-Jun-2019 00:01:44 2300/2669 KB   
11-Jun-2019 00:01:44 2304/2669 KB   
11-Jun-2019 00:01:44 2308/2669 KB   
11-Jun-2019 00:01:44 2312/2669 KB   
11-Jun-2019 00:01:44 2316/2669 KB   
11-Jun-2019 00:01:44 2320/2669 KB   
11-Jun-2019 00:01:44 2324/2669 KB   
11-Jun-2019 00:01:44 2328/2669 KB   
11-Jun-2019 00:01:44 2332/2669 KB   
11-Jun-2019 00:01:44 2336/2669 KB   
11-Jun-2019 00:01:44 2340/2669 KB   
11-Jun-2019 00:01:44 2344/2669 KB   
11-Jun-2019 00:01:44 2348/2669 KB   
11-Jun-2019 00:01:44 2352/2669 KB   
11-Jun-2019 00:01:44 2356/2669 KB   
11-Jun-2019 00:01:44 2360/2669 KB   
11-Jun-2019 00:01:44 2364/2669 KB   
11-Jun-2019 00:01:44 2368/2669 KB   
11-Jun-2019 00:01:44 2372/2669 KB   
11-Jun-2019 00:01:44 2376/2669 KB   
11-Jun-2019 00:01:44 2380/2669 KB   
11-Jun-2019 00:01:44 2384/2669 KB   
11-Jun-2019 00:01:44 2388/2669 KB   
11-Jun-2019 00:01:44 2392/2669 KB   
11-Jun-2019 00:01:44 2396/2669 KB   
11-Jun-2019 00:01:44 2400/2669 KB   
11-Jun-2019 00:01:44 2404/2669 KB   
11-Jun-2019 00:01:44 2408/2669 KB   
11-Jun-2019 00:01:44 2412/2669 KB   
11-Jun-2019 00:01:44 2416/2669 KB   
11-Jun-2019 00:01:44 2420/2669 KB   
11-Jun-2019 00:01:44 2424/2669 KB   
11-Jun-2019 00:01:44 2428/2669 KB   
11-Jun-2019 00:01:44 2432/2669 KB   
11-Jun-2019 00:01:44 2436/2669 KB   
11-Jun-2019 00:01:44 2440/2669 KB   
11-Jun-2019 00:01:44 2444/2669 KB   
11-Jun-2019 00:01:44 2448/2669 KB   
11-Jun-2019 00:01:44 2452/2669 KB   
11-Jun-2019 00:01:44 2456/2669 KB   
11-Jun-2019 00:01:44 2460/2669 KB   
11-Jun-2019 00:01:44 2464/2669 KB   
11-Jun-2019 00:01:44 2468/2669 KB   
11-Jun-2019 00:01:44 2472/2669 KB   
11-Jun-2019 00:01:44 2476/2669 KB   
11-Jun-2019 00:01:44 2480/2669 KB   
11-Jun-2019 00:01:44 2484/2669 KB   
11-Jun-2019 00:01:44 2488/2669 KB   
11-Jun-2019 00:01:44 2492/2669 KB   
11-Jun-2019 00:01:44 2496/2669 KB   
11-Jun-2019 00:01:44 2500/2669 KB   
11-Jun-2019 00:01:44 2504/2669 KB   
11-Jun-2019 00:01:44 2508/2669 KB   
11-Jun-2019 00:01:44 2512/2669 KB   
11-Jun-2019 00:01:44 2516/2669 KB   
11-Jun-2019 00:01:44 2520/2669 KB   
11-Jun-2019 00:01:44 2524/2669 KB   
11-Jun-2019 00:01:44 2528/2669 KB   
11-Jun-2019 00:01:44 2532/2669 KB   
11-Jun-2019 00:01:44 2536/2669 KB   
11-Jun-2019 00:01:44 2540/2669 KB   
11-Jun-2019 00:01:44 2544/2669 KB   
11-Jun-2019 00:01:44 2548/2669 KB   
11-Jun-2019 00:01:44 2552/2669 KB   
11-Jun-2019 00:01:44 2556/2669 KB   
11-Jun-2019 00:01:44 2560/2669 KB   
11-Jun-2019 00:01:44 2564/2669 KB   
11-Jun-2019 00:01:44 2568/2669 KB   
11-Jun-2019 00:01:44 2569/2669 KB   
11-Jun-2019 00:01:44 2573/2669 KB   
11-Jun-2019 00:01:44 2577/2669 KB   
11-Jun-2019 00:01:44 2581/2669 KB   
11-Jun-2019 00:01:44 2585/2669 KB   
11-Jun-2019 00:01:44 2589/2669 KB   
11-Jun-2019 00:01:44 2593/2669 KB   
11-Jun-2019 00:01:44 2597/2669 KB   
11-Jun-2019 00:01:44 2601/2669 KB   
11-Jun-2019 00:01:44 2605/2669 KB   
11-Jun-2019 00:01:44 2609/2669 KB   
11-Jun-2019 00:01:44 2613/2669 KB   
11-Jun-2019 00:01:44 2617/2669 KB   
11-Jun-2019 00:01:44 2621/2669 KB   
11-Jun-2019 00:01:44 2625/2669 KB   
11-Jun-2019 00:01:44 2629/2669 KB   
11-Jun-2019 00:01:44 2633/2669 KB   
11-Jun-2019 00:01:44 2637/2669 KB   
11-Jun-2019 00:01:44 2641/2669 KB   
11-Jun-2019 00:01:44 2645/2669 KB   
11-Jun-2019 00:01:44 2649/2669 KB   
11-Jun-2019 00:01:44 2653/2669 KB   
11-Jun-2019 00:01:44 2657/2669 KB   
11-Jun-2019 00:01:44 2661/2669 KB   
11-Jun-2019 00:01:44 2665/2669 KB   
11-Jun-2019 00:01:44 2669/2669 KB   
11-Jun-2019 00:01:44                
11-Jun-2019 00:01:44 Downloaded: https://repo.maven.apache.org/maven2/org/bouncycastle/bcprov-jdk15on/1.50/bcprov-jdk15on-1.50.jar (2669 KB at 13971.9 KB/sec)
11-Jun-2019 00:01:44 [INFO]
11-Jun-2019 00:01:44 [INFO] --- maven-clean-plugin:2.5:clean (default-clean) @ spring-security-oauth2 ---
11-Jun-2019 00:01:44 [INFO]
11-Jun-2019 00:01:44 [INFO] --- maven-resources-plugin:2.6:resources (default-resources) @ spring-security-oauth2 ---
11-Jun-2019 00:01:44 [INFO] Using 'UTF-8' encoding to copy filtered resources.
11-Jun-2019 00:01:44 [INFO] Copying 4 resources
11-Jun-2019 00:01:44 [INFO]
11-Jun-2019 00:01:44 [INFO] --- maven-compiler-plugin:2.3.2:compile (default-compile) @ spring-security-oauth2 ---
11-Jun-2019 00:01:44 [INFO] Compiling 249 source files to /opt/bamboo-home/xml-data/build-dir/SECOAUTH-NIGHTLY-JOB1/spring-security-oauth2/target/classes
11-Jun-2019 00:01:47 [INFO]
11-Jun-2019 00:01:47 [INFO] --- maven-resources-plugin:2.6:testResources (default-testResources) @ spring-security-oauth2 ---
11-Jun-2019 00:01:47 [INFO] Using 'UTF-8' encoding to copy filtered resources.
11-Jun-2019 00:01:47 [INFO] Copying 21 resources
11-Jun-2019 00:01:47 [INFO]
11-Jun-2019 00:01:47 [INFO] --- maven-compiler-plugin:2.3.2:testCompile (default-testCompile) @ spring-security-oauth2 ---
11-Jun-2019 00:01:47 [INFO] Compiling 120 source files to /opt/bamboo-home/xml-data/build-dir/SECOAUTH-NIGHTLY-JOB1/spring-security-oauth2/target/test-classes
11-Jun-2019 00:01:49 [INFO]
11-Jun-2019 00:01:49 [INFO] --- maven-surefire-plugin:2.12.4:test (default-test) @ spring-security-oauth2 ---
11-Jun-2019 00:01:49 [INFO] Surefire report directory: /opt/bamboo-home/xml-data/build-dir/SECOAUTH-NIGHTLY-JOB1/spring-security-oauth2/target/surefire-reports
11-Jun-2019 00:01:49
11-Jun-2019 00:01:49 -------------------------------------------------------
11-Jun-2019 00:01:49 T E S T S
11-Jun-2019 00:01:49 -------------------------------------------------------
11-Jun-2019 00:01:49 Running org.springframework.security.oauth2.config.annotation.TokenServicesMultipleBeansTests
11-Jun-2019 00:01:51 Tests run: 1, Failures: 0, Errors: 0, Skipped: 0, Time elapsed: 1.436 sec
11-Jun-2019 00:01:51 Running org.springframework.security.oauth2.config.annotation.Gh501EnableAuthorizationServerTests
11-Jun-2019 00:01:52 Tests run: 1, Failures: 0, Errors: 0, Skipped: 0, Time elapsed: 0.667 sec
11-Jun-2019 00:01:52 Running org.springframework.security.oauth2.config.annotation.ClientConfigurationTests
11-Jun-2019 00:01:52 Tests run: 1, Failures: 0, Errors: 0, Skipped: 0, Time elapsed: 0.234 sec
11-Jun-2019 00:01:52 Running org.springframework.security.oauth2.config.annotation.ResourceServerConfigurationTests
11-Jun-2019 00:01:52 [WARN] TokenEndpoint - Handling error: InvalidRequestException, Missing grant type
11-Jun-2019 00:01:53 [WARN] PageNotFound - No mapping found for HTTP request with URI [/] in DispatcherServlet with name ''
11-Jun-2019 00:01:53 [WARN] PageNotFound - No mapping found for HTTP request with URI [/] in DispatcherServlet with name ''
11-Jun-2019 00:01:53 [WARN] PageNotFound - No mapping found for HTTP request with URI [/] in DispatcherServlet with name ''
11-Jun-2019 00:01:53 [WARN] PageNotFound - No mapping found for HTTP request with URI [/] in DispatcherServlet with name ''
11-Jun-2019 00:01:53 [WARN] TokenEndpoint - Handling error: InvalidRequestException, Missing grant type
11-Jun-2019 00:01:53 Tests run: 9, Failures: 0, Errors: 0, Skipped: 0, Time elapsed: 1.559 sec
11-Jun-2019 00:01:53 Running org.springframework.security.oauth2.config.annotation.AuthorizationServerConfigurationTests
11-Jun-2019 00:01:53 [WARN] AnnotationConfigWebApplicationContext - Exception encountered during context initialization - cancelling refresh attempt: org.springframework.beans.factory.UnsatisfiedDependencyException: Error creating bean with name 'org.springframework.security.config.annotation.web.configuration.WebSecurityConfiguration': Unsatisfied dependency expressed through method 'setFilterChainProxySecurityConfigurer' parameter 1; nested exception is org.springframework.beans.factory.BeanExpressionException: Expression parsing failed; nested exception is org.springframework.beans.factory.UnsatisfiedDependencyException: Error creating bean with name 'org.springframework.security.oauth2.config.annotation.web.configuration.AuthorizationServerSecurityConfiguration': Unsatisfied dependency expressed through field 'configurers'; nested exception is org.springframework.beans.factory.NoSuchBeanDefinitionException: No qualifying bean of type 'java.util.List<org.springframework.security.oauth2.config.annotation.web.configuration.AuthorizationServerConfigurer>' available: expected at least 1 bean which qualifies as autowire candidate. Dependency annotations: {@org.springframework.beans.factory.annotation.Autowired(required=true)}
11-Jun-2019 00:01:54 [WARN] JwtAccessTokenConverter - Unable to create an RSA verifier from verifierKey (ignoreable if using MAC)
11-Jun-2019 00:01:55 [WARN] AnnotationConfigWebApplicationContext - Exception encountered during context initialization - cancelling refresh attempt: org.springframework.beans.factory.UnsatisfiedDependencyException: Error creating bean with name 'authorizationServerConfigurationTests.AuthorizationServerTypes': Unsatisfied dependency expressed through field 'tokenServices'; nested exception is org.springframework.beans.factory.BeanCreationException: Error creating bean with name 'org.springframework.security.oauth2.config.annotation.web.configuration.AuthorizationServerEndpointsConfiguration': Invocation of init method failed; nested exception is java.lang.AssertionError
11-Jun-2019 00:01:56 Tests run: 20, Failures: 0, Errors: 0, Skipped: 0, Time elapsed: 2.192 sec
11-Jun-2019 00:01:56 Running org.springframework.security.oauth2.config.annotation.Gh808EnableAuthorizationServerTests
11-Jun-2019 00:01:56 Tests run: 2, Failures: 0, Errors: 0, Skipped: 0, Time elapsed: 0.155 sec
11-Jun-2019 00:01:56 Running org.springframework.security.oauth2.config.xml.ResourceServerBeanDefinitionParserTests
11-Jun-2019 00:01:56 Tests run: 2, Failures: 0, Errors: 0, Skipped: 0, Time elapsed: 0.187 sec
11-Jun-2019 00:01:56 Running org.springframework.security.oauth2.config.xml.AuthorizationServerInvalidParserTests
11-Jun-2019 00:01:56 Tests run: 1, Failures: 0, Errors: 0, Skipped: 0, Time elapsed: 0.029 sec
11-Jun-2019 00:01:56 Running org.springframework.security.oauth2.config.xml.AuthorizationServerBeanDefinitionParserTests
11-Jun-2019 00:01:56 Tests run: 12, Failures: 0, Errors: 0, Skipped: 0, Time elapsed: 0.484 sec
11-Jun-2019 00:01:56 Running org.springframework.security.oauth2.config.xml.ClientDetailsServiceBeanDefinitionParserTests
11-Jun-2019 00:01:56 Tests run: 3, Failures: 0, Errors: 0, Skipped: 0, Time elapsed: 0.036 sec
11-Jun-2019 00:01:56 Running org.springframework.security.oauth2.config.xml.ResourceBeanDefinitionParserTests
11-Jun-2019 00:01:56 Tests run: 7, Failures: 0, Errors: 0, Skipped: 0, Time elapsed: 0.066 sec
11-Jun-2019 00:01:56 Running org.springframework.security.oauth2.config.xml.InvalidResourceBeanDefinitionParserTests
11-Jun-2019 00:01:57 Tests run: 5, Failures: 0, Errors: 0, Skipped: 0, Time elapsed: 0.056 sec
11-Jun-2019 00:01:57 Running org.springframework.security.oauth2.config.xml.AuthorizationServerCustomGrantParserTests
11-Jun-2019 00:01:57 Tests run: 1, Failures: 0, Errors: 0, Skipped: 0, Time elapsed: 0.021 sec
11-Jun-2019 00:01:57 Running org.springframework.security.oauth2.config.xml.AuthorizationServerClientCredentialsPasswordInvalidXmlTests
11-Jun-2019 00:01:57 Tests run: 2, Failures: 0, Errors: 0, Skipped: 0, Time elapsed: 0.327 sec
11-Jun-2019 00:01:57 Running org.springframework.security.oauth2.config.xml.AuthorizationServerClientCredentialsPasswordValidXmlTests
11-Jun-2019 00:01:57 Tests run: 2, Failures: 0, Errors: 0, Skipped: 0, Time elapsed: 0.204 sec
11-Jun-2019 00:01:57 Running org.springframework.security.oauth2.http.converter.jaxb.JaxbOAuth2ExceptionMessageConverterTests
11-Jun-2019 00:01:59 Tests run: 22, Failures: 0, Errors: 0, Skipped: 0, Time elapsed: 1.428 sec
11-Jun-2019 00:01:59 Running org.springframework.security.oauth2.http.converter.jaxb.JaxbOAuth2AccessTokenMessageConverterTests
11-Jun-2019 00:01:59 Tests run: 8, Failures: 0, Errors: 0, Skipped: 0, Time elapsed: 0.845 sec
11-Jun-2019 00:01:59 Running org.springframework.security.oauth2.client.http.OAuth2ErrorHandlerTests
11-Jun-2019 00:01:59 Tests run: 12, Failures: 0, Errors: 0, Skipped: 0, Time elapsed: 0.058 sec
11-Jun-2019 00:01:59 Running org.springframework.security.oauth2.client.DefaultOAuth2RequestAuthenticatorTests
11-Jun-2019 00:01:59 Tests run: 6, Failures: 0, Errors: 0, Skipped: 0, Time elapsed: 0.002 sec
11-Jun-2019 00:01:59 Running org.springframework.security.oauth2.client.token.grant.password.ResourceOwnerPasswordAccessTokenProviderTests
11-Jun-2019 00:01:59 Tests run: 3, Failures: 0, Errors: 0, Skipped: 0, Time elapsed: 0.001 sec
11-Jun-2019 00:01:59 Running org.springframework.security.oauth2.client.token.grant.implicit.ImplicitAccessTokenProviderTests
11-Jun-2019 00:01:59 Tests run: 2, Failures: 0, Errors: 0, Skipped: 0, Time elapsed: 0 sec
11-Jun-2019 00:01:59 Running org.springframework.security.oauth2.client.token.grant.code.AuthorizationCodeAccessTokenProviderWithConversionTests
11-Jun-2019 00:02:00 Tests run: 4, Failures: 0, Errors: 0, Skipped: 0, Time elapsed: 0.126 sec
11-Jun-2019 00:02:00 Running org.springframework.security.oauth2.client.token.grant.code.AuthorizationCodeAccessTokenProviderTests
11-Jun-2019 00:02:00 Tests run: 5, Failures: 0, Errors: 0, Skipped: 0, Time elapsed: 0.003 sec
11-Jun-2019 00:02:00 Running org.springframework.security.oauth2.client.token.grant.code.AuthorizationCodeResourceDetailsTests
11-Jun-2019 00:02:00 Tests run: 2, Failures: 0, Errors: 0, Skipped: 0, Time elapsed: 0.001 sec
11-Jun-2019 00:02:00 Running org.springframework.security.oauth2.client.token.JdbcClientTokenServicesTests
11-Jun-2019 00:02:00 Tests run: 3, Failures: 0, Errors: 0, Skipped: 0, Time elapsed: 0.322 sec
11-Jun-2019 00:02:00 Running org.springframework.security.oauth2.client.token.OAuth2AccessTokenSupportTests
11-Jun-2019 00:02:00 Tests run: 5, Failures: 0, Errors: 0, Skipped: 0, Time elapsed: 0.026 sec
11-Jun-2019 00:02:00 Running org.springframework.security.oauth2.client.token.AccessTokenProviderChainTests
11-Jun-2019 00:02:00 Tests run: 15, Failures: 0, Errors: 0, Skipped: 0, Time elapsed: 0.03 sec
11-Jun-2019 00:02:00 Running org.springframework.security.oauth2.client.filter.OAuth2ClientContextFilterTests
11-Jun-2019 00:02:00 Tests run: 11, Failures: 0, Errors: 0, Skipped: 0, Time elapsed: 0.008 sec
11-Jun-2019 00:02:00 Running org.springframework.security.oauth2.client.filter.OAuth2ClientAuthenticationProcessingFilterTests
11-Jun-2019 00:02:00 Tests run: 5, Failures: 0, Errors: 0, Skipped: 0, Time elapsed: 0.017 sec
11-Jun-2019 00:02:00 Running org.springframework.security.oauth2.client.OAuth2RestTemplateTests
11-Jun-2019 00:02:00 Tests run: 12, Failures: 0, Errors: 0, Skipped: 0, Time elapsed: 0.194 sec
11-Jun-2019 00:02:00 Running org.springframework.security.oauth2.provider.request.DefaultAuthorizationRequestFactoryTests
11-Jun-2019 00:02:00 Tests run: 9, Failures: 0, Errors: 0, Skipped: 0, Time elapsed: 0.003 sec
11-Jun-2019 00:02:00 Running org.springframework.security.oauth2.provider.request.DefaultOAuth2RequestValidatorTests
11-Jun-2019 00:02:00 Tests run: 3, Failures: 0, Errors: 0, Skipped: 0, Time elapsed: 0.001 sec
11-Jun-2019 00:02:00 Running org.springframework.security.oauth2.provider.password.ResourceOwnerPasswordTokenGranterTests
11-Jun-2019 00:02:00 Tests run: 7, Failures: 0, Errors: 0, Skipped: 0, Time elapsed: 0.004 sec
11-Jun-2019 00:02:00 Running org.springframework.security.oauth2.provider.client.BaseClientDetailsTests
11-Jun-2019 00:02:00 Tests run: 11, Failures: 0, Errors: 0, Skipped: 0, Time elapsed: 0.046 sec
11-Jun-2019 00:02:00 Running org.springframework.security.oauth2.provider.client.JdbcClientDetailsServiceTests
11-Jun-2019 00:02:00 Tests run: 14, Failures: 0, Errors: 0, Skipped: 0, Time elapsed: 0.268 sec
11-Jun-2019 00:02:01 Running org.springframework.security.oauth2.provider.client.ClientCredentialsTokenEndpointFilterTests
11-Jun-2019 00:02:01 Tests run: 3, Failures: 0, Errors: 0, Skipped: 0, Time elapsed: 0.02 sec
11-Jun-2019 00:02:01 Running org.springframework.security.oauth2.provider.client.ClientDetailsUserDetailsServiceTests
11-Jun-2019 00:02:01 Tests run: 2, Failures: 0, Errors: 0, Skipped: 0, Time elapsed: 0.005 sec
11-Jun-2019 00:02:01 Running org.springframework.security.oauth2.provider.approval.ApprovalStoreUserApprovalHandlerTests
11-Jun-2019 00:02:01 Tests run: 10, Failures: 0, Errors: 0, Skipped: 0, Time elapsed: 0.004 sec
11-Jun-2019 00:02:01 Running org.springframework.security.oauth2.provider.approval.DefaultUserApprovalHandlerTests
11-Jun-2019 00:02:01 Tests run: 1, Failures: 0, Errors: 0, Skipped: 0, Time elapsed: 0 sec
11-Jun-2019 00:02:01 Running org.springframework.security.oauth2.provider.approval.TokenStoreUserApprovalHandlerTests
11-Jun-2019 00:02:01 Tests run: 3, Failures: 0, Errors: 0, Skipped: 0, Time elapsed: 0.002 sec
11-Jun-2019 00:02:01 Running org.springframework.security.oauth2.provider.approval.JdbcApprovalStoreTests
11-Jun-2019 00:02:01 Tests run: 6, Failures: 0, Errors: 0, Skipped: 0, Time elapsed: 0.071 sec
11-Jun-2019 00:02:01 Running org.springframework.security.oauth2.provider.approval.InMemoryApprovalStoreTests
11-Jun-2019 00:02:01 Tests run: 5, Failures: 0, Errors: 0, Skipped: 0, Time elapsed: 0.001 sec
11-Jun-2019 00:02:01 Running org.springframework.security.oauth2.provider.approval.TokenApprovalStoreTests
11-Jun-2019 00:02:01 Tests run: 5, Failures: 0, Errors: 0, Skipped: 0, Time elapsed: 0.003 sec
11-Jun-2019 00:02:01 Running org.springframework.security.oauth2.provider.vote.ClientScopeVoterTests
11-Jun-2019 00:02:01 Tests run: 3, Failures: 0, Errors: 0, Skipped: 0, Time elapsed: 0.002 sec
11-Jun-2019 00:02:01 Running org.springframework.security.oauth2.provider.vote.ScopeVoterTests
11-Jun-2019 00:02:01 Tests run: 6, Failures: 0, Errors: 0, Skipped: 0, Time elapsed: 0.002 sec
11-Jun-2019 00:02:01 Running org.springframework.security.oauth2.provider.test.OAuth2RequestTests
11-Jun-2019 00:02:01 Tests run: 4, Failures: 0, Errors: 0, Skipped: 0, Time elapsed: 0.001 sec
11-Jun-2019 00:02:01 Running org.springframework.security.oauth2.provider.token.DefaultTokenServicesWithJdbcTests
11-Jun-2019 00:02:01 Tests run: 19, Failures: 0, Errors: 0, Skipped: 0, Time elapsed: 0.376 sec
11-Jun-2019 00:02:01 Running org.springframework.security.oauth2.provider.token.store.JwtAccessTokenConverterTests
11-Jun-2019 00:02:01 [WARN] JwtAccessTokenConverter - Unable to create an RSA verifier from verifierKey (ignoreable if using MAC)
11-Jun-2019 00:02:01 [WARN] JwtAccessTokenConverter - Unable to create an RSA verifier from verifierKey (ignoreable if using MAC)
11-Jun-2019 00:02:01 [WARN] JwtAccessTokenConverter - Unable to create an RSA verifier from verifierKey (ignoreable if using MAC)
11-Jun-2019 00:02:01 Tests run: 14, Failures: 0, Errors: 0, Skipped: 0, Time elapsed: 0.171 sec
11-Jun-2019 00:02:01 Running org.springframework.security.oauth2.provider.token.store.InMemoryTokenStoreTests
11-Jun-2019 00:02:01 Tests run: 16, Failures: 0, Errors: 0, Skipped: 0, Time elapsed: 0.01 sec
11-Jun-2019 00:02:01 Running org.springframework.security.oauth2.provider.token.store.JwtTokenStoreTests
11-Jun-2019 00:02:01 [WARN] JwtAccessTokenConverter - Unable to create an RSA verifier from verifierKey (ignoreable if using MAC)
11-Jun-2019 00:02:01 [WARN] JwtAccessTokenConverter - Unable to create an RSA verifier from verifierKey (ignoreable if using MAC)
11-Jun-2019 00:02:01 [WARN] JwtAccessTokenConverter - Unable to create an RSA verifier from verifierKey (ignoreable if using MAC)
11-Jun-2019 00:02:01 [WARN] JwtAccessTokenConverter - Unable to create an RSA verifier from verifierKey (ignoreable if using MAC)
11-Jun-2019 00:02:01 [WARN] JwtAccessTokenConverter - Unable to create an RSA verifier from verifierKey (ignoreable if using MAC)
11-Jun-2019 00:02:01 [WARN] JwtAccessTokenConverter - Unable to create an RSA verifier from verifierKey (ignoreable if using MAC)
11-Jun-2019 00:02:01 [WARN] JwtAccessTokenConverter - Unable to create an RSA verifier from verifierKey (ignoreable if using MAC)
11-Jun-2019 00:02:01 [WARN] JwtAccessTokenConverter - Unable to create an RSA verifier from verifierKey (ignoreable if using MAC)
11-Jun-2019 00:02:01 [WARN] JwtAccessTokenConverter - Unable to create an RSA verifier from verifierKey (ignoreable if using MAC)
11-Jun-2019 00:02:01 [WARN] JwtAccessTokenConverter - Unable to create an RSA verifier from verifierKey (ignoreable if using MAC)
11-Jun-2019 00:02:01 [WARN] JwtAccessTokenConverter - Unable to create an RSA verifier from verifierKey (ignoreable if using MAC)
11-Jun-2019 00:02:01 [WARN] JwtAccessTokenConverter - Unable to create an RSA verifier from verifierKey (ignoreable if using MAC)
11-Jun-2019 00:02:01 [WARN] JwtAccessTokenConverter - Unable to create an RSA verifier from verifierKey (ignoreable if using MAC)
11-Jun-2019 00:02:01 [WARN] JwtAccessTokenConverter - Unable to create an RSA verifier from verifierKey (ignoreable if using MAC)
11-Jun-2019 00:02:01 [WARN] JwtAccessTokenConverter - Unable to create an RSA verifier from verifierKey (ignoreable if using MAC)
11-Jun-2019 00:02:01 [WARN] JwtAccessTokenConverter - Unable to create an RSA verifier from verifierKey (ignoreable if using MAC)
11-Jun-2019 00:02:01 [WARN] JwtAccessTokenConverter - Unable to create an RSA verifier from verifierKey (ignoreable if using MAC)
11-Jun-2019 00:02:01 [WARN] JwtAccessTokenConverter - Unable to create an RSA verifier from verifierKey (ignoreable if using MAC)
11-Jun-2019 00:02:01 Tests run: 18, Failures: 0, Errors: 0, Skipped: 0, Time elapsed: 0.034 sec
11-Jun-2019 00:02:01 Running org.springframework.security.oauth2.provider.token.store.redis.RedisTokenStorePrefixTests
11-Jun-2019 00:02:04 Tests run: 15, Failures: 0, Errors: 0, Skipped: 0, Time elapsed: 3.112 sec
11-Jun-2019 00:02:04 Running org.springframework.security.oauth2.provider.token.store.redis.RedisTokenStoreMockTests
11-Jun-2019 00:02:04 Tests run: 2, Failures: 0, Errors: 0, Skipped: 0, Time elapsed: 0.064 sec
11-Jun-2019 00:02:04 Running org.springframework.security.oauth2.provider.token.store.redis.RedisTokenStoreTests
11-Jun-2019 00:02:07 Tests run: 16, Failures: 0, Errors: 0, Skipped: 0, Time elapsed: 3.053 sec
11-Jun-2019 00:02:07 Running org.springframework.security.oauth2.provider.token.store.JdbcTokenStoreTests
11-Jun-2019 00:02:08 Tests run: 14, Failures: 0, Errors: 0, Skipped: 0, Time elapsed: 0.167 sec
11-Jun-2019 00:02:08 Running org.springframework.security.oauth2.provider.token.DefaultTokenServicesAuthoritiesChangeTests
11-Jun-2019 00:02:08 Tests run: 1, Failures: 0, Errors: 0, Skipped: 0, Time elapsed: 0.001 sec
11-Jun-2019 00:02:08 Running org.springframework.security.oauth2.provider.token.DefaultUserAuthenticationConverterTests
11-Jun-2019 00:02:08 Tests run: 3, Failures: 0, Errors: 0, Skipped: 0, Time elapsed: 0.003 sec
11-Jun-2019 00:02:08 Running org.springframework.security.oauth2.provider.token.TokenServicesWithTokenEnhancerTests
11-Jun-2019 00:02:08 [WARN] JwtAccessTokenConverter - Unable to create an RSA verifier from verifierKey (ignoreable if using MAC)
11-Jun-2019 00:02:08 [WARN] JwtAccessTokenConverter - Unable to create an RSA verifier from verifierKey (ignoreable if using MAC)
11-Jun-2019 00:02:08 [WARN] JwtAccessTokenConverter - Unable to create an RSA verifier from verifierKey (ignoreable if using MAC)
11-Jun-2019 00:02:08 [WARN] JwtAccessTokenConverter - Unable to create an RSA verifier from verifierKey (ignoreable if using MAC)
11-Jun-2019 00:02:08 [WARN] JwtAccessTokenConverter - Unable to create an RSA verifier from verifierKey (ignoreable if using MAC)
11-Jun-2019 00:02:08 Tests run: 5, Failures: 0, Errors: 0, Skipped: 0, Time elapsed: 0.015 sec
11-Jun-2019 00:02:08 Running org.springframework.security.oauth2.provider.token.DefaultTokenServicesWithJwtTests
11-Jun-2019 00:02:08 [WARN] JwtAccessTokenConverter - Unable to create an RSA verifier from verifierKey (ignoreable if using MAC)
11-Jun-2019 00:02:08 [WARN] JwtAccessTokenConverter - Unable to create an RSA verifier from verifierKey (ignoreable if using MAC)
11-Jun-2019 00:02:08 [WARN] JwtAccessTokenConverter - Unable to create an RSA verifier from verifierKey (ignoreable if using MAC)
11-Jun-2019 00:02:08 [WARN] JwtAccessTokenConverter - Unable to create an RSA verifier from verifierKey (ignoreable if using MAC)
11-Jun-2019 00:02:08 [WARN] JwtAccessTokenConverter - Unable to create an RSA verifier from verifierKey (ignoreable if using MAC)
11-Jun-2019 00:02:08 [WARN] JwtAccessTokenConverter - Unable to create an RSA verifier from verifierKey (ignoreable if using MAC)
11-Jun-2019 00:02:08 [WARN] JwtAccessTokenConverter - Unable to create an RSA verifier from verifierKey (ignoreable if using MAC)
11-Jun-2019 00:02:08 [WARN] JwtAccessTokenConverter - Unable to create an RSA verifier from verifierKey (ignoreable if using MAC)
11-Jun-2019 00:02:08 [WARN] JwtAccessTokenConverter - Unable to create an RSA verifier from verifierKey (ignoreable if using MAC)
11-Jun-2019 00:02:08 [WARN] JwtAccessTokenConverter - Unable to create an RSA verifier from verifierKey (ignoreable if using MAC)
11-Jun-2019 00:02:08 [WARN] JwtAccessTokenConverter - Unable to create an RSA verifier from verifierKey (ignoreable if using MAC)
11-Jun-2019 00:02:08 [WARN] JwtAccessTokenConverter - Unable to create an RSA verifier from verifierKey (ignoreable if using MAC)
11-Jun-2019 00:02:08 [WARN] JwtAccessTokenConverter - Unable to create an RSA verifier from verifierKey (ignoreable if using MAC)
11-Jun-2019 00:02:08 [WARN] JwtAccessTokenConverter - Unable to create an RSA verifier from verifierKey (ignoreable if using MAC)
11-Jun-2019 00:02:08 [WARN] JwtAccessTokenConverter - Unable to create an RSA verifier from verifierKey (ignoreable if using MAC)
11-Jun-2019 00:02:08 Tests run: 15, Failures: 0, Errors: 0, Skipped: 0, Time elapsed: 0.038 sec
11-Jun-2019 00:02:08 Running org.springframework.security.oauth2.provider.token.DefaultTokenServicesTests
11-Jun-2019 00:02:08 Tests run: 1, Failures: 0, Errors: 0, Skipped: 0, Time elapsed: 0.004 sec
11-Jun-2019 00:02:08 Running org.springframework.security.oauth2.provider.token.DefaultTokenServicesWithInMemoryTests
11-Jun-2019 00:02:08 Tests run: 25, Failures: 0, Errors: 0, Skipped: 0, Time elapsed: 0.018 sec
11-Jun-2019 00:02:08 Running org.springframework.security.oauth2.provider.token.DefaultAccessTokenConverterTests
11-Jun-2019 00:02:08 Tests run: 15, Failures: 0, Errors: 0, Skipped: 0, Time elapsed: 0.003 sec
11-Jun-2019 00:02:08 Running org.springframework.security.oauth2.provider.implicit.InMemoryImplicitGrantServiceTests
11-Jun-2019 00:02:08 Tests run: 2, Failures: 0, Errors: 0, Skipped: 0, Time elapsed: 0 sec
11-Jun-2019 00:02:08 Running org.springframework.security.oauth2.provider.error.DefaultWebResponseExceptionTranslatorTests
11-Jun-2019 00:02:08 Tests run: 1, Failures: 0, Errors: 0, Skipped: 0, Time elapsed: 0 sec
11-Jun-2019 00:02:08 Running org.springframework.security.oauth2.provider.error.OAuth2AuthenticationEntryPointTests
11-Jun-2019 00:02:08 [WARN] DefaultHandlerExceptionResolver - Resolved exception caused by handler execution: org.springframework.web.HttpMediaTypeNotAcceptableException: Could not find acceptable representation
11-Jun-2019 00:02:08 Tests run: 7, Failures: 0, Errors: 0, Skipped: 0, Time elapsed: 0.034 sec
11-Jun-2019 00:02:08 Running org.springframework.security.oauth2.provider.error.OAuth2AccessDeniedHandlerTests
11-Jun-2019 00:02:08 Tests run: 1, Failures: 0, Errors: 0, Skipped: 0, Time elapsed: 0.004 sec
11-Jun-2019 00:02:08 Running org.springframework.security.oauth2.provider.authentication.OAuth2AuthenticationProcessingFilterTests
11-Jun-2019 00:02:08 Tests run: 8, Failures: 0, Errors: 0, Skipped: 0, Time elapsed: 0.04 sec
11-Jun-2019 00:02:08 Running org.springframework.security.oauth2.provider.authentication.OAuth2AuthenticationDetailsTests
11-Jun-2019 00:02:08 Tests run: 1, Failures: 0, Errors: 0, Skipped: 0, Time elapsed: 0.001 sec
11-Jun-2019 00:02:08 Running org.springframework.security.oauth2.provider.authentication.OAuth2AuthenticationManagerTests
11-Jun-2019 00:02:08 Tests run: 3, Failures: 0, Errors: 0, Skipped: 0, Time elapsed: 0.001 sec
11-Jun-2019 00:02:08 Running org.springframework.security.oauth2.provider.endpoint.FrameworkEndpointHandlerMappingTests
11-Jun-2019 00:02:08 Tests run: 4, Failures: 0, Errors: 0, Skipped: 0, Time elapsed: 0.001 sec
11-Jun-2019 00:02:08 Running org.springframework.security.oauth2.provider.endpoint.WhitelabelApprovalEndpointTests
11-Jun-2019 00:02:08 Tests run: 6, Failures: 0, Errors: 0, Skipped: 0, Time elapsed: 0.003 sec
11-Jun-2019 00:02:08 Running org.springframework.security.oauth2.provider.endpoint.ExactMatchRedirectResolverTests
11-Jun-2019 00:02:08 Tests run: 3, Failures: 0, Errors: 0, Skipped: 0, Time elapsed: 0.001 sec
11-Jun-2019 00:02:08 Running org.springframework.security.oauth2.provider.endpoint.AuthorizationEndpointTests
11-Jun-2019 00:02:08 Tests run: 34, Failures: 0, Errors: 0, Skipped: 0, Time elapsed: 0.022 sec
11-Jun-2019 00:02:08 Running org.springframework.security.oauth2.provider.endpoint.TokenEndpointTests
11-Jun-2019 00:02:08 Tests run: 6, Failures: 0, Errors: 0, Skipped: 0, Time elapsed: 0.01 sec
11-Jun-2019 00:02:08 Running org.springframework.security.oauth2.provider.endpoint.DefaultRedirectResolverTests
11-Jun-2019 00:02:08 Tests run: 31, Failures: 0, Errors: 0, Skipped: 0, Time elapsed: 0.01 sec
11-Jun-2019 00:02:08 Running org.springframework.security.oauth2.provider.endpoint.WhitelabelErrorEndpointTests
11-Jun-2019 00:02:08 Tests run: 3, Failures: 0, Errors: 0, Skipped: 0, Time elapsed: 0.001 sec
11-Jun-2019 00:02:08 Running org.springframework.security.oauth2.provider.endpoint.TokenEndpointAuthenticationFilterTests
11-Jun-2019 00:02:08 Tests run: 3, Failures: 0, Errors: 0, Skipped: 0, Time elapsed: 0.015 sec
11-Jun-2019 00:02:08 Running org.springframework.security.oauth2.provider.AuthorizationRequestTests
11-Jun-2019 00:02:08 Tests run: 9, Failures: 0, Errors: 0, Skipped: 0, Time elapsed: 0.005 sec
11-Jun-2019 00:02:08 Running org.springframework.security.oauth2.provider.OAuth2AuthenticationTests
11-Jun-2019 00:02:08 {"authorities":[{"authority":"ROLE_USER"}],"details":null,"authenticated":false,"userAuthentication":{"authorities":[{"authority":"ROLE_USER"}],"details":null,"authenticated":true,"principal":"foo","credentials":"bar","name":"foo"},"clientOnly":false,"oauth2Request":{"clientId":"id","scope":["read"],"requestParameters":{},"resourceIds":[],"authorities":[],"approved":false,"refresh":false,"redirectUri":null,"responseTypes":[],"extensions":{},"grantType":null,"refreshTokenRequest":null},"principal":"foo","credentials":"","name":"foo"}
11-Jun-2019 00:02:08 Tests run: 8, Failures: 0, Errors: 0, Skipped: 0, Time elapsed: 0.015 sec
11-Jun-2019 00:02:08 Running org.springframework.security.oauth2.provider.expression.OAuth2MethodSecurityExpressionHandlerTests
11-Jun-2019 00:02:08 Tests run: 9, Failures: 0, Errors: 0, Skipped: 0, Time elapsed: 0.008 sec
11-Jun-2019 00:02:08 Running org.springframework.security.oauth2.provider.expression.OAuth2SecurityExpressionMethodsTests
11-Jun-2019 00:02:08 Tests run: 10, Failures: 0, Errors: 0, Skipped: 0, Time elapsed: 0.002 sec
11-Jun-2019 00:02:08 Running org.springframework.security.oauth2.provider.expression.OAuth2WebSecurityExpressionHandlerTests
11-Jun-2019 00:02:08 Tests run: 6, Failures: 0, Errors: 0, Skipped: 0, Time elapsed: 0.003 sec
11-Jun-2019 00:02:08 Running org.springframework.security.oauth2.provider.expression.OAuth2ExpressionParserTests
11-Jun-2019 00:02:08 Tests run: 3, Failures: 0, Errors: 0, Skipped: 0, Time elapsed: 0.006 sec
11-Jun-2019 00:02:08 Running org.springframework.security.oauth2.provider.OAuth2RequestTests
11-Jun-2019 00:02:08 Tests run: 4, Failures: 0, Errors: 0, Skipped: 0, Time elapsed: 0.001 sec
11-Jun-2019 00:02:08 Running org.springframework.security.oauth2.provider.code.AuthorizationCodeTokenGranterTests
11-Jun-2019 00:02:08 Tests run: 5, Failures: 0, Errors: 0, Skipped: 0, Time elapsed: 0.003 sec
11-Jun-2019 00:02:08 Running org.springframework.security.oauth2.provider.code.InMemoryAuthorizationCodeServicesTests
11-Jun-2019 00:02:08 Tests run: 3, Failures: 0, Errors: 0, Skipped: 0, Time elapsed: 0.001 sec
11-Jun-2019 00:02:08 Running org.springframework.security.oauth2.provider.code.JdbcAuthorizationCodeServicesTests
11-Jun-2019 00:02:08 Tests run: 3, Failures: 0, Errors: 0, Skipped: 0, Time elapsed: 0.03 sec
11-Jun-2019 00:02:08 Running org.springframework.security.oauth2.provider.code.SubdomainRedirectResolverTests
11-Jun-2019 00:02:08 Tests run: 2, Failures: 0, Errors: 0, Skipped: 0, Time elapsed: 0 sec
11-Jun-2019 00:02:08 Running org.springframework.security.oauth2.common.OAuth2AccessTokenJackson1DeserializerTests
11-Jun-2019 00:02:09 Tests run: 8, Failures: 0, Errors: 0, Skipped: 0, Time elapsed: 1.087 sec
11-Jun-2019 00:02:09 Running org.springframework.security.oauth2.common.OAuth2AccessTokenJackson2DeserializerTests
11-Jun-2019 00:02:10 Tests run: 9, Failures: 0, Errors: 0, Skipped: 0, Time elapsed: 1.038 sec
11-Jun-2019 00:02:10 Running org.springframework.security.oauth2.common.exception.OAuth2ExceptionDeserializerTests
11-Jun-2019 00:02:10 Tests run: 13, Failures: 0, Errors: 0, Skipped: 0, Time elapsed: 0.008 sec
11-Jun-2019 00:02:10 Running org.springframework.security.oauth2.common.exception.OAuth2ExceptionSerializerTests
11-Jun-2019 00:02:10 Tests run: 11, Failures: 0, Errors: 0, Skipped: 0, Time elapsed: 0.007 sec
11-Jun-2019 00:02:10 Running org.springframework.security.oauth2.common.exception.OAuth2ExceptionJackson2DeserializerTests
11-Jun-2019 00:02:10 Tests run: 14, Failures: 0, Errors: 0, Skipped: 0, Time elapsed: 0.004 sec
11-Jun-2019 00:02:10 Running org.springframework.security.oauth2.common.OAuth2AccessTokenJackson2SerializerTests
11-Jun-2019 00:02:11 Tests run: 10, Failures: 0, Errors: 0, Skipped: 0, Time elapsed: 0.958 sec
11-Jun-2019 00:02:11 Running org.springframework.security.oauth2.common.OAuth2AccessTokenJackson1SerializerTests
11-Jun-2019 00:02:14 Tests run: 1, Failures: 0, Errors: 0, Skipped: 0, Time elapsed: 3.182 sec
11-Jun-2019 00:02:15 Exception: java.lang.OutOfMemoryError thrown from the UncaughtExceptionHandler in thread "main"
11-Jun-2019 00:02:16
11-Jun-2019 00:02:16 Results :
11-Jun-2019 00:02:16
11-Jun-2019 00:02:16 Tests run: 696, Failures: 0, Errors: 0, Skipped: 0
11-Jun-2019 00:02:16
11-Jun-2019 00:02:16 [INFO] ------------------------------------------------------------------------
11-Jun-2019 00:02:16 [INFO] Reactor Summary:
11-Jun-2019 00:02:16 [INFO]
11-Jun-2019 00:02:16 [INFO] OAuth for Spring Security .......................... SUCCESS [  1.267 s]
11-Jun-2019 00:02:16 [INFO] OAuth 1(a) for Spring Security ..................... SUCCESS [ 15.229 s]
11-Jun-2019 00:02:16 [INFO] OAuth2 for Spring Security ......................... FAILURE [ 38.665 s]
11-Jun-2019 00:02:16 [INFO] spring-oauth2-tests ................................ SKIPPED
11-Jun-2019 00:02:16 [INFO] spring-oauth2-tests-common ......................... SKIPPED
11-Jun-2019 00:02:16 [INFO] spring-oauth2-tests-vanilla ........................ SKIPPED
11-Jun-2019 00:02:16 [INFO] spring-oauth2-tests-mappings ....................... SKIPPED
11-Jun-2019 00:02:16 [INFO] spring-oauth2-tests-form ........................... SKIPPED
11-Jun-2019 00:02:16 [INFO] spring-oauth2-tests-jwt ............................ SKIPPED
11-Jun-2019 00:02:16 [INFO] spring-oauth2-tests-approval ....................... SKIPPED
11-Jun-2019 00:02:16 [INFO] spring-oauth2-tests-jdbc ........................... SKIPPED
11-Jun-2019 00:02:16 [INFO] spring-oauth2-tests-jpa ............................ SKIPPED
11-Jun-2019 00:02:16 [INFO] spring-oauth2-tests-jaxb ........................... SKIPPED
11-Jun-2019 00:02:16 [INFO] spring-oauth-tests-custom-grant .................... SKIPPED
11-Jun-2019 00:02:16 [INFO] spring-oauth2-tests-multi .......................... SKIPPED
11-Jun-2019 00:02:16 [INFO] spring-oauth2-tests-client ......................... SKIPPED
11-Jun-2019 00:02:16 [INFO] spring-oauth2-tests-resource ....................... SKIPPED
11-Jun-2019 00:02:16 [INFO] spring-oauth2-tests-custom-authentication .......... SKIPPED
11-Jun-2019 00:02:16 [INFO] spring-oauth2-tests-xml ............................ SKIPPED
11-Jun-2019 00:02:16 [INFO] spring-oauth2-tests-xml-common ..................... SKIPPED
11-Jun-2019 00:02:16 [INFO] spring-oauth2-tests-xml-vanilla .................... SKIPPED
11-Jun-2019 00:02:16 [INFO] spring-oauth2-tests-xml-mappings ................... SKIPPED
11-Jun-2019 00:02:16 [INFO] spring-oauth2-tests-xml-form ....................... SKIPPED
11-Jun-2019 00:02:16 [INFO] spring-oauth2-tests-xml-jwt ........................ SKIPPED
11-Jun-2019 00:02:16 [INFO] spring-oauth2-tests-xml-approval ................... SKIPPED
11-Jun-2019 00:02:16 [INFO] spring-oauth2-tests-xml-jdbc ....................... SKIPPED
11-Jun-2019 00:02:16 [INFO] spring-oauth2-tests-xml-client ..................... SKIPPED
11-Jun-2019 00:02:16 [INFO] OAuth for Spring Security - Integration Tests ...... SKIPPED
11-Jun-2019 00:02:16 [INFO] OAuth for Spring Security - Sparklr (OAuth 1 Provider Example) SKIPPED
11-Jun-2019 00:02:16 [INFO] OAuth for Spring Security - Tonr (OAuth 1 Consumer Example) SKIPPED
11-Jun-2019 00:02:16 [INFO] OAuth for Spring Security - Sparklr2 (OAuth 2 Provider Example) SKIPPED
11-Jun-2019 00:02:16 [INFO] OAuth for Spring Security - Tonr2 (OAuth 2 Client Example) SKIPPED
11-Jun-2019 00:02:16 [INFO] OAuth for Spring Security - Samples ................ SKIPPED
11-Jun-2019 00:02:16 [INFO] ------------------------------------------------------------------------
11-Jun-2019 00:02:16 [INFO] BUILD FAILURE
11-Jun-2019 00:02:16 [INFO] ------------------------------------------------------------------------
11-Jun-2019 00:02:16 [INFO] Total time: 01:03 min
11-Jun-2019 00:02:16 [INFO] Finished at: 2019-06-11T00:02:16+00:00
11-Jun-2019 00:02:16 [INFO] Final Memory: 74M/497M
11-Jun-2019 00:02:16 [INFO] ------------------------------------------------------------------------
11-Jun-2019 00:02:16 [ERROR] Failed to execute goal org.apache.maven.plugins:maven-surefire-plugin:2.12.4:test (default-test) on project spring-security-oauth2: Execution default-test of goal org.apache.maven.plugins:maven-surefire-plugin:2.12.4:test failed: The forked VM terminated without saying properly goodbye. VM crash or System.exit called ? -> [Help 1]
11-Jun-2019 00:02:16 [ERROR]
11-Jun-2019 00:02:16 [ERROR] To see the full stack trace of the errors, re-run Maven with the -e switch.
11-Jun-2019 00:02:16 [ERROR] Re-run Maven using the -X switch to enable full debug logging.
11-Jun-2019 00:02:16 [ERROR]
11-Jun-2019 00:02:16 [ERROR] For more information about the errors and possible solutions, please read the following articles:
11-Jun-2019 00:02:16 [ERROR] [Help 1] http://cwiki.apache.org/confluence/display/MAVEN/PluginExecutionException
11-Jun-2019 00:02:16 [ERROR]
11-Jun-2019 00:02:16 [ERROR] After correcting the problems, you can resume the build with the command
11-Jun-2019 00:02:16 [ERROR]   mvn <goals> -rf :spring-security-oauth2
11-Jun-2019 00:02:16 Exception in thread "main"
11-Jun-2019 00:02:16
11-Jun-2019 00:02:16 Failing task since return code of [/opt/jdk-7/bin/java -cp /opt/maven-3.3/boot/plexus-classworlds-2.5.2.jar -Dclassworlds.conf=/tmp/artifactoryM27063979672886808953conf -DbuildInfoConfig.propertiesFile=/tmp/buildInfo5156267814249183011.properties -Xmx1256m -Xms128m -Dmaven.home=/opt/maven-3.3 -Dmaven.multiModuleProjectDirectory=/opt/bamboo-home/xml-data/build-dir/SECOAUTH-NIGHTLY-JOB1 org.codehaus.plexus.classworlds.launcher.Launcher clean install -P bootstrap -Dartifactory.publish.password=********] was 1 while expected 0
11-Jun-2019 00:02:16 Finished task 'Artifactory Maven 3' with result: Failed
11-Jun-2019 00:02:16 Running post build plugin 'Docker Container Cleanup'
11-Jun-2019 00:02:16 Running post build plugin 'NCover Results Collector'
11-Jun-2019 00:02:16 Running post build plugin 'Artifactory Release Management Staging'
11-Jun-2019 00:02:16 Running post build plugin 'Artifactory Build Info Copier'
11-Jun-2019 00:02:16 Running post build plugin 'Artifactory Gradle Properties Info Copier'
11-Jun-2019 00:02:16 Running post build plugin 'Clover Results Collector'
11-Jun-2019 00:02:16 Running post build plugin 'npm Cache Cleanup'
11-Jun-2019 00:02:16 Running post build plugin 'Artifact Copier'
11-Jun-2019 00:02:16 Successfully removed working directory at '/opt/bamboo-home/xml-data/build-dir/SECOAUTH-NIGHTLY-JOB1'
11-Jun-2019 00:02:16 Finalising the build...
11-Jun-2019 00:02:16 Stopping timer.
11-Jun-2019 00:02:16 Build SECOAUTH-NIGHTLY-JOB1-1671 completed.
11-Jun-2019 00:02:16 Running on server: post build plugin 'NCover Results Collector'
11-Jun-2019 00:02:16 Running on server: post build plugin 'Build Hanging Detection Configuration'
11-Jun-2019 00:02:16 Running on server: post build plugin 'Clover Delta Calculator'
11-Jun-2019 00:02:16 Running on server: post build plugin 'Maven Dependencies Postprocessor'
11-Jun-2019 00:02:16 All post build plugins have finished
11-Jun-2019 00:02:16 Generating build results summary...
11-Jun-2019 00:02:16 Saving build results to disk...
11-Jun-2019 00:02:16 Logging substituted variables...
11-Jun-2019 00:02:16 Indexing build results...
11-Jun-2019 00:02:16 Finished building SECOAUTH-NIGHTLY-JOB1-1671.