Build: #1673 failed

Job: Default Job failed

Stages & jobs

  1. Default Stage

Build log

The build generated 1,564 lines of output.The output is too long and has been truncated to the last 1,000 lines. Download or view full build log

13-Jun-2019 00:01:00 208/2669 KB   352/386 KB   
13-Jun-2019 00:01:00 208/2669 KB   356/386 KB   
13-Jun-2019 00:01:00 208/2669 KB   360/386 KB   
13-Jun-2019 00:01:00 208/2669 KB   364/386 KB   
13-Jun-2019 00:01:00 208/2669 KB   368/386 KB   
13-Jun-2019 00:01:00 212/2669 KB   368/386 KB   
13-Jun-2019 00:01:00 216/2669 KB   368/386 KB   
13-Jun-2019 00:01:00 220/2669 KB   368/386 KB   
13-Jun-2019 00:01:00 224/2669 KB   368/386 KB   
13-Jun-2019 00:01:00 224/2669 KB   372/386 KB   
13-Jun-2019 00:01:00 224/2669 KB   376/386 KB   
13-Jun-2019 00:01:00 224/2669 KB   380/386 KB   
13-Jun-2019 00:01:00 224/2669 KB   384/386 KB   
13-Jun-2019 00:01:00 224/2669 KB   386/386 KB   
13-Jun-2019 00:01:00                            
13-Jun-2019 00:01:00 Downloaded: https://repo.maven.apache.org/maven2/com/squareup/okhttp3/okhttp/3.7.0/okhttp-3.7.0.jar (386 KB at 285.7 KB/sec)
13-Jun-2019 00:01:00 228/2669 KB               
13-Jun-2019 00:01:00 232/2669 KB   
13-Jun-2019 00:01:00 236/2669 KB   
13-Jun-2019 00:01:00 240/2669 KB   
13-Jun-2019 00:01:00 244/2669 KB   
13-Jun-2019 00:01:00 248/2669 KB   
13-Jun-2019 00:01:00 252/2669 KB   
13-Jun-2019 00:01:00 256/2669 KB   
13-Jun-2019 00:01:01 260/2669 KB   
13-Jun-2019 00:01:01 264/2669 KB   
13-Jun-2019 00:01:01 268/2669 KB   
13-Jun-2019 00:01:01 272/2669 KB   
13-Jun-2019 00:01:01 276/2669 KB   
13-Jun-2019 00:01:01 280/2669 KB   
13-Jun-2019 00:01:01 284/2669 KB   
13-Jun-2019 00:01:01 288/2669 KB   
13-Jun-2019 00:01:01 292/2669 KB   
13-Jun-2019 00:01:01 296/2669 KB   
13-Jun-2019 00:01:01 300/2669 KB   
13-Jun-2019 00:01:01 304/2669 KB   
13-Jun-2019 00:01:01 308/2669 KB   
13-Jun-2019 00:01:01 312/2669 KB   
13-Jun-2019 00:01:01 316/2669 KB   
13-Jun-2019 00:01:01 320/2669 KB   
13-Jun-2019 00:01:01 323/2669 KB   
13-Jun-2019 00:01:01 325/2669 KB   
13-Jun-2019 00:01:01 328/2669 KB   
13-Jun-2019 00:01:01 331/2669 KB   
13-Jun-2019 00:01:01 333/2669 KB   
13-Jun-2019 00:01:01 336/2669 KB   
13-Jun-2019 00:01:01 339/2669 KB   
13-Jun-2019 00:01:01 341/2669 KB   
13-Jun-2019 00:01:01 344/2669 KB   
13-Jun-2019 00:01:01 347/2669 KB   
13-Jun-2019 00:01:01 349/2669 KB   
13-Jun-2019 00:01:01 352/2669 KB   
13-Jun-2019 00:01:01 356/2669 KB   
13-Jun-2019 00:01:01 360/2669 KB   
13-Jun-2019 00:01:01 364/2669 KB   
13-Jun-2019 00:01:01 368/2669 KB   
13-Jun-2019 00:01:01 372/2669 KB   
13-Jun-2019 00:01:01 376/2669 KB   
13-Jun-2019 00:01:01 380/2669 KB   
13-Jun-2019 00:01:01 384/2669 KB   
13-Jun-2019 00:01:01 388/2669 KB   
13-Jun-2019 00:01:01 392/2669 KB   
13-Jun-2019 00:01:01 396/2669 KB   
13-Jun-2019 00:01:01 400/2669 KB   
13-Jun-2019 00:01:02 404/2669 KB   
13-Jun-2019 00:01:02 408/2669 KB   
13-Jun-2019 00:01:02 412/2669 KB   
13-Jun-2019 00:01:02 416/2669 KB   
13-Jun-2019 00:01:02 420/2669 KB   
13-Jun-2019 00:01:02 424/2669 KB   
13-Jun-2019 00:01:02 428/2669 KB   
13-Jun-2019 00:01:02 432/2669 KB   
13-Jun-2019 00:01:02 436/2669 KB   
13-Jun-2019 00:01:02 440/2669 KB   
13-Jun-2019 00:01:02 444/2669 KB   
13-Jun-2019 00:01:02 448/2669 KB   
13-Jun-2019 00:01:02 452/2669 KB   
13-Jun-2019 00:01:02 456/2669 KB   
13-Jun-2019 00:01:02 460/2669 KB   
13-Jun-2019 00:01:02 464/2669 KB   
13-Jun-2019 00:01:02 468/2669 KB   
13-Jun-2019 00:01:02 472/2669 KB   
13-Jun-2019 00:01:02 476/2669 KB   
13-Jun-2019 00:01:02 480/2669 KB   
13-Jun-2019 00:01:02 484/2669 KB   
13-Jun-2019 00:01:02 488/2669 KB   
13-Jun-2019 00:01:02 492/2669 KB   
13-Jun-2019 00:01:02 496/2669 KB   
13-Jun-2019 00:01:02 500/2669 KB   
13-Jun-2019 00:01:02 504/2669 KB   
13-Jun-2019 00:01:02 508/2669 KB   
13-Jun-2019 00:01:02 512/2669 KB   
13-Jun-2019 00:01:02 516/2669 KB   
13-Jun-2019 00:01:02 520/2669 KB   
13-Jun-2019 00:01:02 524/2669 KB   
13-Jun-2019 00:01:02 528/2669 KB   
13-Jun-2019 00:01:02 532/2669 KB   
13-Jun-2019 00:01:02 536/2669 KB   
13-Jun-2019 00:01:02 540/2669 KB   
13-Jun-2019 00:01:02 544/2669 KB   
13-Jun-2019 00:01:02 548/2669 KB   
13-Jun-2019 00:01:02 552/2669 KB   
13-Jun-2019 00:01:02 556/2669 KB   
13-Jun-2019 00:01:02 560/2669 KB   
13-Jun-2019 00:01:02 564/2669 KB   
13-Jun-2019 00:01:02 568/2669 KB   
13-Jun-2019 00:01:02 572/2669 KB   
13-Jun-2019 00:01:02 576/2669 KB   
13-Jun-2019 00:01:02 580/2669 KB   
13-Jun-2019 00:01:02 584/2669 KB   
13-Jun-2019 00:01:02 588/2669 KB   
13-Jun-2019 00:01:02 592/2669 KB   
13-Jun-2019 00:01:03 596/2669 KB   
13-Jun-2019 00:01:03 600/2669 KB   
13-Jun-2019 00:01:03 604/2669 KB   
13-Jun-2019 00:01:03 608/2669 KB   
13-Jun-2019 00:01:03 612/2669 KB   
13-Jun-2019 00:01:03 616/2669 KB   
13-Jun-2019 00:01:03 620/2669 KB   
13-Jun-2019 00:01:03 624/2669 KB   
13-Jun-2019 00:01:03 628/2669 KB   
13-Jun-2019 00:01:03 632/2669 KB   
13-Jun-2019 00:01:03 636/2669 KB   
13-Jun-2019 00:01:03 640/2669 KB   
13-Jun-2019 00:01:03 644/2669 KB   
13-Jun-2019 00:01:03 648/2669 KB   
13-Jun-2019 00:01:03 652/2669 KB   
13-Jun-2019 00:01:03 656/2669 KB   
13-Jun-2019 00:01:03 660/2669 KB   
13-Jun-2019 00:01:03 664/2669 KB   
13-Jun-2019 00:01:03 668/2669 KB   
13-Jun-2019 00:01:03 672/2669 KB   
13-Jun-2019 00:01:03 676/2669 KB   
13-Jun-2019 00:01:03 680/2669 KB   
13-Jun-2019 00:01:03 684/2669 KB   
13-Jun-2019 00:01:03 688/2669 KB   
13-Jun-2019 00:01:03 692/2669 KB   
13-Jun-2019 00:01:03 696/2669 KB   
13-Jun-2019 00:01:03 700/2669 KB   
13-Jun-2019 00:01:03 704/2669 KB   
13-Jun-2019 00:01:03 708/2669 KB   
13-Jun-2019 00:01:03 712/2669 KB   
13-Jun-2019 00:01:03 716/2669 KB   
13-Jun-2019 00:01:03 720/2669 KB   
13-Jun-2019 00:01:03 724/2669 KB   
13-Jun-2019 00:01:03 728/2669 KB   
13-Jun-2019 00:01:03 732/2669 KB   
13-Jun-2019 00:01:03 736/2669 KB   
13-Jun-2019 00:01:03 740/2669 KB   
13-Jun-2019 00:01:03 744/2669 KB   
13-Jun-2019 00:01:03 748/2669 KB   
13-Jun-2019 00:01:03 752/2669 KB   
13-Jun-2019 00:01:03 756/2669 KB   
13-Jun-2019 00:01:03 760/2669 KB   
13-Jun-2019 00:01:03 764/2669 KB   
13-Jun-2019 00:01:03 768/2669 KB   
13-Jun-2019 00:01:03 772/2669 KB   
13-Jun-2019 00:01:03 776/2669 KB   
13-Jun-2019 00:01:03 780/2669 KB   
13-Jun-2019 00:01:03 784/2669 KB   
13-Jun-2019 00:01:03 788/2669 KB   
13-Jun-2019 00:01:03 792/2669 KB   
13-Jun-2019 00:01:03 796/2669 KB   
13-Jun-2019 00:01:03 800/2669 KB   
13-Jun-2019 00:01:03 804/2669 KB   
13-Jun-2019 00:01:03 808/2669 KB   
13-Jun-2019 00:01:03 812/2669 KB   
13-Jun-2019 00:01:03 816/2669 KB   
13-Jun-2019 00:01:03 820/2669 KB   
13-Jun-2019 00:01:03 824/2669 KB   
13-Jun-2019 00:01:03 828/2669 KB   
13-Jun-2019 00:01:03 832/2669 KB   
13-Jun-2019 00:01:03 836/2669 KB   
13-Jun-2019 00:01:03 840/2669 KB   
13-Jun-2019 00:01:03 844/2669 KB   
13-Jun-2019 00:01:03 848/2669 KB   
13-Jun-2019 00:01:04 852/2669 KB   
13-Jun-2019 00:01:04 856/2669 KB   
13-Jun-2019 00:01:04 860/2669 KB   
13-Jun-2019 00:01:04 864/2669 KB   
13-Jun-2019 00:01:04 868/2669 KB   
13-Jun-2019 00:01:04 872/2669 KB   
13-Jun-2019 00:01:04 876/2669 KB   
13-Jun-2019 00:01:04 880/2669 KB   
13-Jun-2019 00:01:04 884/2669 KB   
13-Jun-2019 00:01:04 888/2669 KB   
13-Jun-2019 00:01:04 892/2669 KB   
13-Jun-2019 00:01:04 896/2669 KB   
13-Jun-2019 00:01:05 900/2669 KB   
13-Jun-2019 00:01:05 904/2669 KB   
13-Jun-2019 00:01:05 908/2669 KB   
13-Jun-2019 00:01:05 912/2669 KB   
13-Jun-2019 00:01:05 916/2669 KB   
13-Jun-2019 00:01:05 920/2669 KB   
13-Jun-2019 00:01:05 924/2669 KB   
13-Jun-2019 00:01:05 928/2669 KB   
13-Jun-2019 00:01:05 932/2669 KB   
13-Jun-2019 00:01:05 936/2669 KB   
13-Jun-2019 00:01:05 940/2669 KB   
13-Jun-2019 00:01:05 944/2669 KB   
13-Jun-2019 00:01:05 948/2669 KB   
13-Jun-2019 00:01:05 952/2669 KB   
13-Jun-2019 00:01:05 956/2669 KB   
13-Jun-2019 00:01:05 960/2669 KB   
13-Jun-2019 00:01:05 963/2669 KB   
13-Jun-2019 00:01:05 965/2669 KB   
13-Jun-2019 00:01:05 968/2669 KB   
13-Jun-2019 00:01:05 971/2669 KB   
13-Jun-2019 00:01:05 973/2669 KB   
13-Jun-2019 00:01:05 976/2669 KB   
13-Jun-2019 00:01:05 979/2669 KB   
13-Jun-2019 00:01:05 981/2669 KB   
13-Jun-2019 00:01:05 984/2669 KB   
13-Jun-2019 00:01:05 987/2669 KB   
13-Jun-2019 00:01:05 989/2669 KB   
13-Jun-2019 00:01:05 992/2669 KB   
13-Jun-2019 00:01:05 996/2669 KB   
13-Jun-2019 00:01:05 1000/2669 KB   
13-Jun-2019 00:01:05 1004/2669 KB   
13-Jun-2019 00:01:05 1008/2669 KB   
13-Jun-2019 00:01:06 1012/2669 KB   
13-Jun-2019 00:01:06 1016/2669 KB   
13-Jun-2019 00:01:06 1020/2669 KB   
13-Jun-2019 00:01:06 1024/2669 KB   
13-Jun-2019 00:01:07 1028/2669 KB   
13-Jun-2019 00:01:07 1032/2669 KB   
13-Jun-2019 00:01:07 1036/2669 KB   
13-Jun-2019 00:01:07 1040/2669 KB   
13-Jun-2019 00:01:07 1043/2669 KB   
13-Jun-2019 00:01:07 1045/2669 KB   
13-Jun-2019 00:01:07 1048/2669 KB   
13-Jun-2019 00:01:07 1051/2669 KB   
13-Jun-2019 00:01:07 1053/2669 KB   
13-Jun-2019 00:01:07 1056/2669 KB   
13-Jun-2019 00:01:07 1059/2669 KB   
13-Jun-2019 00:01:07 1061/2669 KB   
13-Jun-2019 00:01:07 1064/2669 KB   
13-Jun-2019 00:01:07 1067/2669 KB   
13-Jun-2019 00:01:07 1069/2669 KB   
13-Jun-2019 00:01:07 1072/2669 KB   
13-Jun-2019 00:01:07 1075/2669 KB   
13-Jun-2019 00:01:07 1077/2669 KB   
13-Jun-2019 00:01:07 1080/2669 KB   
13-Jun-2019 00:01:07 1083/2669 KB   
13-Jun-2019 00:01:07 1085/2669 KB   
13-Jun-2019 00:01:07 1088/2669 KB   
13-Jun-2019 00:01:07 1091/2669 KB   
13-Jun-2019 00:01:07 1093/2669 KB   
13-Jun-2019 00:01:07 1096/2669 KB   
13-Jun-2019 00:01:07 1099/2669 KB   
13-Jun-2019 00:01:07 1101/2669 KB   
13-Jun-2019 00:01:07 1104/2669 KB   
13-Jun-2019 00:01:07 1107/2669 KB   
13-Jun-2019 00:01:07 1109/2669 KB   
13-Jun-2019 00:01:07 1113/2669 KB   
13-Jun-2019 00:01:07 1117/2669 KB   
13-Jun-2019 00:01:07 1121/2669 KB   
13-Jun-2019 00:01:07 1125/2669 KB   
13-Jun-2019 00:01:07 1129/2669 KB   
13-Jun-2019 00:01:07 1133/2669 KB   
13-Jun-2019 00:01:07 1137/2669 KB   
13-Jun-2019 00:01:07 1141/2669 KB   
13-Jun-2019 00:01:07 1145/2669 KB   
13-Jun-2019 00:01:07 1149/2669 KB   
13-Jun-2019 00:01:07 1153/2669 KB   
13-Jun-2019 00:01:07 1157/2669 KB   
13-Jun-2019 00:01:07 1160/2669 KB   
13-Jun-2019 00:01:07 1163/2669 KB   
13-Jun-2019 00:01:07 1165/2669 KB   
13-Jun-2019 00:01:07 1168/2669 KB   
13-Jun-2019 00:01:07 1171/2669 KB   
13-Jun-2019 00:01:07 1173/2669 KB   
13-Jun-2019 00:01:07 1176/2669 KB   
13-Jun-2019 00:01:07 1179/2669 KB   
13-Jun-2019 00:01:07 1181/2669 KB   
13-Jun-2019 00:01:07 1184/2669 KB   
13-Jun-2019 00:01:07 1188/2669 KB   
13-Jun-2019 00:01:07 1189/2669 KB   
13-Jun-2019 00:01:07 1193/2669 KB   
13-Jun-2019 00:01:07 1197/2669 KB   
13-Jun-2019 00:01:07 1197/2669 KB   
13-Jun-2019 00:01:07 1201/2669 KB   
13-Jun-2019 00:01:07 1205/2669 KB   
13-Jun-2019 00:01:07 1209/2669 KB   
13-Jun-2019 00:01:07 1213/2669 KB   
13-Jun-2019 00:01:07 1217/2669 KB   
13-Jun-2019 00:01:07 1221/2669 KB   
13-Jun-2019 00:01:07 1225/2669 KB   
13-Jun-2019 00:01:07 1229/2669 KB   
13-Jun-2019 00:01:07 1233/2669 KB   
13-Jun-2019 00:01:07 1237/2669 KB   
13-Jun-2019 00:01:07 1241/2669 KB   
13-Jun-2019 00:01:07 1245/2669 KB   
13-Jun-2019 00:01:08 1249/2669 KB   
13-Jun-2019 00:01:08 1253/2669 KB   
13-Jun-2019 00:01:08 1257/2669 KB   
13-Jun-2019 00:01:08 1261/2669 KB   
13-Jun-2019 00:01:08 1265/2669 KB   
13-Jun-2019 00:01:08 1269/2669 KB   
13-Jun-2019 00:01:08 1273/2669 KB   
13-Jun-2019 00:01:08 1277/2669 KB   
13-Jun-2019 00:01:08 1281/2669 KB   
13-Jun-2019 00:01:08 1285/2669 KB   
13-Jun-2019 00:01:08 1289/2669 KB   
13-Jun-2019 00:01:08 1293/2669 KB   
13-Jun-2019 00:01:08 1297/2669 KB   
13-Jun-2019 00:01:08 1301/2669 KB   
13-Jun-2019 00:01:08 1305/2669 KB   
13-Jun-2019 00:01:08 1309/2669 KB   
13-Jun-2019 00:01:08 1313/2669 KB   
13-Jun-2019 00:01:08 1317/2669 KB   
13-Jun-2019 00:01:08 1321/2669 KB   
13-Jun-2019 00:01:08 1325/2669 KB   
13-Jun-2019 00:01:08 1329/2669 KB   
13-Jun-2019 00:01:08 1333/2669 KB   
13-Jun-2019 00:01:08 1337/2669 KB   
13-Jun-2019 00:01:08 1341/2669 KB   
13-Jun-2019 00:01:08 1345/2669 KB   
13-Jun-2019 00:01:08 1349/2669 KB   
13-Jun-2019 00:01:08 1353/2669 KB   
13-Jun-2019 00:01:08 1357/2669 KB   
13-Jun-2019 00:01:08 1361/2669 KB   
13-Jun-2019 00:01:08 1365/2669 KB   
13-Jun-2019 00:01:08 1369/2669 KB   
13-Jun-2019 00:01:08 1373/2669 KB   
13-Jun-2019 00:01:08 1377/2669 KB   
13-Jun-2019 00:01:08 1381/2669 KB   
13-Jun-2019 00:01:08 1385/2669 KB   
13-Jun-2019 00:01:08 1389/2669 KB   
13-Jun-2019 00:01:08 1393/2669 KB   
13-Jun-2019 00:01:08 1397/2669 KB   
13-Jun-2019 00:01:08 1401/2669 KB   
13-Jun-2019 00:01:08 1405/2669 KB   
13-Jun-2019 00:01:08 1409/2669 KB   
13-Jun-2019 00:01:08 1413/2669 KB   
13-Jun-2019 00:01:08 1417/2669 KB   
13-Jun-2019 00:01:08 1421/2669 KB   
13-Jun-2019 00:01:08 1425/2669 KB   
13-Jun-2019 00:01:08 1429/2669 KB   
13-Jun-2019 00:01:08 1433/2669 KB   
13-Jun-2019 00:01:08 1437/2669 KB   
13-Jun-2019 00:01:09 1441/2669 KB   
13-Jun-2019 00:01:09 1445/2669 KB   
13-Jun-2019 00:01:09 1449/2669 KB   
13-Jun-2019 00:01:09 1453/2669 KB   
13-Jun-2019 00:01:09 1457/2669 KB   
13-Jun-2019 00:01:09 1461/2669 KB   
13-Jun-2019 00:01:09 1465/2669 KB   
13-Jun-2019 00:01:09 1469/2669 KB   
13-Jun-2019 00:01:09 1473/2669 KB   
13-Jun-2019 00:01:09 1477/2669 KB   
13-Jun-2019 00:01:09 1481/2669 KB   
13-Jun-2019 00:01:09 1485/2669 KB   
13-Jun-2019 00:01:09 1489/2669 KB   
13-Jun-2019 00:01:09 1493/2669 KB   
13-Jun-2019 00:01:09 1497/2669 KB   
13-Jun-2019 00:01:09 1501/2669 KB   
13-Jun-2019 00:01:09 1505/2669 KB   
13-Jun-2019 00:01:09 1509/2669 KB   
13-Jun-2019 00:01:09 1513/2669 KB   
13-Jun-2019 00:01:09 1517/2669 KB   
13-Jun-2019 00:01:09 1521/2669 KB   
13-Jun-2019 00:01:09 1525/2669 KB   
13-Jun-2019 00:01:09 1529/2669 KB   
13-Jun-2019 00:01:09 1533/2669 KB   
13-Jun-2019 00:01:09 1537/2669 KB   
13-Jun-2019 00:01:09 1541/2669 KB   
13-Jun-2019 00:01:09 1545/2669 KB   
13-Jun-2019 00:01:09 1549/2669 KB   
13-Jun-2019 00:01:09 1553/2669 KB   
13-Jun-2019 00:01:09 1557/2669 KB   
13-Jun-2019 00:01:09 1561/2669 KB   
13-Jun-2019 00:01:09 1565/2669 KB   
13-Jun-2019 00:01:09 1569/2669 KB   
13-Jun-2019 00:01:09 1573/2669 KB   
13-Jun-2019 00:01:09 1577/2669 KB   
13-Jun-2019 00:01:09 1581/2669 KB   
13-Jun-2019 00:01:09 1585/2669 KB   
13-Jun-2019 00:01:09 1589/2669 KB   
13-Jun-2019 00:01:09 1593/2669 KB   
13-Jun-2019 00:01:09 1597/2669 KB   
13-Jun-2019 00:01:09 1601/2669 KB   
13-Jun-2019 00:01:09 1605/2669 KB   
13-Jun-2019 00:01:09 1609/2669 KB   
13-Jun-2019 00:01:09 1613/2669 KB   
13-Jun-2019 00:01:09 1617/2669 KB   
13-Jun-2019 00:01:09 1621/2669 KB   
13-Jun-2019 00:01:09 1625/2669 KB   
13-Jun-2019 00:01:09 1629/2669 KB   
13-Jun-2019 00:01:09 1633/2669 KB   
13-Jun-2019 00:01:09 1637/2669 KB   
13-Jun-2019 00:01:09 1641/2669 KB   
13-Jun-2019 00:01:09 1645/2669 KB   
13-Jun-2019 00:01:09 1649/2669 KB   
13-Jun-2019 00:01:09 1653/2669 KB   
13-Jun-2019 00:01:09 1657/2669 KB   
13-Jun-2019 00:01:09 1661/2669 KB   
13-Jun-2019 00:01:09 1665/2669 KB   
13-Jun-2019 00:01:09 1669/2669 KB   
13-Jun-2019 00:01:09 1673/2669 KB   
13-Jun-2019 00:01:09 1677/2669 KB   
13-Jun-2019 00:01:09 1681/2669 KB   
13-Jun-2019 00:01:09 1685/2669 KB   
13-Jun-2019 00:01:09 1689/2669 KB   
13-Jun-2019 00:01:09 1693/2669 KB   
13-Jun-2019 00:01:09 1697/2669 KB   
13-Jun-2019 00:01:09 1701/2669 KB   
13-Jun-2019 00:01:09 1705/2669 KB   
13-Jun-2019 00:01:09 1709/2669 KB   
13-Jun-2019 00:01:09 1713/2669 KB   
13-Jun-2019 00:01:09 1717/2669 KB   
13-Jun-2019 00:01:09 1721/2669 KB   
13-Jun-2019 00:01:09 1725/2669 KB   
13-Jun-2019 00:01:09 1729/2669 KB   
13-Jun-2019 00:01:09 1733/2669 KB   
13-Jun-2019 00:01:09 1737/2669 KB   
13-Jun-2019 00:01:09 1741/2669 KB   
13-Jun-2019 00:01:10 1745/2669 KB   
13-Jun-2019 00:01:10 1749/2669 KB   
13-Jun-2019 00:01:10 1753/2669 KB   
13-Jun-2019 00:01:10 1757/2669 KB   
13-Jun-2019 00:01:10 1761/2669 KB   
13-Jun-2019 00:01:10 1765/2669 KB   
13-Jun-2019 00:01:10 1769/2669 KB   
13-Jun-2019 00:01:10 1773/2669 KB   
13-Jun-2019 00:01:10 1777/2669 KB   
13-Jun-2019 00:01:10 1781/2669 KB   
13-Jun-2019 00:01:10 1785/2669 KB   
13-Jun-2019 00:01:10 1789/2669 KB   
13-Jun-2019 00:01:10 1793/2669 KB   
13-Jun-2019 00:01:10 1797/2669 KB   
13-Jun-2019 00:01:10 1801/2669 KB   
13-Jun-2019 00:01:10 1805/2669 KB   
13-Jun-2019 00:01:10 1809/2669 KB   
13-Jun-2019 00:01:10 1813/2669 KB   
13-Jun-2019 00:01:10 1817/2669 KB   
13-Jun-2019 00:01:10 1821/2669 KB   
13-Jun-2019 00:01:10 1825/2669 KB   
13-Jun-2019 00:01:10 1829/2669 KB   
13-Jun-2019 00:01:10 1833/2669 KB   
13-Jun-2019 00:01:10 1837/2669 KB   
13-Jun-2019 00:01:10 1841/2669 KB   
13-Jun-2019 00:01:10 1845/2669 KB   
13-Jun-2019 00:01:10 1849/2669 KB   
13-Jun-2019 00:01:10 1853/2669 KB   
13-Jun-2019 00:01:10 1857/2669 KB   
13-Jun-2019 00:01:10 1861/2669 KB   
13-Jun-2019 00:01:10 1865/2669 KB   
13-Jun-2019 00:01:10 1869/2669 KB   
13-Jun-2019 00:01:10 1873/2669 KB   
13-Jun-2019 00:01:10 1877/2669 KB   
13-Jun-2019 00:01:10 1881/2669 KB   
13-Jun-2019 00:01:10 1885/2669 KB   
13-Jun-2019 00:01:10 1889/2669 KB   
13-Jun-2019 00:01:10 1891/2669 KB   
13-Jun-2019 00:01:10 1895/2669 KB   
13-Jun-2019 00:01:10 1899/2669 KB   
13-Jun-2019 00:01:10 1901/2669 KB   
13-Jun-2019 00:01:10 1905/2669 KB   
13-Jun-2019 00:01:10 1909/2669 KB   
13-Jun-2019 00:01:10 1913/2669 KB   
13-Jun-2019 00:01:10 1917/2669 KB   
13-Jun-2019 00:01:10 1921/2669 KB   
13-Jun-2019 00:01:10 1925/2669 KB   
13-Jun-2019 00:01:10 1929/2669 KB   
13-Jun-2019 00:01:10 1933/2669 KB   
13-Jun-2019 00:01:10 1937/2669 KB   
13-Jun-2019 00:01:10 1941/2669 KB   
13-Jun-2019 00:01:10 1945/2669 KB   
13-Jun-2019 00:01:10 1949/2669 KB   
13-Jun-2019 00:01:10 1953/2669 KB   
13-Jun-2019 00:01:10 1957/2669 KB   
13-Jun-2019 00:01:10 1961/2669 KB   
13-Jun-2019 00:01:10 1965/2669 KB   
13-Jun-2019 00:01:10 1969/2669 KB   
13-Jun-2019 00:01:10 1973/2669 KB   
13-Jun-2019 00:01:10 1977/2669 KB   
13-Jun-2019 00:01:10 1981/2669 KB   
13-Jun-2019 00:01:10 1985/2669 KB   
13-Jun-2019 00:01:10 1989/2669 KB   
13-Jun-2019 00:01:10 1993/2669 KB   
13-Jun-2019 00:01:10 1997/2669 KB   
13-Jun-2019 00:01:10 2001/2669 KB   
13-Jun-2019 00:01:10 2005/2669 KB   
13-Jun-2019 00:01:10 2009/2669 KB   
13-Jun-2019 00:01:10 2013/2669 KB   
13-Jun-2019 00:01:10 2017/2669 KB   
13-Jun-2019 00:01:10 2021/2669 KB   
13-Jun-2019 00:01:10 2025/2669 KB   
13-Jun-2019 00:01:10 2029/2669 KB   
13-Jun-2019 00:01:10 2033/2669 KB   
13-Jun-2019 00:01:10 2037/2669 KB   
13-Jun-2019 00:01:10 2041/2669 KB   
13-Jun-2019 00:01:10 2045/2669 KB   
13-Jun-2019 00:01:10 2049/2669 KB   
13-Jun-2019 00:01:10 2053/2669 KB   
13-Jun-2019 00:01:10 2057/2669 KB   
13-Jun-2019 00:01:10 2061/2669 KB   
13-Jun-2019 00:01:10 2065/2669 KB   
13-Jun-2019 00:01:10 2069/2669 KB   
13-Jun-2019 00:01:10 2073/2669 KB   
13-Jun-2019 00:01:10 2077/2669 KB   
13-Jun-2019 00:01:10 2081/2669 KB   
13-Jun-2019 00:01:10 2085/2669 KB   
13-Jun-2019 00:01:10 2089/2669 KB   
13-Jun-2019 00:01:10 2093/2669 KB   
13-Jun-2019 00:01:10 2097/2669 KB   
13-Jun-2019 00:01:10 2101/2669 KB   
13-Jun-2019 00:01:10 2105/2669 KB   
13-Jun-2019 00:01:10 2109/2669 KB   
13-Jun-2019 00:01:10 2113/2669 KB   
13-Jun-2019 00:01:10 2117/2669 KB   
13-Jun-2019 00:01:10 2121/2669 KB   
13-Jun-2019 00:01:10 2125/2669 KB   
13-Jun-2019 00:01:10 2129/2669 KB   
13-Jun-2019 00:01:10 2133/2669 KB   
13-Jun-2019 00:01:10 2137/2669 KB   
13-Jun-2019 00:01:10 2141/2669 KB   
13-Jun-2019 00:01:10 2145/2669 KB   
13-Jun-2019 00:01:10 2149/2669 KB   
13-Jun-2019 00:01:10 2153/2669 KB   
13-Jun-2019 00:01:10 2157/2669 KB   
13-Jun-2019 00:01:10 2161/2669 KB   
13-Jun-2019 00:01:10 2165/2669 KB   
13-Jun-2019 00:01:10 2169/2669 KB   
13-Jun-2019 00:01:10 2173/2669 KB   
13-Jun-2019 00:01:10 2177/2669 KB   
13-Jun-2019 00:01:10 2181/2669 KB   
13-Jun-2019 00:01:10 2185/2669 KB   
13-Jun-2019 00:01:10 2189/2669 KB   
13-Jun-2019 00:01:10 2193/2669 KB   
13-Jun-2019 00:01:10 2197/2669 KB   
13-Jun-2019 00:01:10 2201/2669 KB   
13-Jun-2019 00:01:10 2205/2669 KB   
13-Jun-2019 00:01:10 2209/2669 KB   
13-Jun-2019 00:01:10 2213/2669 KB   
13-Jun-2019 00:01:10 2217/2669 KB   
13-Jun-2019 00:01:10 2221/2669 KB   
13-Jun-2019 00:01:10 2225/2669 KB   
13-Jun-2019 00:01:10 2229/2669 KB   
13-Jun-2019 00:01:10 2233/2669 KB   
13-Jun-2019 00:01:10 2237/2669 KB   
13-Jun-2019 00:01:11 2241/2669 KB   
13-Jun-2019 00:01:11 2245/2669 KB   
13-Jun-2019 00:01:11 2249/2669 KB   
13-Jun-2019 00:01:11 2253/2669 KB   
13-Jun-2019 00:01:11 2257/2669 KB   
13-Jun-2019 00:01:11 2261/2669 KB   
13-Jun-2019 00:01:11 2265/2669 KB   
13-Jun-2019 00:01:11 2269/2669 KB   
13-Jun-2019 00:01:11 2273/2669 KB   
13-Jun-2019 00:01:11 2277/2669 KB   
13-Jun-2019 00:01:11 2281/2669 KB   
13-Jun-2019 00:01:11 2285/2669 KB   
13-Jun-2019 00:01:11 2289/2669 KB   
13-Jun-2019 00:01:11 2293/2669 KB   
13-Jun-2019 00:01:11 2297/2669 KB   
13-Jun-2019 00:01:11 2301/2669 KB   
13-Jun-2019 00:01:11 2305/2669 KB   
13-Jun-2019 00:01:11 2309/2669 KB   
13-Jun-2019 00:01:11 2313/2669 KB   
13-Jun-2019 00:01:11 2317/2669 KB   
13-Jun-2019 00:01:11 2321/2669 KB   
13-Jun-2019 00:01:11 2325/2669 KB   
13-Jun-2019 00:01:11 2329/2669 KB   
13-Jun-2019 00:01:11 2333/2669 KB   
13-Jun-2019 00:01:11 2337/2669 KB   
13-Jun-2019 00:01:11 2341/2669 KB   
13-Jun-2019 00:01:11 2345/2669 KB   
13-Jun-2019 00:01:11 2349/2669 KB   
13-Jun-2019 00:01:11 2353/2669 KB   
13-Jun-2019 00:01:11 2357/2669 KB   
13-Jun-2019 00:01:11 2361/2669 KB   
13-Jun-2019 00:01:11 2365/2669 KB   
13-Jun-2019 00:01:11 2369/2669 KB   
13-Jun-2019 00:01:11 2373/2669 KB   
13-Jun-2019 00:01:11 2377/2669 KB   
13-Jun-2019 00:01:11 2381/2669 KB   
13-Jun-2019 00:01:11 2385/2669 KB   
13-Jun-2019 00:01:11 2389/2669 KB   
13-Jun-2019 00:01:11 2393/2669 KB   
13-Jun-2019 00:01:11 2397/2669 KB   
13-Jun-2019 00:01:11 2401/2669 KB   
13-Jun-2019 00:01:11 2405/2669 KB   
13-Jun-2019 00:01:11 2409/2669 KB   
13-Jun-2019 00:01:11 2413/2669 KB   
13-Jun-2019 00:01:11 2417/2669 KB   
13-Jun-2019 00:01:11 2421/2669 KB   
13-Jun-2019 00:01:11 2425/2669 KB   
13-Jun-2019 00:01:11 2429/2669 KB   
13-Jun-2019 00:01:11 2433/2669 KB   
13-Jun-2019 00:01:11 2437/2669 KB   
13-Jun-2019 00:01:11 2441/2669 KB   
13-Jun-2019 00:01:11 2445/2669 KB   
13-Jun-2019 00:01:11 2449/2669 KB   
13-Jun-2019 00:01:11 2453/2669 KB   
13-Jun-2019 00:01:11 2457/2669 KB   
13-Jun-2019 00:01:11 2461/2669 KB   
13-Jun-2019 00:01:11 2465/2669 KB   
13-Jun-2019 00:01:11 2469/2669 KB   
13-Jun-2019 00:01:11 2473/2669 KB   
13-Jun-2019 00:01:11 2477/2669 KB   
13-Jun-2019 00:01:11 2481/2669 KB   
13-Jun-2019 00:01:11 2485/2669 KB   
13-Jun-2019 00:01:11 2489/2669 KB   
13-Jun-2019 00:01:11 2493/2669 KB   
13-Jun-2019 00:01:11 2497/2669 KB   
13-Jun-2019 00:01:11 2501/2669 KB   
13-Jun-2019 00:01:11 2505/2669 KB   
13-Jun-2019 00:01:11 2509/2669 KB   
13-Jun-2019 00:01:11 2513/2669 KB   
13-Jun-2019 00:01:11 2517/2669 KB   
13-Jun-2019 00:01:11 2521/2669 KB   
13-Jun-2019 00:01:11 2525/2669 KB   
13-Jun-2019 00:01:11 2529/2669 KB   
13-Jun-2019 00:01:11 2533/2669 KB   
13-Jun-2019 00:01:11 2537/2669 KB   
13-Jun-2019 00:01:11 2541/2669 KB   
13-Jun-2019 00:01:11 2545/2669 KB   
13-Jun-2019 00:01:11 2549/2669 KB   
13-Jun-2019 00:01:11 2553/2669 KB   
13-Jun-2019 00:01:11 2557/2669 KB   
13-Jun-2019 00:01:11 2561/2669 KB   
13-Jun-2019 00:01:11 2565/2669 KB   
13-Jun-2019 00:01:11 2569/2669 KB   
13-Jun-2019 00:01:11 2573/2669 KB   
13-Jun-2019 00:01:11 2577/2669 KB   
13-Jun-2019 00:01:11 2581/2669 KB   
13-Jun-2019 00:01:11 2585/2669 KB   
13-Jun-2019 00:01:11 2589/2669 KB   
13-Jun-2019 00:01:11 2593/2669 KB   
13-Jun-2019 00:01:11 2597/2669 KB   
13-Jun-2019 00:01:11 2601/2669 KB   
13-Jun-2019 00:01:11 2605/2669 KB   
13-Jun-2019 00:01:11 2609/2669 KB   
13-Jun-2019 00:01:11 2613/2669 KB   
13-Jun-2019 00:01:11 2617/2669 KB   
13-Jun-2019 00:01:11 2621/2669 KB   
13-Jun-2019 00:01:11 2625/2669 KB   
13-Jun-2019 00:01:11 2629/2669 KB   
13-Jun-2019 00:01:11 2633/2669 KB   
13-Jun-2019 00:01:11 2637/2669 KB   
13-Jun-2019 00:01:11 2641/2669 KB   
13-Jun-2019 00:01:11 2645/2669 KB   
13-Jun-2019 00:01:11 2649/2669 KB   
13-Jun-2019 00:01:11 2653/2669 KB   
13-Jun-2019 00:01:11 2657/2669 KB   
13-Jun-2019 00:01:11 2661/2669 KB   
13-Jun-2019 00:01:11 2665/2669 KB   
13-Jun-2019 00:01:11 2669/2669 KB   
13-Jun-2019 00:01:11                
13-Jun-2019 00:01:11 Downloaded: https://repo.maven.apache.org/maven2/org/bouncycastle/bcprov-jdk15on/1.50/bcprov-jdk15on-1.50.jar (2669 KB at 222.2 KB/sec)
13-Jun-2019 00:01:11 [INFO]
13-Jun-2019 00:01:11 [INFO] --- maven-clean-plugin:2.5:clean (default-clean) @ spring-security-oauth2 ---
13-Jun-2019 00:01:11 [INFO]
13-Jun-2019 00:01:11 [INFO] --- maven-resources-plugin:2.6:resources (default-resources) @ spring-security-oauth2 ---
13-Jun-2019 00:01:11 [INFO] Using 'UTF-8' encoding to copy filtered resources.
13-Jun-2019 00:01:11 [INFO] Copying 4 resources
13-Jun-2019 00:01:11 [INFO]
13-Jun-2019 00:01:11 [INFO] --- maven-compiler-plugin:2.3.2:compile (default-compile) @ spring-security-oauth2 ---
13-Jun-2019 00:01:11 [INFO] Compiling 249 source files to /opt/bamboo-home/xml-data/build-dir/SECOAUTH-NIGHTLY-JOB1/spring-security-oauth2/target/classes
13-Jun-2019 00:01:13 [INFO]
13-Jun-2019 00:01:13 [INFO] --- maven-resources-plugin:2.6:testResources (default-testResources) @ spring-security-oauth2 ---
13-Jun-2019 00:01:13 [INFO] Using 'UTF-8' encoding to copy filtered resources.
13-Jun-2019 00:01:13 [INFO] Copying 21 resources
13-Jun-2019 00:01:13 [INFO]
13-Jun-2019 00:01:13 [INFO] --- maven-compiler-plugin:2.3.2:testCompile (default-testCompile) @ spring-security-oauth2 ---
13-Jun-2019 00:01:13 [INFO] Compiling 120 source files to /opt/bamboo-home/xml-data/build-dir/SECOAUTH-NIGHTLY-JOB1/spring-security-oauth2/target/test-classes
13-Jun-2019 00:01:16 [INFO]
13-Jun-2019 00:01:16 [INFO] --- maven-surefire-plugin:2.12.4:test (default-test) @ spring-security-oauth2 ---
13-Jun-2019 00:01:16 [INFO] Surefire report directory: /opt/bamboo-home/xml-data/build-dir/SECOAUTH-NIGHTLY-JOB1/spring-security-oauth2/target/surefire-reports
13-Jun-2019 00:01:16
13-Jun-2019 00:01:16 -------------------------------------------------------
13-Jun-2019 00:01:16 T E S T S
13-Jun-2019 00:01:16 -------------------------------------------------------
13-Jun-2019 00:01:16 Running org.springframework.security.oauth2.config.annotation.TokenServicesMultipleBeansTests
13-Jun-2019 00:01:17 Tests run: 1, Failures: 0, Errors: 0, Skipped: 0, Time elapsed: 1.437 sec
13-Jun-2019 00:01:17 Running org.springframework.security.oauth2.config.annotation.Gh501EnableAuthorizationServerTests
13-Jun-2019 00:01:18 Tests run: 1, Failures: 0, Errors: 0, Skipped: 0, Time elapsed: 0.659 sec
13-Jun-2019 00:01:18 Running org.springframework.security.oauth2.config.annotation.ClientConfigurationTests
13-Jun-2019 00:01:18 Tests run: 1, Failures: 0, Errors: 0, Skipped: 0, Time elapsed: 0.235 sec
13-Jun-2019 00:01:18 Running org.springframework.security.oauth2.config.annotation.ResourceServerConfigurationTests
13-Jun-2019 00:01:19 [WARN] TokenEndpoint - Handling error: InvalidRequestException, Missing grant type
13-Jun-2019 00:01:19 [WARN] PageNotFound - No mapping found for HTTP request with URI [/] in DispatcherServlet with name ''
13-Jun-2019 00:01:19 [WARN] PageNotFound - No mapping found for HTTP request with URI [/] in DispatcherServlet with name ''
13-Jun-2019 00:01:19 [WARN] PageNotFound - No mapping found for HTTP request with URI [/] in DispatcherServlet with name ''
13-Jun-2019 00:01:20 [WARN] PageNotFound - No mapping found for HTTP request with URI [/] in DispatcherServlet with name ''
13-Jun-2019 00:01:20 [WARN] TokenEndpoint - Handling error: InvalidRequestException, Missing grant type
13-Jun-2019 00:01:20 Tests run: 9, Failures: 0, Errors: 0, Skipped: 0, Time elapsed: 1.553 sec
13-Jun-2019 00:01:20 Running org.springframework.security.oauth2.config.annotation.AuthorizationServerConfigurationTests
13-Jun-2019 00:01:20 [WARN] AnnotationConfigWebApplicationContext - Exception encountered during context initialization - cancelling refresh attempt: org.springframework.beans.factory.UnsatisfiedDependencyException: Error creating bean with name 'org.springframework.security.config.annotation.web.configuration.WebSecurityConfiguration': Unsatisfied dependency expressed through method 'setFilterChainProxySecurityConfigurer' parameter 1; nested exception is org.springframework.beans.factory.BeanExpressionException: Expression parsing failed; nested exception is org.springframework.beans.factory.UnsatisfiedDependencyException: Error creating bean with name 'org.springframework.security.oauth2.config.annotation.web.configuration.AuthorizationServerSecurityConfiguration': Unsatisfied dependency expressed through field 'configurers'; nested exception is org.springframework.beans.factory.NoSuchBeanDefinitionException: No qualifying bean of type 'java.util.List<org.springframework.security.oauth2.config.annotation.web.configuration.AuthorizationServerConfigurer>' available: expected at least 1 bean which qualifies as autowire candidate. Dependency annotations: {@org.springframework.beans.factory.annotation.Autowired(required=true)}
13-Jun-2019 00:01:21 [WARN] JwtAccessTokenConverter - Unable to create an RSA verifier from verifierKey (ignoreable if using MAC)
13-Jun-2019 00:01:22 [WARN] AnnotationConfigWebApplicationContext - Exception encountered during context initialization - cancelling refresh attempt: org.springframework.beans.factory.UnsatisfiedDependencyException: Error creating bean with name 'authorizationServerConfigurationTests.AuthorizationServerTypes': Unsatisfied dependency expressed through field 'tokenServices'; nested exception is org.springframework.beans.factory.BeanCreationException: Error creating bean with name 'org.springframework.security.oauth2.config.annotation.web.configuration.AuthorizationServerEndpointsConfiguration': Invocation of init method failed; nested exception is java.lang.AssertionError
13-Jun-2019 00:01:22 Tests run: 20, Failures: 0, Errors: 0, Skipped: 0, Time elapsed: 2.178 sec
13-Jun-2019 00:01:22 Running org.springframework.security.oauth2.config.annotation.Gh808EnableAuthorizationServerTests
13-Jun-2019 00:01:22 Tests run: 2, Failures: 0, Errors: 0, Skipped: 0, Time elapsed: 0.144 sec
13-Jun-2019 00:01:22 Running org.springframework.security.oauth2.config.xml.ResourceServerBeanDefinitionParserTests
13-Jun-2019 00:01:22 Tests run: 2, Failures: 0, Errors: 0, Skipped: 0, Time elapsed: 0.183 sec
13-Jun-2019 00:01:22 Running org.springframework.security.oauth2.config.xml.AuthorizationServerInvalidParserTests
13-Jun-2019 00:01:22 Tests run: 1, Failures: 0, Errors: 0, Skipped: 0, Time elapsed: 0.029 sec
13-Jun-2019 00:01:22 Running org.springframework.security.oauth2.config.xml.AuthorizationServerBeanDefinitionParserTests
13-Jun-2019 00:01:23 Tests run: 12, Failures: 0, Errors: 0, Skipped: 0, Time elapsed: 0.47 sec
13-Jun-2019 00:01:23 Running org.springframework.security.oauth2.config.xml.ClientDetailsServiceBeanDefinitionParserTests
13-Jun-2019 00:01:23 Tests run: 3, Failures: 0, Errors: 0, Skipped: 0, Time elapsed: 0.035 sec
13-Jun-2019 00:01:23 Running org.springframework.security.oauth2.config.xml.ResourceBeanDefinitionParserTests
13-Jun-2019 00:01:23 Tests run: 7, Failures: 0, Errors: 0, Skipped: 0, Time elapsed: 0.067 sec
13-Jun-2019 00:01:23 Running org.springframework.security.oauth2.config.xml.InvalidResourceBeanDefinitionParserTests
13-Jun-2019 00:01:23 Tests run: 5, Failures: 0, Errors: 0, Skipped: 0, Time elapsed: 0.055 sec
13-Jun-2019 00:01:23 Running org.springframework.security.oauth2.config.xml.AuthorizationServerCustomGrantParserTests
13-Jun-2019 00:01:23 Tests run: 1, Failures: 0, Errors: 0, Skipped: 0, Time elapsed: 0.021 sec
13-Jun-2019 00:01:23 Running org.springframework.security.oauth2.config.xml.AuthorizationServerClientCredentialsPasswordInvalidXmlTests
13-Jun-2019 00:01:23 Tests run: 2, Failures: 0, Errors: 0, Skipped: 0, Time elapsed: 0.319 sec
13-Jun-2019 00:01:23 Running org.springframework.security.oauth2.config.xml.AuthorizationServerClientCredentialsPasswordValidXmlTests
13-Jun-2019 00:01:23 Tests run: 2, Failures: 0, Errors: 0, Skipped: 0, Time elapsed: 0.208 sec
13-Jun-2019 00:01:23 Running org.springframework.security.oauth2.http.converter.jaxb.JaxbOAuth2ExceptionMessageConverterTests
13-Jun-2019 00:01:25 Tests run: 22, Failures: 0, Errors: 0, Skipped: 0, Time elapsed: 1.417 sec
13-Jun-2019 00:01:25 Running org.springframework.security.oauth2.http.converter.jaxb.JaxbOAuth2AccessTokenMessageConverterTests
13-Jun-2019 00:01:26 Tests run: 8, Failures: 0, Errors: 0, Skipped: 0, Time elapsed: 0.822 sec
13-Jun-2019 00:01:26 Running org.springframework.security.oauth2.client.http.OAuth2ErrorHandlerTests
13-Jun-2019 00:01:26 Tests run: 12, Failures: 0, Errors: 0, Skipped: 0, Time elapsed: 0.054 sec
13-Jun-2019 00:01:26 Running org.springframework.security.oauth2.client.DefaultOAuth2RequestAuthenticatorTests
13-Jun-2019 00:01:26 Tests run: 6, Failures: 0, Errors: 0, Skipped: 0, Time elapsed: 0.002 sec
13-Jun-2019 00:01:26 Running org.springframework.security.oauth2.client.token.grant.password.ResourceOwnerPasswordAccessTokenProviderTests
13-Jun-2019 00:01:26 Tests run: 3, Failures: 0, Errors: 0, Skipped: 0, Time elapsed: 0 sec
13-Jun-2019 00:01:26 Running org.springframework.security.oauth2.client.token.grant.implicit.ImplicitAccessTokenProviderTests
13-Jun-2019 00:01:26 Tests run: 2, Failures: 0, Errors: 0, Skipped: 0, Time elapsed: 0 sec
13-Jun-2019 00:01:26 Running org.springframework.security.oauth2.client.token.grant.code.AuthorizationCodeAccessTokenProviderWithConversionTests
13-Jun-2019 00:01:26 Tests run: 4, Failures: 0, Errors: 0, Skipped: 0, Time elapsed: 0.122 sec
13-Jun-2019 00:01:26 Running org.springframework.security.oauth2.client.token.grant.code.AuthorizationCodeAccessTokenProviderTests
13-Jun-2019 00:01:26 Tests run: 5, Failures: 0, Errors: 0, Skipped: 0, Time elapsed: 0.001 sec
13-Jun-2019 00:01:26 Running org.springframework.security.oauth2.client.token.grant.code.AuthorizationCodeResourceDetailsTests
13-Jun-2019 00:01:26 Tests run: 2, Failures: 0, Errors: 0, Skipped: 0, Time elapsed: 0 sec
13-Jun-2019 00:01:26 Running org.springframework.security.oauth2.client.token.JdbcClientTokenServicesTests
13-Jun-2019 00:01:26 Tests run: 3, Failures: 0, Errors: 0, Skipped: 0, Time elapsed: 0.31 sec
13-Jun-2019 00:01:26 Running org.springframework.security.oauth2.client.token.OAuth2AccessTokenSupportTests
13-Jun-2019 00:01:26 Tests run: 5, Failures: 0, Errors: 0, Skipped: 0, Time elapsed: 0.023 sec
13-Jun-2019 00:01:26 Running org.springframework.security.oauth2.client.token.AccessTokenProviderChainTests
13-Jun-2019 00:01:26 Tests run: 15, Failures: 0, Errors: 0, Skipped: 0, Time elapsed: 0.026 sec
13-Jun-2019 00:01:26 Running org.springframework.security.oauth2.client.filter.OAuth2ClientContextFilterTests
13-Jun-2019 00:01:26 Tests run: 11, Failures: 0, Errors: 0, Skipped: 0, Time elapsed: 0.006 sec
13-Jun-2019 00:01:26 Running org.springframework.security.oauth2.client.filter.OAuth2ClientAuthenticationProcessingFilterTests
13-Jun-2019 00:01:26 Tests run: 5, Failures: 0, Errors: 0, Skipped: 0, Time elapsed: 0.017 sec
13-Jun-2019 00:01:26 Running org.springframework.security.oauth2.client.OAuth2RestTemplateTests
13-Jun-2019 00:01:26 Tests run: 12, Failures: 0, Errors: 0, Skipped: 0, Time elapsed: 0.197 sec
13-Jun-2019 00:01:26 Running org.springframework.security.oauth2.provider.request.DefaultAuthorizationRequestFactoryTests
13-Jun-2019 00:01:26 Tests run: 9, Failures: 0, Errors: 0, Skipped: 0, Time elapsed: 0.002 sec
13-Jun-2019 00:01:26 Running org.springframework.security.oauth2.provider.request.DefaultOAuth2RequestValidatorTests
13-Jun-2019 00:01:26 Tests run: 3, Failures: 0, Errors: 0, Skipped: 0, Time elapsed: 0.002 sec
13-Jun-2019 00:01:26 Running org.springframework.security.oauth2.provider.password.ResourceOwnerPasswordTokenGranterTests
13-Jun-2019 00:01:26 Tests run: 7, Failures: 0, Errors: 0, Skipped: 0, Time elapsed: 0.003 sec
13-Jun-2019 00:01:26 Running org.springframework.security.oauth2.provider.client.BaseClientDetailsTests
13-Jun-2019 00:01:27 Tests run: 11, Failures: 0, Errors: 0, Skipped: 0, Time elapsed: 0.044 sec
13-Jun-2019 00:01:27 Running org.springframework.security.oauth2.provider.client.JdbcClientDetailsServiceTests
13-Jun-2019 00:01:27 Tests run: 14, Failures: 0, Errors: 0, Skipped: 0, Time elapsed: 0.264 sec
13-Jun-2019 00:01:27 Running org.springframework.security.oauth2.provider.client.ClientCredentialsTokenEndpointFilterTests
13-Jun-2019 00:01:27 Tests run: 3, Failures: 0, Errors: 0, Skipped: 0, Time elapsed: 0.02 sec
13-Jun-2019 00:01:27 Running org.springframework.security.oauth2.provider.client.ClientDetailsUserDetailsServiceTests
13-Jun-2019 00:01:27 Tests run: 2, Failures: 0, Errors: 0, Skipped: 0, Time elapsed: 0.004 sec
13-Jun-2019 00:01:27 Running org.springframework.security.oauth2.provider.approval.ApprovalStoreUserApprovalHandlerTests
13-Jun-2019 00:01:27 Tests run: 10, Failures: 0, Errors: 0, Skipped: 0, Time elapsed: 0.003 sec
13-Jun-2019 00:01:27 Running org.springframework.security.oauth2.provider.approval.DefaultUserApprovalHandlerTests
13-Jun-2019 00:01:27 Tests run: 1, Failures: 0, Errors: 0, Skipped: 0, Time elapsed: 0 sec
13-Jun-2019 00:01:27 Running org.springframework.security.oauth2.provider.approval.TokenStoreUserApprovalHandlerTests
13-Jun-2019 00:01:27 Tests run: 3, Failures: 0, Errors: 0, Skipped: 0, Time elapsed: 0.001 sec
13-Jun-2019 00:01:27 Running org.springframework.security.oauth2.provider.approval.JdbcApprovalStoreTests
13-Jun-2019 00:01:27 Tests run: 6, Failures: 0, Errors: 0, Skipped: 0, Time elapsed: 0.072 sec
13-Jun-2019 00:01:27 Running org.springframework.security.oauth2.provider.approval.InMemoryApprovalStoreTests
13-Jun-2019 00:01:27 Tests run: 5, Failures: 0, Errors: 0, Skipped: 0, Time elapsed: 0.001 sec
13-Jun-2019 00:01:27 Running org.springframework.security.oauth2.provider.approval.TokenApprovalStoreTests
13-Jun-2019 00:01:27 Tests run: 5, Failures: 0, Errors: 0, Skipped: 0, Time elapsed: 0.003 sec
13-Jun-2019 00:01:27 Running org.springframework.security.oauth2.provider.vote.ClientScopeVoterTests
13-Jun-2019 00:01:27 Tests run: 3, Failures: 0, Errors: 0, Skipped: 0, Time elapsed: 0.005 sec
13-Jun-2019 00:01:27 Running org.springframework.security.oauth2.provider.vote.ScopeVoterTests
13-Jun-2019 00:01:27 Tests run: 6, Failures: 0, Errors: 0, Skipped: 0, Time elapsed: 0.001 sec
13-Jun-2019 00:01:27 Running org.springframework.security.oauth2.provider.test.OAuth2RequestTests
13-Jun-2019 00:01:27 Tests run: 4, Failures: 0, Errors: 0, Skipped: 0, Time elapsed: 0.001 sec
13-Jun-2019 00:01:27 Running org.springframework.security.oauth2.provider.token.DefaultTokenServicesWithJdbcTests
13-Jun-2019 00:01:27 Tests run: 19, Failures: 0, Errors: 0, Skipped: 0, Time elapsed: 0.377 sec
13-Jun-2019 00:01:27 Running org.springframework.security.oauth2.provider.token.store.JwtAccessTokenConverterTests
13-Jun-2019 00:01:27 [WARN] JwtAccessTokenConverter - Unable to create an RSA verifier from verifierKey (ignoreable if using MAC)
13-Jun-2019 00:01:27 [WARN] JwtAccessTokenConverter - Unable to create an RSA verifier from verifierKey (ignoreable if using MAC)
13-Jun-2019 00:01:27 [WARN] JwtAccessTokenConverter - Unable to create an RSA verifier from verifierKey (ignoreable if using MAC)
13-Jun-2019 00:01:27 Tests run: 14, Failures: 0, Errors: 0, Skipped: 0, Time elapsed: 0.165 sec
13-Jun-2019 00:01:27 Running org.springframework.security.oauth2.provider.token.store.InMemoryTokenStoreTests
13-Jun-2019 00:01:27 Tests run: 16, Failures: 0, Errors: 0, Skipped: 0, Time elapsed: 0.009 sec
13-Jun-2019 00:01:27 [WARN] JwtAccessTokenConverter - Unable to create an RSA verifier from verifierKey (ignoreable if using MAC)
13-Jun-2019 00:01:27 [WARN] JwtAccessTokenConverter - Unable to create an RSA verifier from verifierKey (ignoreable if using MAC)
13-Jun-2019 00:01:27 Running org.springframework.security.oauth2.provider.token.store.JwtTokenStoreTests
13-Jun-2019 00:01:27 [WARN] JwtAccessTokenConverter - Unable to create an RSA verifier from verifierKey (ignoreable if using MAC)
13-Jun-2019 00:01:27 [WARN] JwtAccessTokenConverter - Unable to create an RSA verifier from verifierKey (ignoreable if using MAC)
13-Jun-2019 00:01:27 [WARN] JwtAccessTokenConverter - Unable to create an RSA verifier from verifierKey (ignoreable if using MAC)
13-Jun-2019 00:01:27 [WARN] JwtAccessTokenConverter - Unable to create an RSA verifier from verifierKey (ignoreable if using MAC)
13-Jun-2019 00:01:27 [WARN] JwtAccessTokenConverter - Unable to create an RSA verifier from verifierKey (ignoreable if using MAC)
13-Jun-2019 00:01:27 [WARN] JwtAccessTokenConverter - Unable to create an RSA verifier from verifierKey (ignoreable if using MAC)
13-Jun-2019 00:01:27 [WARN] JwtAccessTokenConverter - Unable to create an RSA verifier from verifierKey (ignoreable if using MAC)
13-Jun-2019 00:01:27 [WARN] JwtAccessTokenConverter - Unable to create an RSA verifier from verifierKey (ignoreable if using MAC)
13-Jun-2019 00:01:27 [WARN] JwtAccessTokenConverter - Unable to create an RSA verifier from verifierKey (ignoreable if using MAC)
13-Jun-2019 00:01:27 [WARN] JwtAccessTokenConverter - Unable to create an RSA verifier from verifierKey (ignoreable if using MAC)
13-Jun-2019 00:01:27 [WARN] JwtAccessTokenConverter - Unable to create an RSA verifier from verifierKey (ignoreable if using MAC)
13-Jun-2019 00:01:27 [WARN] JwtAccessTokenConverter - Unable to create an RSA verifier from verifierKey (ignoreable if using MAC)
13-Jun-2019 00:01:27 [WARN] JwtAccessTokenConverter - Unable to create an RSA verifier from verifierKey (ignoreable if using MAC)
13-Jun-2019 00:01:27 [WARN] JwtAccessTokenConverter - Unable to create an RSA verifier from verifierKey (ignoreable if using MAC)
13-Jun-2019 00:01:27 [WARN] JwtAccessTokenConverter - Unable to create an RSA verifier from verifierKey (ignoreable if using MAC)
13-Jun-2019 00:01:27 [WARN] JwtAccessTokenConverter - Unable to create an RSA verifier from verifierKey (ignoreable if using MAC)
13-Jun-2019 00:01:27 Tests run: 18, Failures: 0, Errors: 0, Skipped: 0, Time elapsed: 0.034 sec
13-Jun-2019 00:01:27 Running org.springframework.security.oauth2.provider.token.store.redis.RedisTokenStorePrefixTests
13-Jun-2019 00:01:31 Tests run: 15, Failures: 0, Errors: 0, Skipped: 0, Time elapsed: 3.112 sec
13-Jun-2019 00:01:31 Running org.springframework.security.oauth2.provider.token.store.redis.RedisTokenStoreMockTests
13-Jun-2019 00:01:31 Tests run: 2, Failures: 0, Errors: 0, Skipped: 0, Time elapsed: 0.064 sec
13-Jun-2019 00:01:31 Running org.springframework.security.oauth2.provider.token.store.redis.RedisTokenStoreTests
13-Jun-2019 00:01:34 Tests run: 16, Failures: 0, Errors: 0, Skipped: 0, Time elapsed: 3.054 sec
13-Jun-2019 00:01:34 Running org.springframework.security.oauth2.provider.token.store.JdbcTokenStoreTests
13-Jun-2019 00:01:34 Tests run: 14, Failures: 0, Errors: 0, Skipped: 0, Time elapsed: 0.161 sec
13-Jun-2019 00:01:34 Running org.springframework.security.oauth2.provider.token.DefaultTokenServicesAuthoritiesChangeTests
13-Jun-2019 00:01:34 Tests run: 1, Failures: 0, Errors: 0, Skipped: 0, Time elapsed: 0.001 sec
13-Jun-2019 00:01:34 Running org.springframework.security.oauth2.provider.token.DefaultUserAuthenticationConverterTests
13-Jun-2019 00:01:34 Tests run: 3, Failures: 0, Errors: 0, Skipped: 0, Time elapsed: 0.003 sec
13-Jun-2019 00:01:34 Running org.springframework.security.oauth2.provider.token.TokenServicesWithTokenEnhancerTests
13-Jun-2019 00:01:34 [WARN] JwtAccessTokenConverter - Unable to create an RSA verifier from verifierKey (ignoreable if using MAC)
13-Jun-2019 00:01:34 [WARN] JwtAccessTokenConverter - Unable to create an RSA verifier from verifierKey (ignoreable if using MAC)
13-Jun-2019 00:01:34 [WARN] JwtAccessTokenConverter - Unable to create an RSA verifier from verifierKey (ignoreable if using MAC)
13-Jun-2019 00:01:34 [WARN] JwtAccessTokenConverter - Unable to create an RSA verifier from verifierKey (ignoreable if using MAC)
13-Jun-2019 00:01:34 [WARN] JwtAccessTokenConverter - Unable to create an RSA verifier from verifierKey (ignoreable if using MAC)
13-Jun-2019 00:01:34 Tests run: 5, Failures: 0, Errors: 0, Skipped: 0, Time elapsed: 0.015 sec
13-Jun-2019 00:01:34 Running org.springframework.security.oauth2.provider.token.DefaultTokenServicesWithJwtTests
13-Jun-2019 00:01:34 [WARN] JwtAccessTokenConverter - Unable to create an RSA verifier from verifierKey (ignoreable if using MAC)
13-Jun-2019 00:01:34 [WARN] JwtAccessTokenConverter - Unable to create an RSA verifier from verifierKey (ignoreable if using MAC)
13-Jun-2019 00:01:34 [WARN] JwtAccessTokenConverter - Unable to create an RSA verifier from verifierKey (ignoreable if using MAC)
13-Jun-2019 00:01:34 [WARN] JwtAccessTokenConverter - Unable to create an RSA verifier from verifierKey (ignoreable if using MAC)
13-Jun-2019 00:01:34 [WARN] JwtAccessTokenConverter - Unable to create an RSA verifier from verifierKey (ignoreable if using MAC)
13-Jun-2019 00:01:34 [WARN] JwtAccessTokenConverter - Unable to create an RSA verifier from verifierKey (ignoreable if using MAC)
13-Jun-2019 00:01:34 [WARN] JwtAccessTokenConverter - Unable to create an RSA verifier from verifierKey (ignoreable if using MAC)
13-Jun-2019 00:01:34 [WARN] JwtAccessTokenConverter - Unable to create an RSA verifier from verifierKey (ignoreable if using MAC)
13-Jun-2019 00:01:34 [WARN] JwtAccessTokenConverter - Unable to create an RSA verifier from verifierKey (ignoreable if using MAC)
13-Jun-2019 00:01:34 [WARN] JwtAccessTokenConverter - Unable to create an RSA verifier from verifierKey (ignoreable if using MAC)
13-Jun-2019 00:01:34 [WARN] JwtAccessTokenConverter - Unable to create an RSA verifier from verifierKey (ignoreable if using MAC)
13-Jun-2019 00:01:34 [WARN] JwtAccessTokenConverter - Unable to create an RSA verifier from verifierKey (ignoreable if using MAC)
13-Jun-2019 00:01:34 [WARN] JwtAccessTokenConverter - Unable to create an RSA verifier from verifierKey (ignoreable if using MAC)
13-Jun-2019 00:01:34 [WARN] JwtAccessTokenConverter - Unable to create an RSA verifier from verifierKey (ignoreable if using MAC)
13-Jun-2019 00:01:34 [WARN] JwtAccessTokenConverter - Unable to create an RSA verifier from verifierKey (ignoreable if using MAC)
13-Jun-2019 00:01:34 Tests run: 15, Failures: 0, Errors: 0, Skipped: 0, Time elapsed: 0.038 sec
13-Jun-2019 00:01:34 Running org.springframework.security.oauth2.provider.token.DefaultTokenServicesTests
13-Jun-2019 00:01:34 Tests run: 1, Failures: 0, Errors: 0, Skipped: 0, Time elapsed: 0.004 sec
13-Jun-2019 00:01:34 Running org.springframework.security.oauth2.provider.token.DefaultTokenServicesWithInMemoryTests
13-Jun-2019 00:01:34 Tests run: 25, Failures: 0, Errors: 0, Skipped: 0, Time elapsed: 0.018 sec
13-Jun-2019 00:01:34 Running org.springframework.security.oauth2.provider.token.DefaultAccessTokenConverterTests
13-Jun-2019 00:01:34 Tests run: 15, Failures: 0, Errors: 0, Skipped: 0, Time elapsed: 0.003 sec
13-Jun-2019 00:01:34 Running org.springframework.security.oauth2.provider.implicit.InMemoryImplicitGrantServiceTests
13-Jun-2019 00:01:34 Tests run: 2, Failures: 0, Errors: 0, Skipped: 0, Time elapsed: 0.001 sec
13-Jun-2019 00:01:34 Running org.springframework.security.oauth2.provider.error.DefaultWebResponseExceptionTranslatorTests
13-Jun-2019 00:01:34 Tests run: 1, Failures: 0, Errors: 0, Skipped: 0, Time elapsed: 0 sec
13-Jun-2019 00:01:34 Running org.springframework.security.oauth2.provider.error.OAuth2AuthenticationEntryPointTests
13-Jun-2019 00:01:34 [WARN] DefaultHandlerExceptionResolver - Resolved exception caused by handler execution: org.springframework.web.HttpMediaTypeNotAcceptableException: Could not find acceptable representation
13-Jun-2019 00:01:34 Tests run: 7, Failures: 0, Errors: 0, Skipped: 0, Time elapsed: 0.033 sec
13-Jun-2019 00:01:34 Running org.springframework.security.oauth2.provider.error.OAuth2AccessDeniedHandlerTests
13-Jun-2019 00:01:34 Tests run: 1, Failures: 0, Errors: 0, Skipped: 0, Time elapsed: 0.004 sec
13-Jun-2019 00:01:34 Running org.springframework.security.oauth2.provider.authentication.OAuth2AuthenticationProcessingFilterTests
13-Jun-2019 00:01:34 Tests run: 8, Failures: 0, Errors: 0, Skipped: 0, Time elapsed: 0.04 sec
13-Jun-2019 00:01:34 Running org.springframework.security.oauth2.provider.authentication.OAuth2AuthenticationDetailsTests
13-Jun-2019 00:01:34 Tests run: 1, Failures: 0, Errors: 0, Skipped: 0, Time elapsed: 0 sec
13-Jun-2019 00:01:34 Running org.springframework.security.oauth2.provider.authentication.OAuth2AuthenticationManagerTests
13-Jun-2019 00:01:34 Tests run: 3, Failures: 0, Errors: 0, Skipped: 0, Time elapsed: 0.001 sec
13-Jun-2019 00:01:34 Running org.springframework.security.oauth2.provider.endpoint.FrameworkEndpointHandlerMappingTests
13-Jun-2019 00:01:34 Tests run: 4, Failures: 0, Errors: 0, Skipped: 0, Time elapsed: 0.001 sec
13-Jun-2019 00:01:34 Running org.springframework.security.oauth2.provider.endpoint.WhitelabelApprovalEndpointTests
13-Jun-2019 00:01:34 Tests run: 6, Failures: 0, Errors: 0, Skipped: 0, Time elapsed: 0.003 sec
13-Jun-2019 00:01:34 Running org.springframework.security.oauth2.provider.endpoint.ExactMatchRedirectResolverTests
13-Jun-2019 00:01:34 Tests run: 3, Failures: 0, Errors: 0, Skipped: 0, Time elapsed: 0.001 sec
13-Jun-2019 00:01:34 Running org.springframework.security.oauth2.provider.endpoint.AuthorizationEndpointTests
13-Jun-2019 00:01:34 Tests run: 34, Failures: 0, Errors: 0, Skipped: 0, Time elapsed: 0.022 sec
13-Jun-2019 00:01:34 Running org.springframework.security.oauth2.provider.endpoint.TokenEndpointTests
13-Jun-2019 00:01:34 Tests run: 6, Failures: 0, Errors: 0, Skipped: 0, Time elapsed: 0.009 sec
13-Jun-2019 00:01:34 Running org.springframework.security.oauth2.provider.endpoint.DefaultRedirectResolverTests
13-Jun-2019 00:01:34 Tests run: 31, Failures: 0, Errors: 0, Skipped: 0, Time elapsed: 0.008 sec
13-Jun-2019 00:01:34 Running org.springframework.security.oauth2.provider.endpoint.WhitelabelErrorEndpointTests
13-Jun-2019 00:01:34 Tests run: 3, Failures: 0, Errors: 0, Skipped: 0, Time elapsed: 0.001 sec
13-Jun-2019 00:01:34 Running org.springframework.security.oauth2.provider.endpoint.TokenEndpointAuthenticationFilterTests
13-Jun-2019 00:01:34 Tests run: 3, Failures: 0, Errors: 0, Skipped: 0, Time elapsed: 0.013 sec
13-Jun-2019 00:01:34 Running org.springframework.security.oauth2.provider.AuthorizationRequestTests
13-Jun-2019 00:01:34 Tests run: 9, Failures: 0, Errors: 0, Skipped: 0, Time elapsed: 0.004 sec
13-Jun-2019 00:01:34 Running org.springframework.security.oauth2.provider.OAuth2AuthenticationTests
13-Jun-2019 00:01:34 {"authorities":[{"authority":"ROLE_USER"}],"details":null,"authenticated":false,"userAuthentication":{"authorities":[{"authority":"ROLE_USER"}],"details":null,"authenticated":true,"principal":"foo","credentials":"bar","name":"foo"},"clientOnly":false,"oauth2Request":{"clientId":"id","scope":["read"],"requestParameters":{},"resourceIds":[],"authorities":[],"approved":false,"refresh":false,"redirectUri":null,"responseTypes":[],"extensions":{},"grantType":null,"refreshTokenRequest":null},"principal":"foo","credentials":"","name":"foo"}
13-Jun-2019 00:01:34 Tests run: 8, Failures: 0, Errors: 0, Skipped: 0, Time elapsed: 0.015 sec
13-Jun-2019 00:01:34 Running org.springframework.security.oauth2.provider.expression.OAuth2MethodSecurityExpressionHandlerTests
13-Jun-2019 00:01:34 Tests run: 9, Failures: 0, Errors: 0, Skipped: 0, Time elapsed: 0.008 sec
13-Jun-2019 00:01:34 Running org.springframework.security.oauth2.provider.expression.OAuth2SecurityExpressionMethodsTests
13-Jun-2019 00:01:34 Tests run: 10, Failures: 0, Errors: 0, Skipped: 0, Time elapsed: 0.002 sec
13-Jun-2019 00:01:34 Running org.springframework.security.oauth2.provider.expression.OAuth2WebSecurityExpressionHandlerTests
13-Jun-2019 00:01:34 Tests run: 6, Failures: 0, Errors: 0, Skipped: 0, Time elapsed: 0.003 sec
13-Jun-2019 00:01:34 Running org.springframework.security.oauth2.provider.expression.OAuth2ExpressionParserTests
13-Jun-2019 00:01:34 Tests run: 3, Failures: 0, Errors: 0, Skipped: 0, Time elapsed: 0.005 sec
13-Jun-2019 00:01:34 Running org.springframework.security.oauth2.provider.OAuth2RequestTests
13-Jun-2019 00:01:34 Tests run: 4, Failures: 0, Errors: 0, Skipped: 0, Time elapsed: 0 sec
13-Jun-2019 00:01:34 Running org.springframework.security.oauth2.provider.code.AuthorizationCodeTokenGranterTests
13-Jun-2019 00:01:34 Tests run: 5, Failures: 0, Errors: 0, Skipped: 0, Time elapsed: 0.002 sec
13-Jun-2019 00:01:34 Running org.springframework.security.oauth2.provider.code.InMemoryAuthorizationCodeServicesTests
13-Jun-2019 00:01:34 Tests run: 3, Failures: 0, Errors: 0, Skipped: 0, Time elapsed: 0 sec
13-Jun-2019 00:01:34 Running org.springframework.security.oauth2.provider.code.JdbcAuthorizationCodeServicesTests
13-Jun-2019 00:01:34 Tests run: 3, Failures: 0, Errors: 0, Skipped: 0, Time elapsed: 0.028 sec
13-Jun-2019 00:01:34 Running org.springframework.security.oauth2.provider.code.SubdomainRedirectResolverTests
13-Jun-2019 00:01:34 Tests run: 2, Failures: 0, Errors: 0, Skipped: 0, Time elapsed: 0.001 sec
13-Jun-2019 00:01:34 Running org.springframework.security.oauth2.common.OAuth2AccessTokenJackson1DeserializerTests
13-Jun-2019 00:01:35 Tests run: 8, Failures: 0, Errors: 0, Skipped: 0, Time elapsed: 1.076 sec
13-Jun-2019 00:01:35 Running org.springframework.security.oauth2.common.OAuth2AccessTokenJackson2DeserializerTests
13-Jun-2019 00:01:36 Tests run: 9, Failures: 0, Errors: 0, Skipped: 0, Time elapsed: 1.062 sec
13-Jun-2019 00:01:36 Running org.springframework.security.oauth2.common.exception.OAuth2ExceptionDeserializerTests
13-Jun-2019 00:01:36 Tests run: 13, Failures: 0, Errors: 0, Skipped: 0, Time elapsed: 0.007 sec
13-Jun-2019 00:01:36 Running org.springframework.security.oauth2.common.exception.OAuth2ExceptionSerializerTests
13-Jun-2019 00:01:36 Tests run: 11, Failures: 0, Errors: 0, Skipped: 0, Time elapsed: 0.008 sec
13-Jun-2019 00:01:36 Running org.springframework.security.oauth2.common.exception.OAuth2ExceptionJackson2DeserializerTests
13-Jun-2019 00:01:36 Tests run: 14, Failures: 0, Errors: 0, Skipped: 0, Time elapsed: 0.005 sec
13-Jun-2019 00:01:36 Running org.springframework.security.oauth2.common.OAuth2AccessTokenJackson2SerializerTests
13-Jun-2019 00:01:37 Tests run: 10, Failures: 0, Errors: 0, Skipped: 0, Time elapsed: 0.911 sec
13-Jun-2019 00:01:37 Running org.springframework.security.oauth2.common.OAuth2AccessTokenJackson1SerializerTests
13-Jun-2019 00:01:41 Tests run: 1, Failures: 0, Errors: 0, Skipped: 0, Time elapsed: 3.581 sec
13-Jun-2019 00:01:42 Exception: java.lang.OutOfMemoryError thrown from the UncaughtExceptionHandler in thread "main"
13-Jun-2019 00:01:42
13-Jun-2019 00:01:42 Results :
13-Jun-2019 00:01:42
13-Jun-2019 00:01:42 Tests run: 696, Failures: 0, Errors: 0, Skipped: 0
13-Jun-2019 00:01:42
13-Jun-2019 00:01:42 [INFO] ------------------------------------------------------------------------
13-Jun-2019 00:01:42 [INFO] Reactor Summary:
13-Jun-2019 00:01:42 [INFO]
13-Jun-2019 00:01:42 [INFO] OAuth for Spring Security .......................... SUCCESS [  0.968 s]
13-Jun-2019 00:01:42 [INFO] OAuth 1(a) for Spring Security ..................... SUCCESS [  8.808 s]
13-Jun-2019 00:01:42 [INFO] OAuth2 for Spring Security ......................... FAILURE [ 49.496 s]
13-Jun-2019 00:01:42 [INFO] spring-oauth2-tests ................................ SKIPPED
13-Jun-2019 00:01:42 [INFO] spring-oauth2-tests-common ......................... SKIPPED
13-Jun-2019 00:01:42 [INFO] spring-oauth2-tests-vanilla ........................ SKIPPED
13-Jun-2019 00:01:42 [INFO] spring-oauth2-tests-mappings ....................... SKIPPED
13-Jun-2019 00:01:42 [INFO] spring-oauth2-tests-form ........................... SKIPPED
13-Jun-2019 00:01:42 [INFO] spring-oauth2-tests-jwt ............................ SKIPPED
13-Jun-2019 00:01:42 [INFO] spring-oauth2-tests-approval ....................... SKIPPED
13-Jun-2019 00:01:42 [INFO] spring-oauth2-tests-jdbc ........................... SKIPPED
13-Jun-2019 00:01:42 [INFO] spring-oauth2-tests-jpa ............................ SKIPPED
13-Jun-2019 00:01:42 [INFO] spring-oauth2-tests-jaxb ........................... SKIPPED
13-Jun-2019 00:01:42 [INFO] spring-oauth-tests-custom-grant .................... SKIPPED
13-Jun-2019 00:01:42 [INFO] spring-oauth2-tests-multi .......................... SKIPPED
13-Jun-2019 00:01:42 [INFO] spring-oauth2-tests-client ......................... SKIPPED
13-Jun-2019 00:01:42 [INFO] spring-oauth2-tests-resource ....................... SKIPPED
13-Jun-2019 00:01:42 [INFO] spring-oauth2-tests-custom-authentication .......... SKIPPED
13-Jun-2019 00:01:42 [INFO] spring-oauth2-tests-xml ............................ SKIPPED
13-Jun-2019 00:01:42 [INFO] spring-oauth2-tests-xml-common ..................... SKIPPED
13-Jun-2019 00:01:42 [INFO] spring-oauth2-tests-xml-vanilla .................... SKIPPED
13-Jun-2019 00:01:42 [INFO] spring-oauth2-tests-xml-mappings ................... SKIPPED
13-Jun-2019 00:01:42 [INFO] spring-oauth2-tests-xml-form ....................... SKIPPED
13-Jun-2019 00:01:42 [INFO] spring-oauth2-tests-xml-jwt ........................ SKIPPED
13-Jun-2019 00:01:42 [INFO] spring-oauth2-tests-xml-approval ................... SKIPPED
13-Jun-2019 00:01:42 [INFO] spring-oauth2-tests-xml-jdbc ....................... SKIPPED
13-Jun-2019 00:01:42 [INFO] spring-oauth2-tests-xml-client ..................... SKIPPED
13-Jun-2019 00:01:42 [INFO] OAuth for Spring Security - Integration Tests ...... SKIPPED
13-Jun-2019 00:01:42 [INFO] OAuth for Spring Security - Sparklr (OAuth 1 Provider Example) SKIPPED
13-Jun-2019 00:01:42 [INFO] OAuth for Spring Security - Tonr (OAuth 1 Consumer Example) SKIPPED
13-Jun-2019 00:01:42 [INFO] OAuth for Spring Security - Sparklr2 (OAuth 2 Provider Example) SKIPPED
13-Jun-2019 00:01:42 [INFO] OAuth for Spring Security - Tonr2 (OAuth 2 Client Example) SKIPPED
13-Jun-2019 00:01:42 [INFO] OAuth for Spring Security - Samples ................ SKIPPED
13-Jun-2019 00:01:42 [INFO] ------------------------------------------------------------------------
13-Jun-2019 00:01:42 [INFO] BUILD FAILURE
13-Jun-2019 00:01:42 [INFO] ------------------------------------------------------------------------
13-Jun-2019 00:01:42 [INFO] Total time: 01:03 min
13-Jun-2019 00:01:42 [INFO] Finished at: 2019-06-13T00:01:42+00:00
13-Jun-2019 00:01:43 [INFO] Final Memory: 78M/452M
13-Jun-2019 00:01:43 [INFO] ------------------------------------------------------------------------
13-Jun-2019 00:01:43 [ERROR] Failed to execute goal org.apache.maven.plugins:maven-surefire-plugin:2.12.4:test (default-test) on project spring-security-oauth2: Execution default-test of goal org.apache.maven.plugins:maven-surefire-plugin:2.12.4:test failed: The forked VM terminated without saying properly goodbye. VM crash or System.exit called ? -> [Help 1]
13-Jun-2019 00:01:43 [ERROR]
13-Jun-2019 00:01:43 [ERROR] To see the full stack trace of the errors, re-run Maven with the -e switch.
13-Jun-2019 00:01:43 [ERROR] Re-run Maven using the -X switch to enable full debug logging.
13-Jun-2019 00:01:43 [ERROR]
13-Jun-2019 00:01:43 [ERROR] For more information about the errors and possible solutions, please read the following articles:
13-Jun-2019 00:01:43 [ERROR] [Help 1] http://cwiki.apache.org/confluence/display/MAVEN/PluginExecutionException
13-Jun-2019 00:01:43 [ERROR]
13-Jun-2019 00:01:43 [ERROR] After correcting the problems, you can resume the build with the command
13-Jun-2019 00:01:43 [ERROR]   mvn <goals> -rf :spring-security-oauth2
13-Jun-2019 00:01:43 Exception in thread "main"
13-Jun-2019 00:01:43
13-Jun-2019 00:01:43 Failing task since return code of [/opt/jdk-7/bin/java -cp /opt/maven-3.3/boot/plexus-classworlds-2.5.2.jar -Dclassworlds.conf=/tmp/artifactoryM22924879324647553416conf -DbuildInfoConfig.propertiesFile=/tmp/buildInfo253266235193645538.properties -Xmx1256m -Xms128m -Dmaven.home=/opt/maven-3.3 -Dmaven.multiModuleProjectDirectory=/opt/bamboo-home/xml-data/build-dir/SECOAUTH-NIGHTLY-JOB1 org.codehaus.plexus.classworlds.launcher.Launcher clean install -P bootstrap -Dartifactory.publish.password=********] was 1 while expected 0
13-Jun-2019 00:01:43 Finished task 'Artifactory Maven 3' with result: Failed
13-Jun-2019 00:01:43 Running post build plugin 'Docker Container Cleanup'
13-Jun-2019 00:01:43 Running post build plugin 'NCover Results Collector'
13-Jun-2019 00:01:43 Running post build plugin 'Artifactory Release Management Staging'
13-Jun-2019 00:01:43 Running post build plugin 'Artifactory Build Info Copier'
13-Jun-2019 00:01:43 Running post build plugin 'Artifactory Gradle Properties Info Copier'
13-Jun-2019 00:01:43 Running post build plugin 'Clover Results Collector'
13-Jun-2019 00:01:43 Running post build plugin 'npm Cache Cleanup'
13-Jun-2019 00:01:43 Running post build plugin 'Artifact Copier'
13-Jun-2019 00:01:43 Successfully removed working directory at '/opt/bamboo-home/xml-data/build-dir/SECOAUTH-NIGHTLY-JOB1'
13-Jun-2019 00:01:43 Finalising the build...
13-Jun-2019 00:01:43 Stopping timer.
13-Jun-2019 00:01:43 Build SECOAUTH-NIGHTLY-JOB1-1673 completed.
13-Jun-2019 00:01:43 Running on server: post build plugin 'NCover Results Collector'
13-Jun-2019 00:01:43 Running on server: post build plugin 'Build Hanging Detection Configuration'
13-Jun-2019 00:01:43 Running on server: post build plugin 'Clover Delta Calculator'
13-Jun-2019 00:01:43 Running on server: post build plugin 'Maven Dependencies Postprocessor'
13-Jun-2019 00:01:43 All post build plugins have finished
13-Jun-2019 00:01:43 Generating build results summary...
13-Jun-2019 00:01:43 Saving build results to disk...
13-Jun-2019 00:01:43 Logging substituted variables...
13-Jun-2019 00:01:43 Indexing build results...
13-Jun-2019 00:01:43 Finished building SECOAUTH-NIGHTLY-JOB1-1673.