Build: #1675 failed

Job: Default Job failed

Stages & jobs

  1. Default Stage

Build log

The build generated 636 lines of output. Download or view full build log

15-Jun-2019 00:00:07 Build Spring Security OAuth - 2.1.x - Default Job #1675 (SECOAUTH-NIGHTLY-JOB1-1675) started building on agent bamboo-15.af.pivotal.io
15-Jun-2019 00:00:07 Remote agent on host bamboo-15.af.pivotal.io
15-Jun-2019 00:00:08 Build working directory is /opt/bamboo-home/xml-data/build-dir/SECOAUTH-NIGHTLY-JOB1
15-Jun-2019 00:00:08 Executing build Spring Security OAuth - 2.1.x - Default Job #1675 (SECOAUTH-NIGHTLY-JOB1-1675)
15-Jun-2019 00:00:08 Starting task 'Checkout Default Repository' of type 'com.atlassian.bamboo.plugins.vcs:task.vcs.checkout'
15-Jun-2019 00:00:08 Build always requires a clean checkout
15-Jun-2019 00:00:08 Cleaning build directory '/opt/bamboo-home/xml-data/build-dir/SECOAUTH-NIGHTLY-JOB1'
15-Jun-2019 00:00:08 Checking out into /opt/bamboo-home/xml-data/build-dir/SECOAUTH-NIGHTLY-JOB1
15-Jun-2019 00:00:08 Updating source code to revision: 3d37444a991104dd7f23edb2812e9f57620a1395
15-Jun-2019 00:00:08 Creating local git repository in '/opt/bamboo-home/xml-data/build-dir/SECOAUTH-NIGHTLY-JOB1/.git'.
15-Jun-2019 00:00:08 Initialized empty Git repository in /opt/bamboo-home/xml-data/build-dir/SECOAUTH-NIGHTLY-JOB1/.git/
15-Jun-2019 00:00:10 Fetching 'refs/heads/master' from 'git://github.com/SpringSource/spring-security-oauth.git'. Will try to do a shallow fetch.
15-Jun-2019 00:00:12 From git://github.com/SpringSource/spring-security-oauth
15-Jun-2019 00:00:12 * [new branch]      master     -> master
15-Jun-2019 00:00:12 Checking out revision 3d37444a991104dd7f23edb2812e9f57620a1395.
15-Jun-2019 00:00:12 Already on 'master'
15-Jun-2019 00:00:12 Updated source code to revision: 3d37444a991104dd7f23edb2812e9f57620a1395
15-Jun-2019 00:00:12 Finished task 'Checkout Default Repository' with result: Success
15-Jun-2019 00:00:12 Running pre-build action: Artifactory Release Staging
15-Jun-2019 00:00:12 Running pre-build action: VCS Version Collector
15-Jun-2019 00:00:14 Skipping execution of task 'Build' as it is disabled
15-Jun-2019 00:00:14 Starting task 'Artifactory Maven 3' of type 'org.jfrog.bamboo.bamboo-artifactory-plugin:maven3Task'
15-Jun-2019 00:00:14 Bamboo Artifactory Plugin version: 2.6.3
15-Jun-2019 00:00:14
Beginning to execute external process for build 'Spring Security OAuth - 2.1.x - Default Job #1675 (SECOAUTH-NIGHTLY-JOB1-1675)'
... running command line:
/opt/jdk-7/bin/java -cp /opt/maven-3.3/boot/plexus-classworlds-2.5.2.jar -Dclassworlds.conf=/tmp/artifactoryM21077694723966948097conf -DbuildInfoConfig.propertiesFile=/tmp/buildInfo1742487486171861803.properties -Xmx1256m -Xms128m -Dmaven.home=/opt/maven-3.3 -Dmaven.multiModuleProjectDirectory=/opt/bamboo-home/xml-data/build-dir/SECOAUTH-NIGHTLY-JOB1 org.codehaus.plexus.classworlds.launcher.Launcher clean install -P bootstrap -Dartifactory.publish.password=********
... in: /opt/bamboo-home/xml-data/build-dir/SECOAUTH-NIGHTLY-JOB1
... using extra environment variables:
bamboo_planRepository_1_branch=master
bamboo_capability_system_builder_ant_Ant_1_7=/opt/ant-1.7
bamboo_repository_94273667_previous_revision_number=3d37444a991104dd7f23edb2812e9f57620a1395
bamboo_********_username_password=********
bamboo_signing_store_password=********
bamboo_capability_system_builder_ant_Ant_1_9=/opt/ant-1.9
bamboo_capability_system_builder_ant_Ant_1_8=/opt/ant-1.8
bamboo_planRepository_1_branchDisplayName=master
bamboo_artifactory_override_resolve_repo=libs-milestone
bamboo_capability_system_builder_node_Node_js_10_16=/opt/node-10.16/bin/node
bamboo_repository_revision_number=3d37444a991104dd7f23edb2812e9f57620a1395
bamboo_RIAK_BIN=/usr/sbin/riak
bamboo_repository_94273667_revision_number=3d37444a991104dd7f23edb2812e9f57620a1395
WRAPPER_BITS=32
bamboo_buildKey=SECOAUTH-NIGHTLY-JOB1
bamboo_repository_94273667_git_branch=master
bamboo_bintray_password=********
bamboo_sonar_token_password=********
PWD=/opt/bamboo-home/bin
bamboo_shortJobName=Default Job
bamboo_artifactory_override_resolver_password=********
bamboo_capability_system_builder_gradle___gradlew=./gradlew
bamboo_buildResultsUrl=https://build.spring.io/browse/SECOAUTH-NIGHTLY-JOB1-1675
bamboo_capability_system_builder_mvn3_Maven_3_3=/opt/maven-3.3
bamboo_capability_system_builder_mvn3_Maven_3_2=/opt/maven-3.2
bamboo_capability_system_builder_mvn3_Maven_3_1=/opt/maven-3.1
bamboo_planRepository_repositoryUrl=git://github.com/SpringSource/spring-security-oauth.git
bamboo_capability_system_builder_mvn3_Maven_3_6=/opt/maven-3.6
bamboo_agentId=286195723
bamboo_capability_system_builder_mvn3_Maven_3_5=/opt/maven-3.5
bamboo_capability_system_builder_mvn3_Maven_3_0=/opt/maven-3.0
bamboo_planRepository_revision=3d37444a991104dd7f23edb2812e9f57620a1395
bamboo_planRepository_previousRevision=3d37444a991104dd7f23edb2812e9f57620a1395
bamboo_capability_remote_build=true
bamboo_repository_branch_name=master
bamboo_sonatype_token_password=********
SHLVL=1
bamboo_org_jfrog_bamboo_buildInfo_serverUrl=https://repo.spring.io
bamboo_scdf_acceptance_tests_password=********
bamboo_repository_94273667_branch_name=master
WRAPPER_OS=linux
TERM=linux
XDG_SESSION_ID=c1
bamboo_planRepository_branch=master
bamboo_org_jfrog_bamboo_release_activated=false
bamboo_planRepository_1_type=gitv2
bamboo_planRepository_branchName=master
bamboo_capability_system_jdk_JDK_12=/opt/jdk-12
WRAPPER_FILE_SEPARATOR=/
_=/opt/bamboo-home/bin/bamboo-agent.sh
bamboo_capability_system_builder_ant_Ant_1_10=/opt/ant-1.10
bamboo_repository_94273667_name=Plan Repository
WRAPPER_PATH_SEPARATOR=:
bamboo_sonar_password=********
bamboo_hg_cache_directory=/opt/bamboo-home/xml-data/build-dir/_hg-repositories-cache
bamboo_planRepository_1_username=
bamboo_planRepository_type=gitv2
bamboo_git_cache_directory=/opt/bamboo-home/xml-data/build-dir/_git-repositories-cache
bamboo_artifactory_username=buildmaster
bamboo_tmp_directory=/opt/bamboo-home/temp
bamboo_planKey=SECOAUTH-NIGHTLY
bamboo_planRepository_username=
bamboo_JDK8_HOME=/opt/jdk-8
bamboo_repository_94273667_git_username=
bamboo_planRepository_1_branchName=master
bamboo_sonar_version=5.6.3
bamboo_sonar_jdbc_password=********
bamboo_bintray_api_key_password=********
XDG_DATA_DIRS=/usr/local/share:/usr/share:/var/lib/snapd/desktop
bamboo_capability_system_jdk_JDK_1_11=/opt/jdk-11
bamboo_resultsUrl=https://build.spring.io/browse/SECOAUTH-NIGHTLY-JOB1-1675
bamboo_capability_system_jdk_JDK_1_10=/opt/jdk-10
bamboo_build_working_directory=/opt/bamboo-home/xml-data/build-dir/SECOAUTH-NIGHTLY-JOB1
bamboo_planRepository_1_name=Plan Repository
bamboo_capability_system_os=ubuntu1804
bamboo_nexusPush_stagingProfile=buildmaster
bamboo_shortPlanName=2.1.x
MAIL=/var/mail/bamboo
bamboo_planRepository_name=Plan Repository
LOGNAME=bamboo
bamboo_buildNumber=1675
SHELL=/bin/bash
bamboo_planName=Spring Security OAuth - 2.1.x
bamboo_JDK7_HOME=/opt/jdk-7
bamboo_repository_94273667_git_repositoryUrl=git://github.com/SpringSource/spring-security-oauth.git
bamboo_shortPlanKey=NIGHTLY
OLDPWD=/opt/users/bamboo
bamboo_shortJobKey=JOB1
bamboo_artifactory_password=********
bamboo_buildTimeStamp=2019-06-15T00:00:06.822Z
bamboo_repository_previous_revision_number=3d37444a991104dd7f23edb2812e9f57620a1395
bamboo_sonar_username=buildmaster
bamboo_********_password=********
bamboo_repository_git_branch=master
bamboo_buildResultKey=SECOAUTH-NIGHTLY-JOB1-1675
bamboo_nexusPush_close=true
bamboo_artifactory_override_resolver_username=buildmaster
bamboo_buildPlanName=Spring Security OAuth - 2.1.x - Default Job
bamboo_planRepository_1_revision=3d37444a991104dd7f23edb2812e9f57620a1395
bamboo_repository_name=Plan Repository
bamboo_signing_key_password=********
bamboo_capability_system_builder_groovy_Groovy_2_5=/opt/groovy-2.5
LANG=en_US.UTF-8
bamboo_buildFailed=false
bamboo_capability_system_docker_executable=/usr/bin/docker
DISPLAY=localhost:1.0
bamboo_capability_system_jdk_OpenJDK_7=/opt/jdk-7
bamboo_capability_system_builder_groovy_Groovy_2_4=/opt/groovy-2.4
bamboo_artifactory_override_deployer_username=buildmaster
bamboo_capability_system_builder_command_Bash=/bin/bash
bamboo_artifactory_password_mask_a=********
bamboo_agentWorkingDirectory=/opt/bamboo-home/xml-data/build-dir
bamboo_capability_system_git_executable=/usr/bin/git
bamboo_repository_git_username=
bamboo_planRepository_1_previousRevision=3d37444a991104dd7f23edb2812e9f57620a1395
bamboo_capability_os_family=unix
bamboo_planRepository_branchDisplayName=master
bamboo_capability_system_builder_maven_Artifactory_Maven_3_6=/opt/maven-3.6
bamboo_capability_system_builder_maven_Artifactory_Maven_3_5=/opt/maven-3.5
GIT_SSL_NO_VERIFY=true
bamboo_capability_system_builder_maven_Artifactory_Maven_3_3=/opt/maven-3.3
bamboo_capability_system_builder_maven_Artifactory_Maven_3_2=/opt/maven-3.2
bamboo_s3_properties=/home/bamboo/tools/s3.properties
bamboo_capability_system_builder_maven_Artifactory_Maven_3_1=/opt/maven-3.1
bamboo_artifactory_override_deploy_repo=libs-snapshot-local
bamboo_capability_system_builder_maven_Artifactory_Maven_3_0=/opt/maven-3.0
bamboo_plan_storageTag=SECOAUTH-NIGHTLY
bamboo_bintray_username_password=********
USER=bamboo
bamboo_repository_git_repositoryUrl=git://github.com/SpringSource/spring-security-oauth.git
bamboo_working_directory=/opt/bamboo-home/xml-data/build-dir/SECOAUTH-NIGHTLY-JOB1
bamboo_org_jfrog_bamboo_buildInfo_activated=true
bamboo_planRepository_1_repositoryUrl=git://github.com/SpringSource/spring-security-oauth.git
bamboo_capability_system_jdk_JDK_1_8=/opt/jdk-8
bamboo_artifactory_override_deployer_password=********
bamboo_capability_system_jdk_JDK_1_9=/opt/jdk-9
WRAPPER_ARCH=x86
bamboo_capability_system_jdk_JDK_1_6=/opt/jdk-6
bamboo_sonatype_password=********
bamboo_capability_system_jdk_JDK_1_7=/opt/jdk-7
bamboo_sonar_ip=10.194.6.9
XDG_RUNTIME_DIR=/run/user/1002
HOME=/home/bamboo
PATH=/bin:/home/bamboo/bin:/usr/local/sbin:/usr/local/bin:/usr/sbin:/usr/bin:/sbin:/bin:/usr/games:/usr/local/games:/snap/bin:/home/bamboo/bin:/usr/local/bin:/bin:/home/bamboo/bin:/usr/local/sbin:/usr/local/bin:/usr/sbin:/usr/bin:/sbin:/bin:/usr/games:/usr/local/games:/snap/bin:/home/bamboo/bin:/usr/local/bin
15-Jun-2019 00:00:15 [INFO] Scanning for projects...
15-Jun-2019 00:00:16 Downloading: https://repo.spring.io/libs-snapshot-local/org/springframework/boot/spring-boot-starter-parent/1.5.1.RELEASE/spring-boot-starter-parent-1.5.1.RELEASE.pom
15-Jun-2019 00:00:16
15-Jun-2019 00:00:16 Downloading: https://repo.spring.io/libs-milestone-local/org/springframework/boot/spring-boot-starter-parent/1.5.1.RELEASE/spring-boot-starter-parent-1.5.1.RELEASE.pom
15-Jun-2019 00:00:16
15-Jun-2019 00:00:16 Downloading: https://repo.spring.io/release/org/springframework/boot/spring-boot-starter-parent/1.5.1.RELEASE/spring-boot-starter-parent-1.5.1.RELEASE.pom
15-Jun-2019 00:00:16 1/8 KB   
15-Jun-2019 00:00:16 3/8 KB   
15-Jun-2019 00:00:16 4/8 KB   
15-Jun-2019 00:00:16 5/8 KB   
15-Jun-2019 00:00:16 7/8 KB   
15-Jun-2019 00:00:16 8/8 KB   
15-Jun-2019 00:00:16          
15-Jun-2019 00:00:16 Downloaded: https://repo.spring.io/release/org/springframework/boot/spring-boot-starter-parent/1.5.1.RELEASE/spring-boot-starter-parent-1.5.1.RELEASE.pom (8 KB at 37.2 KB/sec)
15-Jun-2019 00:00:16 Downloading: https://repo.spring.io/libs-snapshot-local/org/springframework/boot/spring-boot-dependencies/1.5.1.RELEASE/spring-boot-dependencies-1.5.1.RELEASE.pom
15-Jun-2019 00:00:16          
15-Jun-2019 00:00:17 Downloading: https://repo.spring.io/libs-milestone-local/org/springframework/boot/spring-boot-dependencies/1.5.1.RELEASE/spring-boot-dependencies-1.5.1.RELEASE.pom
15-Jun-2019 00:00:17          
15-Jun-2019 00:00:17 Downloading: https://repo.spring.io/release/org/springframework/boot/spring-boot-dependencies/1.5.1.RELEASE/spring-boot-dependencies-1.5.1.RELEASE.pom
15-Jun-2019 00:00:17 1/88 KB   
15-Jun-2019 00:00:17 3/88 KB   
15-Jun-2019 00:00:17 4/88 KB   
15-Jun-2019 00:00:17 5/88 KB   
15-Jun-2019 00:00:17 7/88 KB   
15-Jun-2019 00:00:17 8/88 KB   
15-Jun-2019 00:00:17 9/88 KB   
15-Jun-2019 00:00:17 11/88 KB   
15-Jun-2019 00:00:17 12/88 KB   
15-Jun-2019 00:00:17 13/88 KB   
15-Jun-2019 00:00:17 15/88 KB   
15-Jun-2019 00:00:17 16/88 KB   
15-Jun-2019 00:00:17 17/88 KB   
15-Jun-2019 00:00:17 19/88 KB   
15-Jun-2019 00:00:17 20/88 KB   
15-Jun-2019 00:00:17 21/88 KB   
15-Jun-2019 00:00:17 23/88 KB   
15-Jun-2019 00:00:17 24/88 KB   
15-Jun-2019 00:00:17 25/88 KB   
15-Jun-2019 00:00:17 27/88 KB   
15-Jun-2019 00:00:17 28/88 KB   
15-Jun-2019 00:00:17 29/88 KB   
15-Jun-2019 00:00:17 31/88 KB   
15-Jun-2019 00:00:17 32/88 KB   
15-Jun-2019 00:00:17 33/88 KB   
15-Jun-2019 00:00:17 35/88 KB   
15-Jun-2019 00:00:17 36/88 KB   
15-Jun-2019 00:00:17 37/88 KB   
15-Jun-2019 00:00:17 39/88 KB   
15-Jun-2019 00:00:17 40/88 KB   
15-Jun-2019 00:00:17 41/88 KB   
15-Jun-2019 00:00:17 43/88 KB   
15-Jun-2019 00:00:17 44/88 KB   
15-Jun-2019 00:00:17 45/88 KB   
15-Jun-2019 00:00:17 47/88 KB   
15-Jun-2019 00:00:17 48/88 KB   
15-Jun-2019 00:00:17 49/88 KB   
15-Jun-2019 00:00:17 51/88 KB   
15-Jun-2019 00:00:17 52/88 KB   
15-Jun-2019 00:00:17 53/88 KB   
15-Jun-2019 00:00:17 55/88 KB   
15-Jun-2019 00:00:17 56/88 KB   
15-Jun-2019 00:00:17 57/88 KB   
15-Jun-2019 00:00:17 59/88 KB   
15-Jun-2019 00:00:17 60/88 KB   
15-Jun-2019 00:00:17 61/88 KB   
15-Jun-2019 00:00:17 63/88 KB   
15-Jun-2019 00:00:17 63/88 KB   
15-Jun-2019 00:00:17 64/88 KB   
15-Jun-2019 00:00:17 65/88 KB   
15-Jun-2019 00:00:17 67/88 KB   
15-Jun-2019 00:00:17 68/88 KB   
15-Jun-2019 00:00:17 69/88 KB   
15-Jun-2019 00:00:17 71/88 KB   
15-Jun-2019 00:00:17 72/88 KB   
15-Jun-2019 00:00:17 73/88 KB   
15-Jun-2019 00:00:17 75/88 KB   
15-Jun-2019 00:00:17 76/88 KB   
15-Jun-2019 00:00:17 77/88 KB   
15-Jun-2019 00:00:17 79/88 KB   
15-Jun-2019 00:00:17 80/88 KB   
15-Jun-2019 00:00:17 81/88 KB   
15-Jun-2019 00:00:17 83/88 KB   
15-Jun-2019 00:00:17 84/88 KB   
15-Jun-2019 00:00:17 85/88 KB   
15-Jun-2019 00:00:17 87/88 KB   
15-Jun-2019 00:00:17 88/88 KB   
15-Jun-2019 00:00:17            
15-Jun-2019 00:00:17 Downloaded: https://repo.spring.io/release/org/springframework/boot/spring-boot-dependencies/1.5.1.RELEASE/spring-boot-dependencies-1.5.1.RELEASE.pom (88 KB at 250.4 KB/sec)
15-Jun-2019 00:00:18 [INFO] Initializing Artifactory Build-Info Recording
15-Jun-2019 00:00:18 [INFO] ------------------------------------------------------------------------
15-Jun-2019 00:00:18 [INFO] Reactor Build Order:
15-Jun-2019 00:00:18 [INFO]
15-Jun-2019 00:00:18 [INFO] OAuth for Spring Security
15-Jun-2019 00:00:18 [INFO] OAuth 1(a) for Spring Security
15-Jun-2019 00:00:18 [INFO] OAuth2 for Spring Security
15-Jun-2019 00:00:18 [INFO] spring-oauth2-tests
15-Jun-2019 00:00:18 [INFO] spring-oauth2-tests-common
15-Jun-2019 00:00:18 [INFO] spring-oauth2-tests-vanilla
15-Jun-2019 00:00:18 [INFO] spring-oauth2-tests-mappings
15-Jun-2019 00:00:18 [INFO] spring-oauth2-tests-form
15-Jun-2019 00:00:18 [INFO] spring-oauth2-tests-jwt
15-Jun-2019 00:00:18 [INFO] spring-oauth2-tests-approval
15-Jun-2019 00:00:18 [INFO] spring-oauth2-tests-jdbc
15-Jun-2019 00:00:18 [INFO] spring-oauth2-tests-jpa
15-Jun-2019 00:00:18 [INFO] spring-oauth2-tests-jaxb
15-Jun-2019 00:00:18 [INFO] spring-oauth-tests-custom-grant
15-Jun-2019 00:00:18 [INFO] spring-oauth2-tests-multi
15-Jun-2019 00:00:18 [INFO] spring-oauth2-tests-client
15-Jun-2019 00:00:18 [INFO] spring-oauth2-tests-resource
15-Jun-2019 00:00:18 [INFO] spring-oauth2-tests-custom-authentication
15-Jun-2019 00:00:18 [INFO] spring-oauth2-tests-xml
15-Jun-2019 00:00:18 [INFO] spring-oauth2-tests-xml-common
15-Jun-2019 00:00:18 [INFO] spring-oauth2-tests-xml-vanilla
15-Jun-2019 00:00:18 [INFO] spring-oauth2-tests-xml-mappings
15-Jun-2019 00:00:18 [INFO] spring-oauth2-tests-xml-form
15-Jun-2019 00:00:18 [INFO] spring-oauth2-tests-xml-jwt
15-Jun-2019 00:00:18 [INFO] spring-oauth2-tests-xml-approval
15-Jun-2019 00:00:18 [INFO] spring-oauth2-tests-xml-jdbc
15-Jun-2019 00:00:18 [INFO] spring-oauth2-tests-xml-client
15-Jun-2019 00:00:18 [INFO] OAuth for Spring Security - Integration Tests
15-Jun-2019 00:00:18 [INFO] OAuth for Spring Security - Sparklr (OAuth 1 Provider Example)
15-Jun-2019 00:00:18 [INFO] OAuth for Spring Security - Tonr (OAuth 1 Consumer Example)
15-Jun-2019 00:00:18 [INFO] OAuth for Spring Security - Sparklr2 (OAuth 2 Provider Example)
15-Jun-2019 00:00:18 [INFO] OAuth for Spring Security - Tonr2 (OAuth 2 Client Example)
15-Jun-2019 00:00:18 [INFO] OAuth for Spring Security - Samples
15-Jun-2019 00:00:18 [INFO]                                                                         
15-Jun-2019 00:00:18 [INFO] ------------------------------------------------------------------------
15-Jun-2019 00:00:18 [INFO] Building OAuth for Spring Security 2.3.7.BUILD-SNAPSHOT
15-Jun-2019 00:00:18 [INFO] ------------------------------------------------------------------------
15-Jun-2019 00:00:19 [INFO]
15-Jun-2019 00:00:19 [INFO] --- maven-clean-plugin:2.5:clean (default-clean) @ spring-security-oauth-parent ---
15-Jun-2019 00:00:19 [INFO]
15-Jun-2019 00:00:19 [INFO] >>> maven-source-plugin:2.1.2:jar (attach-sources) > generate-sources @ spring-security-oauth-parent >>>
15-Jun-2019 00:00:19 [INFO]
15-Jun-2019 00:00:19 [INFO] <<< maven-source-plugin:2.1.2:jar (attach-sources) < generate-sources @ spring-security-oauth-parent <<<
15-Jun-2019 00:00:19 [INFO]
15-Jun-2019 00:00:19 [INFO] --- maven-source-plugin:2.1.2:jar (attach-sources) @ spring-security-oauth-parent ---
15-Jun-2019 00:00:19 [INFO]
15-Jun-2019 00:00:19 [INFO] --- maven-javadoc-plugin:2.9.1:jar (javadoc) @ spring-security-oauth-parent ---
15-Jun-2019 00:00:19 [INFO] Not executing Javadoc as the project is not a Java classpath-capable package
15-Jun-2019 00:00:19 [INFO]
15-Jun-2019 00:00:19 [INFO] --- maven-install-plugin:2.4:install (default-install) @ spring-security-oauth-parent ---
15-Jun-2019 00:00:19 [INFO] Installing /opt/bamboo-home/xml-data/build-dir/SECOAUTH-NIGHTLY-JOB1/pom.xml to /home/bamboo/.m2/repository/org/springframework/security/oauth/spring-security-oauth-parent/2.3.7.BUILD-SNAPSHOT/spring-security-oauth-parent-2.3.7.BUILD-SNAPSHOT.pom
15-Jun-2019 00:00:19 [INFO]                                                                         
15-Jun-2019 00:00:19 [INFO] ------------------------------------------------------------------------
15-Jun-2019 00:00:19 [INFO] Building OAuth 1(a) for Spring Security 2.3.7.BUILD-SNAPSHOT
15-Jun-2019 00:00:19 [INFO] ------------------------------------------------------------------------
15-Jun-2019 00:00:20 [INFO]
15-Jun-2019 00:00:20 [INFO] --- maven-clean-plugin:2.5:clean (default-clean) @ spring-security-oauth ---
15-Jun-2019 00:00:20 [INFO]
15-Jun-2019 00:00:20 [INFO] --- maven-resources-plugin:2.6:resources (default-resources) @ spring-security-oauth ---
15-Jun-2019 00:00:20 [INFO] Using 'UTF-8' encoding to copy filtered resources.
15-Jun-2019 00:00:20 [INFO] Copying 3 resources
15-Jun-2019 00:00:20 [INFO]
15-Jun-2019 00:00:20 [INFO] --- maven-compiler-plugin:2.3.2:compile (default-compile) @ spring-security-oauth ---
15-Jun-2019 00:00:20 [INFO] Compiling 108 source files to /opt/bamboo-home/xml-data/build-dir/SECOAUTH-NIGHTLY-JOB1/spring-security-oauth/target/classes
15-Jun-2019 00:00:21 [WARNING] /opt/bamboo-home/xml-data/build-dir/SECOAUTH-NIGHTLY-JOB1/spring-security-oauth/src/main/java/org/springframework/security/oauth/consumer/net/OAuthOverHttpsURLStreamHandler.java:[36,78] Handler is internal proprietary API and may be removed in a future release
15-Jun-2019 00:00:21 [WARNING] /opt/bamboo-home/xml-data/build-dir/SECOAUTH-NIGHTLY-JOB1/spring-security-oauth/src/main/java/org/springframework/security/oauth/consumer/net/OAuthOverHttpURLStreamHandler.java:[36,76] Handler is internal proprietary API and may be removed in a future release
15-Jun-2019 00:00:21 [INFO]
15-Jun-2019 00:00:21 [INFO] --- maven-resources-plugin:2.6:testResources (default-testResources) @ spring-security-oauth ---
15-Jun-2019 00:00:21 [INFO] Using 'UTF-8' encoding to copy filtered resources.
15-Jun-2019 00:00:21 [INFO] Copying 8 resources
15-Jun-2019 00:00:21 [INFO]
15-Jun-2019 00:00:21 [INFO] --- maven-compiler-plugin:2.3.2:testCompile (default-testCompile) @ spring-security-oauth ---
15-Jun-2019 00:00:21 [INFO] Compiling 22 source files to /opt/bamboo-home/xml-data/build-dir/SECOAUTH-NIGHTLY-JOB1/spring-security-oauth/target/test-classes
15-Jun-2019 00:00:22 [WARNING] /opt/bamboo-home/xml-data/build-dir/SECOAUTH-NIGHTLY-JOB1/spring-security-oauth/src/test/java/org/springframework/security/oauth/consumer/client/CoreOAuthConsumerSupportTests.java:[65,32] Handler is internal proprietary API and may be removed in a future release
15-Jun-2019 00:00:22 [WARNING] /opt/bamboo-home/xml-data/build-dir/SECOAUTH-NIGHTLY-JOB1/spring-security-oauth/src/test/java/org/springframework/security/oauth/consumer/client/CoreOAuthConsumerSupportTests.java:[483,54] Handler is internal proprietary API and may be removed in a future release
15-Jun-2019 00:00:22 [INFO]
15-Jun-2019 00:00:22 [INFO] --- maven-surefire-plugin:2.12.4:test (default-test) @ spring-security-oauth ---
15-Jun-2019 00:00:22 [INFO] Surefire report directory: /opt/bamboo-home/xml-data/build-dir/SECOAUTH-NIGHTLY-JOB1/spring-security-oauth/target/surefire-reports
15-Jun-2019 00:00:22
15-Jun-2019 00:00:22 -------------------------------------------------------
15-Jun-2019 00:00:22 T E S T S
15-Jun-2019 00:00:22 -------------------------------------------------------
15-Jun-2019 00:00:22 Running org.springframework.security.oauth.config.FilterChainInitializationTests
15-Jun-2019 00:00:23 Tests run: 1, Failures: 0, Errors: 0, Skipped: 0, Time elapsed: 1.046 sec
15-Jun-2019 00:00:23 Running org.springframework.security.oauth.config.AuthorizationServerBeanDefinitionParserTests
15-Jun-2019 00:00:24 Tests run: 2, Failures: 0, Errors: 0, Skipped: 0, Time elapsed: 0.336 sec
15-Jun-2019 00:00:24 Running org.springframework.security.oauth.config.ConsumerServiceBeanDefinitionParserTests
15-Jun-2019 00:00:24 Tests run: 2, Failures: 0, Errors: 0, Skipped: 0, Time elapsed: 0.256 sec
15-Jun-2019 00:00:24 Running org.springframework.security.oauth.provider.nonce.InMemoryNonceServicesTests
15-Jun-2019 00:00:24 Tests run: 5, Failures: 0, Errors: 0, Skipped: 0, Time elapsed: 0.006 sec
15-Jun-2019 00:00:24 Running org.springframework.security.oauth.provider.filter.ProtectedResourceProcessingFilterTests
15-Jun-2019 00:00:24 Tests run: 1, Failures: 0, Errors: 0, Skipped: 0, Time elapsed: 0.133 sec
15-Jun-2019 00:00:24 Running org.springframework.security.oauth.provider.filter.OAuthProcessingFilterTests
15-Jun-2019 00:00:24 Tests run: 3, Failures: 0, Errors: 0, Skipped: 0, Time elapsed: 0.043 sec
15-Jun-2019 00:00:24 Running org.springframework.security.oauth.provider.filter.OAuthUserAuthorizationProcessingFilterTests
15-Jun-2019 00:00:24 Tests run: 1, Failures: 0, Errors: 0, Skipped: 0, Time elapsed: 0.003 sec
15-Jun-2019 00:00:24 Running org.springframework.security.oauth.provider.filter.UserAuthorizationSuccessfulAuthenticationHandlerTests
15-Jun-2019 00:00:24 Tests run: 1, Failures: 0, Errors: 0, Skipped: 0, Time elapsed: 0.003 sec
15-Jun-2019 00:00:24 Running org.springframework.security.oauth.provider.filter.AccessTokenProcessingFilterTests
15-Jun-2019 00:00:24 Tests run: 2, Failures: 0, Errors: 0, Skipped: 0, Time elapsed: 0.001 sec
15-Jun-2019 00:00:24 Running org.springframework.security.oauth.provider.filter.UnauthenticatedRequestTokenProcessingFilterTests
15-Jun-2019 00:00:24 Tests run: 2, Failures: 0, Errors: 0, Skipped: 0, Time elapsed: 0.004 sec
15-Jun-2019 00:00:24 Running org.springframework.security.oauth.provider.CoreOAuthProviderSupportTests
15-Jun-2019 00:00:24 Tests run: 2, Failures: 0, Errors: 0, Skipped: 0, Time elapsed: 0.004 sec
15-Jun-2019 00:00:24 Running org.springframework.security.oauth.common.signature.PlainTextSignatureMethodTests
15-Jun-2019 00:00:24 Tests run: 1, Failures: 0, Errors: 0, Skipped: 0, Time elapsed: 0.001 sec
15-Jun-2019 00:00:24 Running org.springframework.security.oauth.common.signature.CoreOAuthSignatureMethodFactoryTests
15-Jun-2019 00:00:24 Tests run: 1, Failures: 0, Errors: 0, Skipped: 0, Time elapsed: 0.162 sec
15-Jun-2019 00:00:24 Running org.springframework.security.oauth.common.signature.RSA_SHA1SignatureMethodTests
15-Jun-2019 00:00:24 Tests run: 2, Failures: 0, Errors: 0, Skipped: 0, Time elapsed: 0.084 sec
15-Jun-2019 00:00:24 Running org.springframework.security.oauth.common.signature.HMAC_SHA1SignatureMethodTests
15-Jun-2019 00:00:24 Tests run: 3, Failures: 0, Errors: 0, Skipped: 0, Time elapsed: 0.027 sec
15-Jun-2019 00:00:24 Running org.springframework.security.oauth.common.OAuthCodecTests
15-Jun-2019 00:00:24 Tests run: 1, Failures: 0, Errors: 0, Skipped: 0, Time elapsed: 0 sec
15-Jun-2019 00:00:24 Running org.springframework.security.oauth.consumer.client.CoreOAuthConsumerSupportTests
15-Jun-2019 00:00:24 Tests run: 10, Failures: 0, Errors: 0, Skipped: 0, Time elapsed: 0.02 sec
15-Jun-2019 00:00:24 Running org.springframework.security.oauth.consumer.client.OAuthRestTemplateTests
15-Jun-2019 00:00:24 Tests run: 2, Failures: 0, Errors: 0, Skipped: 0, Time elapsed: 0.127 sec
15-Jun-2019 00:00:24 Running org.springframework.security.oauth.consumer.GoogleOAuthTests
15-Jun-2019 00:00:24 Tests run: 1, Failures: 0, Errors: 0, Skipped: 0, Time elapsed: 0.001 sec
15-Jun-2019 00:00:24 Running org.springframework.security.oauth.consumer.filter.OAuthConsumerContextFilterTests
15-Jun-2019 00:00:24 Tests run: 2, Failures: 0, Errors: 0, Skipped: 0, Time elapsed: 0.019 sec
15-Jun-2019 00:00:24 Running org.springframework.security.oauth.consumer.rememberme.HttpSessionOAuthRememberMeServicesTests
15-Jun-2019 00:00:24 Tests run: 4, Failures: 0, Errors: 0, Skipped: 0, Time elapsed: 0.009 sec
15-Jun-2019 00:00:24 Running net.oauth.signature.GoogleCodeCompatibilityTests
15-Jun-2019 00:00:24 Tests run: 2, Failures: 0, Errors: 0, Skipped: 0, Time elapsed: 0.014 sec
15-Jun-2019 00:00:25
15-Jun-2019 00:00:25 Results :
15-Jun-2019 00:00:25
15-Jun-2019 00:00:25 Tests run: 51, Failures: 0, Errors: 0, Skipped: 0
15-Jun-2019 00:00:25
15-Jun-2019 00:00:25 [INFO]
15-Jun-2019 00:00:25 [INFO] --- maven-jar-plugin:2.4:jar (default-jar) @ spring-security-oauth ---
15-Jun-2019 00:00:25 [INFO] Building jar: /opt/bamboo-home/xml-data/build-dir/SECOAUTH-NIGHTLY-JOB1/spring-security-oauth/target/spring-security-oauth-2.3.7.BUILD-SNAPSHOT.jar
15-Jun-2019 00:00:25 [INFO]
15-Jun-2019 00:00:25 [INFO] >>> maven-source-plugin:2.1.2:jar (attach-sources) > generate-sources @ spring-security-oauth >>>
15-Jun-2019 00:00:25 [INFO]
15-Jun-2019 00:00:25 [INFO] <<< maven-source-plugin:2.1.2:jar (attach-sources) < generate-sources @ spring-security-oauth <<<
15-Jun-2019 00:00:25 [INFO]
15-Jun-2019 00:00:25 [INFO] --- maven-source-plugin:2.1.2:jar (attach-sources) @ spring-security-oauth ---
15-Jun-2019 00:00:25 [INFO] org already added, skipping
15-Jun-2019 00:00:25 [INFO] org/springframework already added, skipping
15-Jun-2019 00:00:25 [INFO] org/springframework/security already added, skipping
15-Jun-2019 00:00:25 [INFO] org/springframework/security/oauth already added, skipping
15-Jun-2019 00:00:25 [INFO] Building jar: /opt/bamboo-home/xml-data/build-dir/SECOAUTH-NIGHTLY-JOB1/spring-security-oauth/target/spring-security-oauth-2.3.7.BUILD-SNAPSHOT-sources.jar
15-Jun-2019 00:00:25 [INFO] org already added, skipping
15-Jun-2019 00:00:25 [INFO] org/springframework already added, skipping
15-Jun-2019 00:00:25 [INFO] org/springframework/security already added, skipping
15-Jun-2019 00:00:25 [INFO] org/springframework/security/oauth already added, skipping
15-Jun-2019 00:00:25 [INFO]
15-Jun-2019 00:00:25 [INFO] --- maven-javadoc-plugin:2.9.1:jar (javadoc) @ spring-security-oauth ---
15-Jun-2019 00:00:28 [INFO]
15-Jun-2019 00:00:28 2 warnings
15-Jun-2019 00:00:28 [WARNING] Javadoc Warnings
15-Jun-2019 00:00:28 [WARNING] /opt/bamboo-home/xml-data/build-dir/SECOAUTH-NIGHTLY-JOB1/spring-security-oauth/src/main/java/org/springframework/security/oauth/consumer/net/OAuthOverHttpURLStreamHandler.java:36: warning: Handler is internal proprietary API and may be removed in a future release
15-Jun-2019 00:00:28 [WARNING] public class OAuthOverHttpURLStreamHandler extends sun.net.www.protocol.http.Handler {
15-Jun-2019 00:00:28 [WARNING] ^
15-Jun-2019 00:00:28 [WARNING] /opt/bamboo-home/xml-data/build-dir/SECOAUTH-NIGHTLY-JOB1/spring-security-oauth/src/main/java/org/springframework/security/oauth/consumer/net/OAuthOverHttpsURLStreamHandler.java:36: warning: Handler is internal proprietary API and may be removed in a future release
15-Jun-2019 00:00:28 [WARNING] public class OAuthOverHttpsURLStreamHandler extends sun.net.www.protocol.https.Handler {
15-Jun-2019 00:00:28 [WARNING] ^
15-Jun-2019 00:00:28 [INFO] Building jar: /opt/bamboo-home/xml-data/build-dir/SECOAUTH-NIGHTLY-JOB1/spring-security-oauth/target/spring-security-oauth-2.3.7.BUILD-SNAPSHOT-javadoc.jar
15-Jun-2019 00:00:28 [INFO]
15-Jun-2019 00:00:28 [INFO] --- maven-install-plugin:2.4:install (default-install) @ spring-security-oauth ---
15-Jun-2019 00:00:28 [INFO] Installing /opt/bamboo-home/xml-data/build-dir/SECOAUTH-NIGHTLY-JOB1/spring-security-oauth/target/spring-security-oauth-2.3.7.BUILD-SNAPSHOT.jar to /home/bamboo/.m2/repository/org/springframework/security/oauth/spring-security-oauth/2.3.7.BUILD-SNAPSHOT/spring-security-oauth-2.3.7.BUILD-SNAPSHOT.jar
15-Jun-2019 00:00:28 [INFO] Installing /opt/bamboo-home/xml-data/build-dir/SECOAUTH-NIGHTLY-JOB1/spring-security-oauth/pom.xml to /home/bamboo/.m2/repository/org/springframework/security/oauth/spring-security-oauth/2.3.7.BUILD-SNAPSHOT/spring-security-oauth-2.3.7.BUILD-SNAPSHOT.pom
15-Jun-2019 00:00:28 [INFO] Installing /opt/bamboo-home/xml-data/build-dir/SECOAUTH-NIGHTLY-JOB1/spring-security-oauth/target/spring-security-oauth-2.3.7.BUILD-SNAPSHOT-sources.jar to /home/bamboo/.m2/repository/org/springframework/security/oauth/spring-security-oauth/2.3.7.BUILD-SNAPSHOT/spring-security-oauth-2.3.7.BUILD-SNAPSHOT-sources.jar
15-Jun-2019 00:00:28 [INFO] Installing /opt/bamboo-home/xml-data/build-dir/SECOAUTH-NIGHTLY-JOB1/spring-security-oauth/target/spring-security-oauth-2.3.7.BUILD-SNAPSHOT-javadoc.jar to /home/bamboo/.m2/repository/org/springframework/security/oauth/spring-security-oauth/2.3.7.BUILD-SNAPSHOT/spring-security-oauth-2.3.7.BUILD-SNAPSHOT-javadoc.jar
15-Jun-2019 00:00:28 [INFO]                                                                         
15-Jun-2019 00:00:28 [INFO] ------------------------------------------------------------------------
15-Jun-2019 00:00:28 [INFO] Building OAuth2 for Spring Security 2.3.7.BUILD-SNAPSHOT
15-Jun-2019 00:00:28 [INFO] ------------------------------------------------------------------------
15-Jun-2019 00:00:29 [INFO]
15-Jun-2019 00:00:29 [INFO] --- maven-clean-plugin:2.5:clean (default-clean) @ spring-security-oauth2 ---
15-Jun-2019 00:00:29 [INFO]
15-Jun-2019 00:00:29 [INFO] --- maven-resources-plugin:2.6:resources (default-resources) @ spring-security-oauth2 ---
15-Jun-2019 00:00:29 [INFO] Using 'UTF-8' encoding to copy filtered resources.
15-Jun-2019 00:00:29 [INFO] Copying 4 resources
15-Jun-2019 00:00:29 [INFO]
15-Jun-2019 00:00:29 [INFO] --- maven-compiler-plugin:2.3.2:compile (default-compile) @ spring-security-oauth2 ---
15-Jun-2019 00:00:29 [INFO] Compiling 249 source files to /opt/bamboo-home/xml-data/build-dir/SECOAUTH-NIGHTLY-JOB1/spring-security-oauth2/target/classes
15-Jun-2019 00:00:31 [INFO]
15-Jun-2019 00:00:31 [INFO] --- maven-resources-plugin:2.6:testResources (default-testResources) @ spring-security-oauth2 ---
15-Jun-2019 00:00:31 [INFO] Using 'UTF-8' encoding to copy filtered resources.
15-Jun-2019 00:00:31 [INFO] Copying 21 resources
15-Jun-2019 00:00:31 [INFO]
15-Jun-2019 00:00:31 [INFO] --- maven-compiler-plugin:2.3.2:testCompile (default-testCompile) @ spring-security-oauth2 ---
15-Jun-2019 00:00:31 [INFO] Compiling 120 source files to /opt/bamboo-home/xml-data/build-dir/SECOAUTH-NIGHTLY-JOB1/spring-security-oauth2/target/test-classes
15-Jun-2019 00:00:33 [INFO]
15-Jun-2019 00:00:33 [INFO] --- maven-surefire-plugin:2.12.4:test (default-test) @ spring-security-oauth2 ---
15-Jun-2019 00:00:33 [INFO] Surefire report directory: /opt/bamboo-home/xml-data/build-dir/SECOAUTH-NIGHTLY-JOB1/spring-security-oauth2/target/surefire-reports
15-Jun-2019 00:00:33
15-Jun-2019 00:00:33 -------------------------------------------------------
15-Jun-2019 00:00:33 T E S T S
15-Jun-2019 00:00:33 -------------------------------------------------------
15-Jun-2019 00:00:34 Running org.springframework.security.oauth2.config.annotation.TokenServicesMultipleBeansTests
15-Jun-2019 00:00:35 Tests run: 1, Failures: 0, Errors: 0, Skipped: 0, Time elapsed: 1.455 sec
15-Jun-2019 00:00:35 Running org.springframework.security.oauth2.config.annotation.Gh501EnableAuthorizationServerTests
15-Jun-2019 00:00:36 Tests run: 1, Failures: 0, Errors: 0, Skipped: 0, Time elapsed: 0.681 sec
15-Jun-2019 00:00:36 Running org.springframework.security.oauth2.config.annotation.ClientConfigurationTests
15-Jun-2019 00:00:36 Tests run: 1, Failures: 0, Errors: 0, Skipped: 0, Time elapsed: 0.231 sec
15-Jun-2019 00:00:36 Running org.springframework.security.oauth2.config.annotation.ResourceServerConfigurationTests
15-Jun-2019 00:00:37 [WARN] TokenEndpoint - Handling error: InvalidRequestException, Missing grant type
15-Jun-2019 00:00:37 [WARN] PageNotFound - No mapping found for HTTP request with URI [/] in DispatcherServlet with name ''
15-Jun-2019 00:00:37 [WARN] PageNotFound - No mapping found for HTTP request with URI [/] in DispatcherServlet with name ''
15-Jun-2019 00:00:37 [WARN] PageNotFound - No mapping found for HTTP request with URI [/] in DispatcherServlet with name ''
15-Jun-2019 00:00:38 [WARN] PageNotFound - No mapping found for HTTP request with URI [/] in DispatcherServlet with name ''
15-Jun-2019 00:00:38 [WARN] TokenEndpoint - Handling error: InvalidRequestException, Missing grant type
15-Jun-2019 00:00:38 Tests run: 9, Failures: 0, Errors: 0, Skipped: 0, Time elapsed: 1.615 sec
15-Jun-2019 00:00:38 Running org.springframework.security.oauth2.config.annotation.AuthorizationServerConfigurationTests
15-Jun-2019 00:00:38 [WARN] AnnotationConfigWebApplicationContext - Exception encountered during context initialization - cancelling refresh attempt: org.springframework.beans.factory.UnsatisfiedDependencyException: Error creating bean with name 'org.springframework.security.config.annotation.web.configuration.WebSecurityConfiguration': Unsatisfied dependency expressed through method 'setFilterChainProxySecurityConfigurer' parameter 1; nested exception is org.springframework.beans.factory.BeanExpressionException: Expression parsing failed; nested exception is org.springframework.beans.factory.UnsatisfiedDependencyException: Error creating bean with name 'org.springframework.security.oauth2.config.annotation.web.configuration.AuthorizationServerSecurityConfiguration': Unsatisfied dependency expressed through field 'configurers'; nested exception is org.springframework.beans.factory.NoSuchBeanDefinitionException: No qualifying bean of type 'java.util.List<org.springframework.security.oauth2.config.annotation.web.configuration.AuthorizationServerConfigurer>' available: expected at least 1 bean which qualifies as autowire candidate. Dependency annotations: {@org.springframework.beans.factory.annotation.Autowired(required=true)}
15-Jun-2019 00:00:39 [WARN] JwtAccessTokenConverter - Unable to create an RSA verifier from verifierKey (ignoreable if using MAC)
15-Jun-2019 00:00:40 [WARN] AnnotationConfigWebApplicationContext - Exception encountered during context initialization - cancelling refresh attempt: org.springframework.beans.factory.UnsatisfiedDependencyException: Error creating bean with name 'authorizationServerConfigurationTests.AuthorizationServerTypes': Unsatisfied dependency expressed through field 'tokenServices'; nested exception is org.springframework.beans.factory.BeanCreationException: Error creating bean with name 'org.springframework.security.oauth2.config.annotation.web.configuration.AuthorizationServerEndpointsConfiguration': Invocation of init method failed; nested exception is java.lang.AssertionError
15-Jun-2019 00:00:40 Tests run: 20, Failures: 0, Errors: 0, Skipped: 0, Time elapsed: 2.208 sec
15-Jun-2019 00:00:40 Running org.springframework.security.oauth2.config.annotation.Gh808EnableAuthorizationServerTests
15-Jun-2019 00:00:40 Tests run: 2, Failures: 0, Errors: 0, Skipped: 0, Time elapsed: 0.145 sec
15-Jun-2019 00:00:40 Running org.springframework.security.oauth2.config.xml.ResourceServerBeanDefinitionParserTests
15-Jun-2019 00:00:40 Tests run: 2, Failures: 0, Errors: 0, Skipped: 0, Time elapsed: 0.187 sec
15-Jun-2019 00:00:40 Running org.springframework.security.oauth2.config.xml.AuthorizationServerInvalidParserTests
15-Jun-2019 00:00:40 Tests run: 1, Failures: 0, Errors: 0, Skipped: 0, Time elapsed: 0.029 sec
15-Jun-2019 00:00:40 Running org.springframework.security.oauth2.config.xml.AuthorizationServerBeanDefinitionParserTests
15-Jun-2019 00:00:41 Tests run: 12, Failures: 0, Errors: 0, Skipped: 0, Time elapsed: 0.492 sec
15-Jun-2019 00:00:41 Running org.springframework.security.oauth2.config.xml.ClientDetailsServiceBeanDefinitionParserTests
15-Jun-2019 00:00:41 Tests run: 3, Failures: 0, Errors: 0, Skipped: 0, Time elapsed: 0.036 sec
15-Jun-2019 00:00:41 Running org.springframework.security.oauth2.config.xml.ResourceBeanDefinitionParserTests
15-Jun-2019 00:00:41 Tests run: 7, Failures: 0, Errors: 0, Skipped: 0, Time elapsed: 0.068 sec
15-Jun-2019 00:00:41 Running org.springframework.security.oauth2.config.xml.InvalidResourceBeanDefinitionParserTests
15-Jun-2019 00:00:41 Tests run: 5, Failures: 0, Errors: 0, Skipped: 0, Time elapsed: 0.057 sec
15-Jun-2019 00:00:41 Running org.springframework.security.oauth2.config.xml.AuthorizationServerCustomGrantParserTests
15-Jun-2019 00:00:41 Tests run: 1, Failures: 0, Errors: 0, Skipped: 0, Time elapsed: 0.023 sec
15-Jun-2019 00:00:41 Running org.springframework.security.oauth2.config.xml.AuthorizationServerClientCredentialsPasswordInvalidXmlTests
15-Jun-2019 00:00:41 Tests run: 2, Failures: 0, Errors: 0, Skipped: 0, Time elapsed: 0.321 sec
15-Jun-2019 00:00:41 Running org.springframework.security.oauth2.config.xml.AuthorizationServerClientCredentialsPasswordValidXmlTests
15-Jun-2019 00:00:42 Tests run: 2, Failures: 0, Errors: 0, Skipped: 0, Time elapsed: 0.213 sec
15-Jun-2019 00:00:42 Running org.springframework.security.oauth2.http.converter.jaxb.JaxbOAuth2ExceptionMessageConverterTests
15-Jun-2019 00:00:43 Tests run: 22, Failures: 0, Errors: 0, Skipped: 0, Time elapsed: 1.442 sec
15-Jun-2019 00:00:43 Running org.springframework.security.oauth2.http.converter.jaxb.JaxbOAuth2AccessTokenMessageConverterTests
15-Jun-2019 00:00:44 Tests run: 8, Failures: 0, Errors: 0, Skipped: 0, Time elapsed: 0.851 sec
15-Jun-2019 00:00:44 Running org.springframework.security.oauth2.client.http.OAuth2ErrorHandlerTests
15-Jun-2019 00:00:44 Tests run: 12, Failures: 0, Errors: 0, Skipped: 0, Time elapsed: 0.057 sec
15-Jun-2019 00:00:44 Running org.springframework.security.oauth2.client.DefaultOAuth2RequestAuthenticatorTests
15-Jun-2019 00:00:44 Tests run: 6, Failures: 0, Errors: 0, Skipped: 0, Time elapsed: 0.002 sec
15-Jun-2019 00:00:44 Running org.springframework.security.oauth2.client.token.grant.password.ResourceOwnerPasswordAccessTokenProviderTests
15-Jun-2019 00:00:44 Tests run: 3, Failures: 0, Errors: 0, Skipped: 0, Time elapsed: 0 sec
15-Jun-2019 00:00:44 Running org.springframework.security.oauth2.client.token.grant.implicit.ImplicitAccessTokenProviderTests
15-Jun-2019 00:00:44 Tests run: 2, Failures: 0, Errors: 0, Skipped: 0, Time elapsed: 0 sec
15-Jun-2019 00:00:44 Running org.springframework.security.oauth2.client.token.grant.code.AuthorizationCodeAccessTokenProviderWithConversionTests
15-Jun-2019 00:00:44 Tests run: 4, Failures: 0, Errors: 0, Skipped: 0, Time elapsed: 0.125 sec
15-Jun-2019 00:00:44 Running org.springframework.security.oauth2.client.token.grant.code.AuthorizationCodeAccessTokenProviderTests
15-Jun-2019 00:00:44 Tests run: 5, Failures: 0, Errors: 0, Skipped: 0, Time elapsed: 0.001 sec
15-Jun-2019 00:00:44 Running org.springframework.security.oauth2.client.token.grant.code.AuthorizationCodeResourceDetailsTests
15-Jun-2019 00:00:44 Tests run: 2, Failures: 0, Errors: 0, Skipped: 0, Time elapsed: 0 sec
15-Jun-2019 00:00:44 Running org.springframework.security.oauth2.client.token.JdbcClientTokenServicesTests
15-Jun-2019 00:00:44 Tests run: 3, Failures: 0, Errors: 0, Skipped: 0, Time elapsed: 0.325 sec
15-Jun-2019 00:00:44 Running org.springframework.security.oauth2.client.token.OAuth2AccessTokenSupportTests
15-Jun-2019 00:00:44 Tests run: 5, Failures: 0, Errors: 0, Skipped: 0, Time elapsed: 0.027 sec
15-Jun-2019 00:00:44 Running org.springframework.security.oauth2.client.token.AccessTokenProviderChainTests
15-Jun-2019 00:00:44 Tests run: 15, Failures: 0, Errors: 0, Skipped: 0, Time elapsed: 0.03 sec
15-Jun-2019 00:00:44 Running org.springframework.security.oauth2.client.filter.OAuth2ClientContextFilterTests
15-Jun-2019 00:00:44 Tests run: 11, Failures: 0, Errors: 0, Skipped: 0, Time elapsed: 0.008 sec
15-Jun-2019 00:00:44 Running org.springframework.security.oauth2.client.filter.OAuth2ClientAuthenticationProcessingFilterTests
15-Jun-2019 00:00:44 Tests run: 5, Failures: 0, Errors: 0, Skipped: 0, Time elapsed: 0.018 sec
15-Jun-2019 00:00:44 Running org.springframework.security.oauth2.client.OAuth2RestTemplateTests
15-Jun-2019 00:00:45 Tests run: 12, Failures: 0, Errors: 0, Skipped: 0, Time elapsed: 0.206 sec
15-Jun-2019 00:00:45 Running org.springframework.security.oauth2.provider.request.DefaultAuthorizationRequestFactoryTests
15-Jun-2019 00:00:45 Tests run: 9, Failures: 0, Errors: 0, Skipped: 0, Time elapsed: 0.002 sec
15-Jun-2019 00:00:45 Running org.springframework.security.oauth2.provider.request.DefaultOAuth2RequestValidatorTests
15-Jun-2019 00:00:45 Tests run: 3, Failures: 0, Errors: 0, Skipped: 0, Time elapsed: 0.001 sec
15-Jun-2019 00:00:45 Running org.springframework.security.oauth2.provider.password.ResourceOwnerPasswordTokenGranterTests
15-Jun-2019 00:00:45 Tests run: 7, Failures: 0, Errors: 0, Skipped: 0, Time elapsed: 0.004 sec
15-Jun-2019 00:00:45 Running org.springframework.security.oauth2.provider.client.BaseClientDetailsTests
15-Jun-2019 00:00:45 Tests run: 11, Failures: 0, Errors: 0, Skipped: 0, Time elapsed: 0.046 sec
15-Jun-2019 00:00:45 Running org.springframework.security.oauth2.provider.client.JdbcClientDetailsServiceTests
15-Jun-2019 00:00:45 Tests run: 14, Failures: 0, Errors: 0, Skipped: 0, Time elapsed: 0.277 sec
15-Jun-2019 00:00:45 Running org.springframework.security.oauth2.provider.client.ClientCredentialsTokenEndpointFilterTests
15-Jun-2019 00:00:45 Tests run: 3, Failures: 0, Errors: 0, Skipped: 0, Time elapsed: 0.021 sec
15-Jun-2019 00:00:45 Running org.springframework.security.oauth2.provider.client.ClientDetailsUserDetailsServiceTests
15-Jun-2019 00:00:45 Tests run: 2, Failures: 0, Errors: 0, Skipped: 0, Time elapsed: 0.005 sec
15-Jun-2019 00:00:45 Running org.springframework.security.oauth2.provider.approval.ApprovalStoreUserApprovalHandlerTests
15-Jun-2019 00:00:45 Tests run: 10, Failures: 0, Errors: 0, Skipped: 0, Time elapsed: 0.004 sec
15-Jun-2019 00:00:45 Running org.springframework.security.oauth2.provider.approval.DefaultUserApprovalHandlerTests
15-Jun-2019 00:00:45 Tests run: 1, Failures: 0, Errors: 0, Skipped: 0, Time elapsed: 0 sec
15-Jun-2019 00:00:45 Running org.springframework.security.oauth2.provider.approval.TokenStoreUserApprovalHandlerTests
15-Jun-2019 00:00:45 Tests run: 3, Failures: 0, Errors: 0, Skipped: 0, Time elapsed: 0.001 sec
15-Jun-2019 00:00:45 Running org.springframework.security.oauth2.provider.approval.JdbcApprovalStoreTests
15-Jun-2019 00:00:45 Tests run: 6, Failures: 0, Errors: 0, Skipped: 0, Time elapsed: 0.076 sec
15-Jun-2019 00:00:45 Running org.springframework.security.oauth2.provider.approval.InMemoryApprovalStoreTests
15-Jun-2019 00:00:45 Tests run: 5, Failures: 0, Errors: 0, Skipped: 0, Time elapsed: 0.001 sec
15-Jun-2019 00:00:45 Running org.springframework.security.oauth2.provider.approval.TokenApprovalStoreTests
15-Jun-2019 00:00:45 Tests run: 5, Failures: 0, Errors: 0, Skipped: 0, Time elapsed: 0.003 sec
15-Jun-2019 00:00:45 Running org.springframework.security.oauth2.provider.vote.ClientScopeVoterTests
15-Jun-2019 00:00:45 Tests run: 3, Failures: 0, Errors: 0, Skipped: 0, Time elapsed: 0.001 sec
15-Jun-2019 00:00:45 Running org.springframework.security.oauth2.provider.vote.ScopeVoterTests
15-Jun-2019 00:00:45 Tests run: 6, Failures: 0, Errors: 0, Skipped: 0, Time elapsed: 0.009 sec
15-Jun-2019 00:00:45 Running org.springframework.security.oauth2.provider.test.OAuth2RequestTests
15-Jun-2019 00:00:45 Tests run: 4, Failures: 0, Errors: 0, Skipped: 0, Time elapsed: 0 sec
15-Jun-2019 00:00:45 Running org.springframework.security.oauth2.provider.token.DefaultTokenServicesWithJdbcTests
15-Jun-2019 00:00:45 Tests run: 19, Failures: 0, Errors: 0, Skipped: 0, Time elapsed: 0.365 sec
15-Jun-2019 00:00:45 Running org.springframework.security.oauth2.provider.token.store.JwtAccessTokenConverterTests
15-Jun-2019 00:00:45 [WARN] JwtAccessTokenConverter - Unable to create an RSA verifier from verifierKey (ignoreable if using MAC)
15-Jun-2019 00:00:46 [WARN] JwtAccessTokenConverter - Unable to create an RSA verifier from verifierKey (ignoreable if using MAC)
15-Jun-2019 00:00:46 [WARN] JwtAccessTokenConverter - Unable to create an RSA verifier from verifierKey (ignoreable if using MAC)
15-Jun-2019 00:00:46 Tests run: 14, Failures: 0, Errors: 0, Skipped: 0, Time elapsed: 0.175 sec
15-Jun-2019 00:00:46 Running org.springframework.security.oauth2.provider.token.store.InMemoryTokenStoreTests
15-Jun-2019 00:00:46 Tests run: 16, Failures: 0, Errors: 0, Skipped: 0, Time elapsed: 0.012 sec
15-Jun-2019 00:00:46 Running org.springframework.security.oauth2.provider.token.store.JwtTokenStoreTests
15-Jun-2019 00:00:46 [WARN] JwtAccessTokenConverter - Unable to create an RSA verifier from verifierKey (ignoreable if using MAC)
15-Jun-2019 00:00:46 [WARN] JwtAccessTokenConverter - Unable to create an RSA verifier from verifierKey (ignoreable if using MAC)
15-Jun-2019 00:00:46 [WARN] JwtAccessTokenConverter - Unable to create an RSA verifier from verifierKey (ignoreable if using MAC)
15-Jun-2019 00:00:46 [WARN] JwtAccessTokenConverter - Unable to create an RSA verifier from verifierKey (ignoreable if using MAC)
15-Jun-2019 00:00:46 [WARN] JwtAccessTokenConverter - Unable to create an RSA verifier from verifierKey (ignoreable if using MAC)
15-Jun-2019 00:00:46 [WARN] JwtAccessTokenConverter - Unable to create an RSA verifier from verifierKey (ignoreable if using MAC)
15-Jun-2019 00:00:46 [WARN] JwtAccessTokenConverter - Unable to create an RSA verifier from verifierKey (ignoreable if using MAC)
15-Jun-2019 00:00:46 [WARN] JwtAccessTokenConverter - Unable to create an RSA verifier from verifierKey (ignoreable if using MAC)
15-Jun-2019 00:00:46 [WARN] JwtAccessTokenConverter - Unable to create an RSA verifier from verifierKey (ignoreable if using MAC)
15-Jun-2019 00:00:46 [WARN] JwtAccessTokenConverter - Unable to create an RSA verifier from verifierKey (ignoreable if using MAC)
15-Jun-2019 00:00:46 [WARN] JwtAccessTokenConverter - Unable to create an RSA verifier from verifierKey (ignoreable if using MAC)
15-Jun-2019 00:00:46 [WARN] JwtAccessTokenConverter - Unable to create an RSA verifier from verifierKey (ignoreable if using MAC)
15-Jun-2019 00:00:46 [WARN] JwtAccessTokenConverter - Unable to create an RSA verifier from verifierKey (ignoreable if using MAC)
15-Jun-2019 00:00:46 [WARN] JwtAccessTokenConverter - Unable to create an RSA verifier from verifierKey (ignoreable if using MAC)
15-Jun-2019 00:00:46 [WARN] JwtAccessTokenConverter - Unable to create an RSA verifier from verifierKey (ignoreable if using MAC)
15-Jun-2019 00:00:46 [WARN] JwtAccessTokenConverter - Unable to create an RSA verifier from verifierKey (ignoreable if using MAC)
15-Jun-2019 00:00:46 [WARN] JwtAccessTokenConverter - Unable to create an RSA verifier from verifierKey (ignoreable if using MAC)
15-Jun-2019 00:00:46 [WARN] JwtAccessTokenConverter - Unable to create an RSA verifier from verifierKey (ignoreable if using MAC)
15-Jun-2019 00:00:46 Tests run: 18, Failures: 0, Errors: 0, Skipped: 0, Time elapsed: 0.036 sec
15-Jun-2019 00:00:46 Running org.springframework.security.oauth2.provider.token.store.redis.RedisTokenStorePrefixTests
15-Jun-2019 00:00:49 Tests run: 15, Failures: 0, Errors: 0, Skipped: 0, Time elapsed: 3.123 sec
15-Jun-2019 00:00:49 Running org.springframework.security.oauth2.provider.token.store.redis.RedisTokenStoreMockTests
15-Jun-2019 00:00:49 Tests run: 2, Failures: 0, Errors: 0, Skipped: 0, Time elapsed: 0.071 sec
15-Jun-2019 00:00:49 Running org.springframework.security.oauth2.provider.token.store.redis.RedisTokenStoreTests
15-Jun-2019 00:00:52 Tests run: 16, Failures: 0, Errors: 0, Skipped: 0, Time elapsed: 3.055 sec
15-Jun-2019 00:00:52 Running org.springframework.security.oauth2.provider.token.store.JdbcTokenStoreTests
15-Jun-2019 00:00:52 Tests run: 14, Failures: 0, Errors: 0, Skipped: 0, Time elapsed: 0.166 sec
15-Jun-2019 00:00:52 Running org.springframework.security.oauth2.provider.token.DefaultTokenServicesAuthoritiesChangeTests
15-Jun-2019 00:00:52 Tests run: 1, Failures: 0, Errors: 0, Skipped: 0, Time elapsed: 0.001 sec
15-Jun-2019 00:00:52 Running org.springframework.security.oauth2.provider.token.DefaultUserAuthenticationConverterTests
15-Jun-2019 00:00:52 Tests run: 3, Failures: 0, Errors: 0, Skipped: 0, Time elapsed: 0.003 sec
15-Jun-2019 00:00:52 Running org.springframework.security.oauth2.provider.token.TokenServicesWithTokenEnhancerTests
15-Jun-2019 00:00:52 [WARN] JwtAccessTokenConverter - Unable to create an RSA verifier from verifierKey (ignoreable if using MAC)
15-Jun-2019 00:00:52 [WARN] JwtAccessTokenConverter - Unable to create an RSA verifier from verifierKey (ignoreable if using MAC)
15-Jun-2019 00:00:52 [WARN] JwtAccessTokenConverter - Unable to create an RSA verifier from verifierKey (ignoreable if using MAC)
15-Jun-2019 00:00:52 [WARN] JwtAccessTokenConverter - Unable to create an RSA verifier from verifierKey (ignoreable if using MAC)
15-Jun-2019 00:00:52 [WARN] JwtAccessTokenConverter - Unable to create an RSA verifier from verifierKey (ignoreable if using MAC)
15-Jun-2019 00:00:52 Tests run: 5, Failures: 0, Errors: 0, Skipped: 0, Time elapsed: 0.017 sec
15-Jun-2019 00:00:52 Running org.springframework.security.oauth2.provider.token.DefaultTokenServicesWithJwtTests
15-Jun-2019 00:00:52 [WARN] JwtAccessTokenConverter - Unable to create an RSA verifier from verifierKey (ignoreable if using MAC)
15-Jun-2019 00:00:52 [WARN] JwtAccessTokenConverter - Unable to create an RSA verifier from verifierKey (ignoreable if using MAC)
15-Jun-2019 00:00:52 [WARN] JwtAccessTokenConverter - Unable to create an RSA verifier from verifierKey (ignoreable if using MAC)
15-Jun-2019 00:00:52 [WARN] JwtAccessTokenConverter - Unable to create an RSA verifier from verifierKey (ignoreable if using MAC)
15-Jun-2019 00:00:52 [WARN] JwtAccessTokenConverter - Unable to create an RSA verifier from verifierKey (ignoreable if using MAC)
15-Jun-2019 00:00:52 [WARN] JwtAccessTokenConverter - Unable to create an RSA verifier from verifierKey (ignoreable if using MAC)
15-Jun-2019 00:00:52 [WARN] JwtAccessTokenConverter - Unable to create an RSA verifier from verifierKey (ignoreable if using MAC)
15-Jun-2019 00:00:52 [WARN] JwtAccessTokenConverter - Unable to create an RSA verifier from verifierKey (ignoreable if using MAC)
15-Jun-2019 00:00:52 [WARN] JwtAccessTokenConverter - Unable to create an RSA verifier from verifierKey (ignoreable if using MAC)
15-Jun-2019 00:00:52 [WARN] JwtAccessTokenConverter - Unable to create an RSA verifier from verifierKey (ignoreable if using MAC)
15-Jun-2019 00:00:52 [WARN] JwtAccessTokenConverter - Unable to create an RSA verifier from verifierKey (ignoreable if using MAC)
15-Jun-2019 00:00:52 [WARN] JwtAccessTokenConverter - Unable to create an RSA verifier from verifierKey (ignoreable if using MAC)
15-Jun-2019 00:00:52 [WARN] JwtAccessTokenConverter - Unable to create an RSA verifier from verifierKey (ignoreable if using MAC)
15-Jun-2019 00:00:52 [WARN] JwtAccessTokenConverter - Unable to create an RSA verifier from verifierKey (ignoreable if using MAC)
15-Jun-2019 00:00:52 [WARN] JwtAccessTokenConverter - Unable to create an RSA verifier from verifierKey (ignoreable if using MAC)
15-Jun-2019 00:00:52 Tests run: 15, Failures: 0, Errors: 0, Skipped: 0, Time elapsed: 0.042 sec
15-Jun-2019 00:00:52 Running org.springframework.security.oauth2.provider.token.DefaultTokenServicesTests
15-Jun-2019 00:00:52 Tests run: 1, Failures: 0, Errors: 0, Skipped: 0, Time elapsed: 0.004 sec
15-Jun-2019 00:00:52 Running org.springframework.security.oauth2.provider.token.DefaultTokenServicesWithInMemoryTests
15-Jun-2019 00:00:52 Tests run: 25, Failures: 0, Errors: 0, Skipped: 0, Time elapsed: 0.019 sec
15-Jun-2019 00:00:52 Running org.springframework.security.oauth2.provider.token.DefaultAccessTokenConverterTests
15-Jun-2019 00:00:52 Tests run: 15, Failures: 0, Errors: 0, Skipped: 0, Time elapsed: 0.003 sec
15-Jun-2019 00:00:52 Running org.springframework.security.oauth2.provider.implicit.InMemoryImplicitGrantServiceTests
15-Jun-2019 00:00:52 Tests run: 2, Failures: 0, Errors: 0, Skipped: 0, Time elapsed: 0 sec
15-Jun-2019 00:00:52 Running org.springframework.security.oauth2.provider.error.DefaultWebResponseExceptionTranslatorTests
15-Jun-2019 00:00:52 Tests run: 1, Failures: 0, Errors: 0, Skipped: 0, Time elapsed: 0 sec
15-Jun-2019 00:00:52 Running org.springframework.security.oauth2.provider.error.OAuth2AuthenticationEntryPointTests
15-Jun-2019 00:00:52 [WARN] DefaultHandlerExceptionResolver - Resolved exception caused by handler execution: org.springframework.web.HttpMediaTypeNotAcceptableException: Could not find acceptable representation
15-Jun-2019 00:00:52 Tests run: 7, Failures: 0, Errors: 0, Skipped: 0, Time elapsed: 0.037 sec
15-Jun-2019 00:00:52 Running org.springframework.security.oauth2.provider.error.OAuth2AccessDeniedHandlerTests
15-Jun-2019 00:00:52 Tests run: 1, Failures: 0, Errors: 0, Skipped: 0, Time elapsed: 0.005 sec
15-Jun-2019 00:00:52 Running org.springframework.security.oauth2.provider.authentication.OAuth2AuthenticationProcessingFilterTests
15-Jun-2019 00:00:52 Tests run: 8, Failures: 0, Errors: 0, Skipped: 0, Time elapsed: 0.041 sec
15-Jun-2019 00:00:52 Running org.springframework.security.oauth2.provider.authentication.OAuth2AuthenticationDetailsTests
15-Jun-2019 00:00:52 Tests run: 1, Failures: 0, Errors: 0, Skipped: 0, Time elapsed: 0.001 sec
15-Jun-2019 00:00:52 Running org.springframework.security.oauth2.provider.authentication.OAuth2AuthenticationManagerTests
15-Jun-2019 00:00:52 Tests run: 3, Failures: 0, Errors: 0, Skipped: 0, Time elapsed: 0.001 sec
15-Jun-2019 00:00:52 Running org.springframework.security.oauth2.provider.endpoint.FrameworkEndpointHandlerMappingTests
15-Jun-2019 00:00:52 Tests run: 4, Failures: 0, Errors: 0, Skipped: 0, Time elapsed: 0.001 sec
15-Jun-2019 00:00:52 Running org.springframework.security.oauth2.provider.endpoint.WhitelabelApprovalEndpointTests
15-Jun-2019 00:00:52 Tests run: 6, Failures: 0, Errors: 0, Skipped: 0, Time elapsed: 0.003 sec
15-Jun-2019 00:00:52 Running org.springframework.security.oauth2.provider.endpoint.ExactMatchRedirectResolverTests
15-Jun-2019 00:00:52 Tests run: 3, Failures: 0, Errors: 0, Skipped: 0, Time elapsed: 0.001 sec
15-Jun-2019 00:00:52 Running org.springframework.security.oauth2.provider.endpoint.AuthorizationEndpointTests
15-Jun-2019 00:00:52 Tests run: 34, Failures: 0, Errors: 0, Skipped: 0, Time elapsed: 0.023 sec
15-Jun-2019 00:00:52 Running org.springframework.security.oauth2.provider.endpoint.TokenEndpointTests
15-Jun-2019 00:00:52 Tests run: 6, Failures: 0, Errors: 0, Skipped: 0, Time elapsed: 0.01 sec
15-Jun-2019 00:00:52 Running org.springframework.security.oauth2.provider.endpoint.DefaultRedirectResolverTests
15-Jun-2019 00:00:52 Tests run: 31, Failures: 0, Errors: 0, Skipped: 0, Time elapsed: 0.009 sec
15-Jun-2019 00:00:52 Running org.springframework.security.oauth2.provider.endpoint.WhitelabelErrorEndpointTests
15-Jun-2019 00:00:52 Tests run: 3, Failures: 0, Errors: 0, Skipped: 0, Time elapsed: 0.001 sec
15-Jun-2019 00:00:52 Running org.springframework.security.oauth2.provider.endpoint.TokenEndpointAuthenticationFilterTests
15-Jun-2019 00:00:52 Tests run: 3, Failures: 0, Errors: 0, Skipped: 0, Time elapsed: 0.014 sec
15-Jun-2019 00:00:52 Running org.springframework.security.oauth2.provider.AuthorizationRequestTests
15-Jun-2019 00:00:52 Tests run: 9, Failures: 0, Errors: 0, Skipped: 0, Time elapsed: 0.004 sec
15-Jun-2019 00:00:52 Running org.springframework.security.oauth2.provider.OAuth2AuthenticationTests
15-Jun-2019 00:00:52 {"authorities":[{"authority":"ROLE_USER"}],"details":null,"authenticated":false,"userAuthentication":{"authorities":[{"authority":"ROLE_USER"}],"details":null,"authenticated":true,"principal":"foo","credentials":"bar","name":"foo"},"clientOnly":false,"oauth2Request":{"clientId":"id","scope":["read"],"requestParameters":{},"resourceIds":[],"authorities":[],"approved":false,"refresh":false,"redirectUri":null,"responseTypes":[],"extensions":{},"grantType":null,"refreshTokenRequest":null},"principal":"foo","credentials":"","name":"foo"}
15-Jun-2019 00:00:52 Tests run: 8, Failures: 0, Errors: 0, Skipped: 0, Time elapsed: 0.014 sec
15-Jun-2019 00:00:52 Running org.springframework.security.oauth2.provider.expression.OAuth2MethodSecurityExpressionHandlerTests
15-Jun-2019 00:00:52 Tests run: 9, Failures: 0, Errors: 0, Skipped: 0, Time elapsed: 0.008 sec
15-Jun-2019 00:00:52 Running org.springframework.security.oauth2.provider.expression.OAuth2SecurityExpressionMethodsTests
15-Jun-2019 00:00:52 Tests run: 10, Failures: 0, Errors: 0, Skipped: 0, Time elapsed: 0.004 sec
15-Jun-2019 00:00:52 Running org.springframework.security.oauth2.provider.expression.OAuth2WebSecurityExpressionHandlerTests
15-Jun-2019 00:00:52 Tests run: 6, Failures: 0, Errors: 0, Skipped: 0, Time elapsed: 0.003 sec
15-Jun-2019 00:00:52 Running org.springframework.security.oauth2.provider.expression.OAuth2ExpressionParserTests
15-Jun-2019 00:00:52 Tests run: 3, Failures: 0, Errors: 0, Skipped: 0, Time elapsed: 0.006 sec
15-Jun-2019 00:00:52 Running org.springframework.security.oauth2.provider.OAuth2RequestTests
15-Jun-2019 00:00:52 Tests run: 4, Failures: 0, Errors: 0, Skipped: 0, Time elapsed: 0.001 sec
15-Jun-2019 00:00:52 Running org.springframework.security.oauth2.provider.code.AuthorizationCodeTokenGranterTests
15-Jun-2019 00:00:52 Tests run: 5, Failures: 0, Errors: 0, Skipped: 0, Time elapsed: 0.004 sec
15-Jun-2019 00:00:52 Running org.springframework.security.oauth2.provider.code.InMemoryAuthorizationCodeServicesTests
15-Jun-2019 00:00:52 Tests run: 3, Failures: 0, Errors: 0, Skipped: 0, Time elapsed: 0.001 sec
15-Jun-2019 00:00:52 Running org.springframework.security.oauth2.provider.code.JdbcAuthorizationCodeServicesTests
15-Jun-2019 00:00:52 Tests run: 3, Failures: 0, Errors: 0, Skipped: 0, Time elapsed: 0.03 sec
15-Jun-2019 00:00:52 Running org.springframework.security.oauth2.provider.code.SubdomainRedirectResolverTests
15-Jun-2019 00:00:52 Tests run: 2, Failures: 0, Errors: 0, Skipped: 0, Time elapsed: 0 sec
15-Jun-2019 00:00:52 Running org.springframework.security.oauth2.common.OAuth2AccessTokenJackson1DeserializerTests
15-Jun-2019 00:00:54 Tests run: 8, Failures: 0, Errors: 0, Skipped: 0, Time elapsed: 1.097 sec
15-Jun-2019 00:00:54 Running org.springframework.security.oauth2.common.OAuth2AccessTokenJackson2DeserializerTests
15-Jun-2019 00:00:55 Tests run: 9, Failures: 0, Errors: 0, Skipped: 0, Time elapsed: 1.082 sec
15-Jun-2019 00:00:55 Running org.springframework.security.oauth2.common.exception.OAuth2ExceptionDeserializerTests
15-Jun-2019 00:00:55 Tests run: 13, Failures: 0, Errors: 0, Skipped: 0, Time elapsed: 0.006 sec
15-Jun-2019 00:00:55 Running org.springframework.security.oauth2.common.exception.OAuth2ExceptionSerializerTests
15-Jun-2019 00:00:55 Tests run: 11, Failures: 0, Errors: 0, Skipped: 0, Time elapsed: 0.007 sec
15-Jun-2019 00:00:55 Running org.springframework.security.oauth2.common.exception.OAuth2ExceptionJackson2DeserializerTests
15-Jun-2019 00:00:55 Tests run: 14, Failures: 0, Errors: 0, Skipped: 0, Time elapsed: 0.004 sec
15-Jun-2019 00:00:55 Running org.springframework.security.oauth2.common.OAuth2AccessTokenJackson2SerializerTests
15-Jun-2019 00:00:56 Tests run: 10, Failures: 0, Errors: 0, Skipped: 0, Time elapsed: 0.924 sec
15-Jun-2019 00:00:56 Running org.springframework.security.oauth2.common.OAuth2AccessTokenJackson1SerializerTests
15-Jun-2019 00:00:59 Tests run: 1, Failures: 0, Errors: 0, Skipped: 0, Time elapsed: 3.827 sec
15-Jun-2019 00:01:00 org.apache.maven.surefire.util.SurefireReflectionException: java.lang.reflect.InvocationTargetException; nested exception is java.lang.reflect.InvocationTargetException: null
15-Jun-2019 00:01:01 Exception: java.lang.OutOfMemoryError thrown from the UncaughtExceptionHandler in thread "main"
15-Jun-2019 00:01:01
15-Jun-2019 00:01:01 Results :
15-Jun-2019 00:01:01
15-Jun-2019 00:01:01 Tests run: 696, Failures: 0, Errors: 0, Skipped: 0
15-Jun-2019 00:01:01
15-Jun-2019 00:01:01 [INFO] ------------------------------------------------------------------------
15-Jun-2019 00:01:01 [INFO] Reactor Summary:
15-Jun-2019 00:01:01 [INFO]
15-Jun-2019 00:01:01 [INFO] OAuth for Spring Security .......................... SUCCESS [  0.974 s]
15-Jun-2019 00:01:01 [INFO] OAuth 1(a) for Spring Security ..................... SUCCESS [  8.943 s]
15-Jun-2019 00:01:01 [INFO] OAuth2 for Spring Security ......................... FAILURE [ 32.529 s]
15-Jun-2019 00:01:01 [INFO] spring-oauth2-tests ................................ SKIPPED
15-Jun-2019 00:01:01 [INFO] spring-oauth2-tests-common ......................... SKIPPED
15-Jun-2019 00:01:01 [INFO] spring-oauth2-tests-vanilla ........................ SKIPPED
15-Jun-2019 00:01:01 [INFO] spring-oauth2-tests-mappings ....................... SKIPPED
15-Jun-2019 00:01:01 [INFO] spring-oauth2-tests-form ........................... SKIPPED
15-Jun-2019 00:01:01 [INFO] spring-oauth2-tests-jwt ............................ SKIPPED
15-Jun-2019 00:01:01 [INFO] spring-oauth2-tests-approval ....................... SKIPPED
15-Jun-2019 00:01:01 [INFO] spring-oauth2-tests-jdbc ........................... SKIPPED
15-Jun-2019 00:01:01 [INFO] spring-oauth2-tests-jpa ............................ SKIPPED
15-Jun-2019 00:01:01 [INFO] spring-oauth2-tests-jaxb ........................... SKIPPED
15-Jun-2019 00:01:01 [INFO] spring-oauth-tests-custom-grant .................... SKIPPED
15-Jun-2019 00:01:01 [INFO] spring-oauth2-tests-multi .......................... SKIPPED
15-Jun-2019 00:01:01 [INFO] spring-oauth2-tests-client ......................... SKIPPED
15-Jun-2019 00:01:01 [INFO] spring-oauth2-tests-resource ....................... SKIPPED
15-Jun-2019 00:01:01 [INFO] spring-oauth2-tests-custom-authentication .......... SKIPPED
15-Jun-2019 00:01:01 [INFO] spring-oauth2-tests-xml ............................ SKIPPED
15-Jun-2019 00:01:01 [INFO] spring-oauth2-tests-xml-common ..................... SKIPPED
15-Jun-2019 00:01:01 [INFO] spring-oauth2-tests-xml-vanilla .................... SKIPPED
15-Jun-2019 00:01:01 [INFO] spring-oauth2-tests-xml-mappings ................... SKIPPED
15-Jun-2019 00:01:01 [INFO] spring-oauth2-tests-xml-form ....................... SKIPPED
15-Jun-2019 00:01:01 [INFO] spring-oauth2-tests-xml-jwt ........................ SKIPPED
15-Jun-2019 00:01:01 [INFO] spring-oauth2-tests-xml-approval ................... SKIPPED
15-Jun-2019 00:01:01 [INFO] spring-oauth2-tests-xml-jdbc ....................... SKIPPED
15-Jun-2019 00:01:01 [INFO] spring-oauth2-tests-xml-client ..................... SKIPPED
15-Jun-2019 00:01:01 [INFO] OAuth for Spring Security - Integration Tests ...... SKIPPED
15-Jun-2019 00:01:01 [INFO] OAuth for Spring Security - Sparklr (OAuth 1 Provider Example) SKIPPED
15-Jun-2019 00:01:01 [INFO] OAuth for Spring Security - Tonr (OAuth 1 Consumer Example) SKIPPED
15-Jun-2019 00:01:01 [INFO] OAuth for Spring Security - Sparklr2 (OAuth 2 Provider Example) SKIPPED
15-Jun-2019 00:01:01 [INFO] OAuth for Spring Security - Tonr2 (OAuth 2 Client Example) SKIPPED
15-Jun-2019 00:01:01 [INFO] OAuth for Spring Security - Samples ................ SKIPPED
15-Jun-2019 00:01:01 [INFO] ------------------------------------------------------------------------
15-Jun-2019 00:01:01 [INFO] BUILD FAILURE
15-Jun-2019 00:01:01 [INFO] ------------------------------------------------------------------------
15-Jun-2019 00:01:01 [INFO] Total time: 45.694 s
15-Jun-2019 00:01:01 [INFO] Finished at: 2019-06-15T00:01:01+00:00
15-Jun-2019 00:01:01 [INFO] Final Memory: 75M/530M
15-Jun-2019 00:01:01 [INFO] ------------------------------------------------------------------------
15-Jun-2019 00:01:01 [ERROR] Failed to execute goal org.apache.maven.plugins:maven-surefire-plugin:2.12.4:test (default-test) on project spring-security-oauth2: Execution default-test of goal org.apache.maven.plugins:maven-surefire-plugin:2.12.4:test failed: The forked VM terminated without saying properly goodbye. VM crash or System.exit called ? -> [Help 1]
15-Jun-2019 00:01:01 [ERROR]
15-Jun-2019 00:01:01 [ERROR] To see the full stack trace of the errors, re-run Maven with the -e switch.
15-Jun-2019 00:01:01 [ERROR] Re-run Maven using the -X switch to enable full debug logging.
15-Jun-2019 00:01:01 [ERROR]
15-Jun-2019 00:01:01 [ERROR] For more information about the errors and possible solutions, please read the following articles:
15-Jun-2019 00:01:01 [ERROR] [Help 1] http://cwiki.apache.org/confluence/display/MAVEN/PluginExecutionException
15-Jun-2019 00:01:01 [ERROR]
15-Jun-2019 00:01:01 [ERROR] After correcting the problems, you can resume the build with the command
15-Jun-2019 00:01:01 [ERROR]   mvn <goals> -rf :spring-security-oauth2
15-Jun-2019 00:01:01 Exception in thread "main"
15-Jun-2019 00:01:01
15-Jun-2019 00:01:01 Failing task since return code of [/opt/jdk-7/bin/java -cp /opt/maven-3.3/boot/plexus-classworlds-2.5.2.jar -Dclassworlds.conf=/tmp/artifactoryM21077694723966948097conf -DbuildInfoConfig.propertiesFile=/tmp/buildInfo1742487486171861803.properties -Xmx1256m -Xms128m -Dmaven.home=/opt/maven-3.3 -Dmaven.multiModuleProjectDirectory=/opt/bamboo-home/xml-data/build-dir/SECOAUTH-NIGHTLY-JOB1 org.codehaus.plexus.classworlds.launcher.Launcher clean install -P bootstrap -Dartifactory.publish.password=********] was 1 while expected 0
15-Jun-2019 00:01:01 Finished task 'Artifactory Maven 3' with result: Failed
15-Jun-2019 00:01:01 Running post build plugin 'Docker Container Cleanup'
15-Jun-2019 00:01:01 Running post build plugin 'NCover Results Collector'
15-Jun-2019 00:01:01 Running post build plugin 'Artifactory Release Management Staging'
15-Jun-2019 00:01:01 Running post build plugin 'Artifactory Build Info Copier'
15-Jun-2019 00:01:01 Running post build plugin 'Artifactory Gradle Properties Info Copier'
15-Jun-2019 00:01:01 Running post build plugin 'Clover Results Collector'
15-Jun-2019 00:01:01 Running post build plugin 'npm Cache Cleanup'
15-Jun-2019 00:01:01 Running post build plugin 'Artifact Copier'
15-Jun-2019 00:01:01 Successfully removed working directory at '/opt/bamboo-home/xml-data/build-dir/SECOAUTH-NIGHTLY-JOB1'
15-Jun-2019 00:01:01 Finalising the build...
15-Jun-2019 00:01:01 Stopping timer.
15-Jun-2019 00:01:01 Build SECOAUTH-NIGHTLY-JOB1-1675 completed.
15-Jun-2019 00:01:01 Running on server: post build plugin 'NCover Results Collector'
15-Jun-2019 00:01:01 Running on server: post build plugin 'Build Hanging Detection Configuration'
15-Jun-2019 00:01:01 Running on server: post build plugin 'Clover Delta Calculator'
15-Jun-2019 00:01:01 Running on server: post build plugin 'Maven Dependencies Postprocessor'
15-Jun-2019 00:01:01 All post build plugins have finished
15-Jun-2019 00:01:01 Generating build results summary...
15-Jun-2019 00:01:01 Saving build results to disk...
15-Jun-2019 00:01:01 Logging substituted variables...
15-Jun-2019 00:01:01 Indexing build results...
15-Jun-2019 00:01:01 Finished building SECOAUTH-NIGHTLY-JOB1-1675.