Build: #1677 failed

Job: Default Job failed

Stages & jobs

  1. Default Stage

Build log

The build generated 549 lines of output. Download or view full build log

17-Jun-2019 00:00:06 Build Spring Security OAuth - 2.1.x - Default Job #1677 (SECOAUTH-NIGHTLY-JOB1-1677) started building on agent bamboo-15.af.pivotal.io
17-Jun-2019 00:00:06 Remote agent on host bamboo-15.af.pivotal.io
17-Jun-2019 00:00:06 Build working directory is /opt/bamboo-home/xml-data/build-dir/SECOAUTH-NIGHTLY-JOB1
17-Jun-2019 00:00:06 Executing build Spring Security OAuth - 2.1.x - Default Job #1677 (SECOAUTH-NIGHTLY-JOB1-1677)
17-Jun-2019 00:00:06 Starting task 'Checkout Default Repository' of type 'com.atlassian.bamboo.plugins.vcs:task.vcs.checkout'
17-Jun-2019 00:00:06 Build always requires a clean checkout
17-Jun-2019 00:00:06 Cleaning build directory '/opt/bamboo-home/xml-data/build-dir/SECOAUTH-NIGHTLY-JOB1'
17-Jun-2019 00:00:06 Checking out into /opt/bamboo-home/xml-data/build-dir/SECOAUTH-NIGHTLY-JOB1
17-Jun-2019 00:00:06 Updating source code to revision: 3d37444a991104dd7f23edb2812e9f57620a1395
17-Jun-2019 00:00:06 Creating local git repository in '/opt/bamboo-home/xml-data/build-dir/SECOAUTH-NIGHTLY-JOB1/.git'.
17-Jun-2019 00:00:06 Initialized empty Git repository in /opt/bamboo-home/xml-data/build-dir/SECOAUTH-NIGHTLY-JOB1/.git/
17-Jun-2019 00:00:08 Fetching 'refs/heads/master' from 'git://github.com/SpringSource/spring-security-oauth.git'. Will try to do a shallow fetch.
17-Jun-2019 00:00:12 From git://github.com/SpringSource/spring-security-oauth
17-Jun-2019 00:00:12 * [new branch]      master     -> master
17-Jun-2019 00:00:12 Checking out revision 3d37444a991104dd7f23edb2812e9f57620a1395.
17-Jun-2019 00:00:12 Already on 'master'
17-Jun-2019 00:00:12 Updated source code to revision: 3d37444a991104dd7f23edb2812e9f57620a1395
17-Jun-2019 00:00:12 Finished task 'Checkout Default Repository' with result: Success
17-Jun-2019 00:00:12 Running pre-build action: Artifactory Release Staging
17-Jun-2019 00:00:12 Running pre-build action: VCS Version Collector
17-Jun-2019 00:00:13 Skipping execution of task 'Build' as it is disabled
17-Jun-2019 00:00:13 Starting task 'Artifactory Maven 3' of type 'org.jfrog.bamboo.bamboo-artifactory-plugin:maven3Task'
17-Jun-2019 00:00:13 Bamboo Artifactory Plugin version: 2.6.3
17-Jun-2019 00:00:13
Beginning to execute external process for build 'Spring Security OAuth - 2.1.x - Default Job #1677 (SECOAUTH-NIGHTLY-JOB1-1677)'
... running command line:
/opt/jdk-7/bin/java -cp /opt/maven-3.3/boot/plexus-classworlds-2.5.2.jar -Dclassworlds.conf=/tmp/artifactoryM22360449665266965460conf -DbuildInfoConfig.propertiesFile=/tmp/buildInfo5242694032212655459.properties -Xmx1256m -Xms128m -Dmaven.home=/opt/maven-3.3 -Dmaven.multiModuleProjectDirectory=/opt/bamboo-home/xml-data/build-dir/SECOAUTH-NIGHTLY-JOB1 org.codehaus.plexus.classworlds.launcher.Launcher clean install -P bootstrap -Dartifactory.publish.password=********
... in: /opt/bamboo-home/xml-data/build-dir/SECOAUTH-NIGHTLY-JOB1
... using extra environment variables:
bamboo_planRepository_1_branch=master
bamboo_capability_system_builder_ant_Ant_1_7=/opt/ant-1.7
bamboo_repository_94273667_previous_revision_number=3d37444a991104dd7f23edb2812e9f57620a1395
bamboo_********_username_password=********
bamboo_signing_store_password=********
bamboo_capability_system_builder_ant_Ant_1_9=/opt/ant-1.9
bamboo_capability_system_builder_ant_Ant_1_8=/opt/ant-1.8
bamboo_planRepository_1_branchDisplayName=master
bamboo_artifactory_override_resolve_repo=libs-milestone
bamboo_capability_system_builder_node_Node_js_10_16=/opt/node-10.16/bin/node
bamboo_repository_revision_number=3d37444a991104dd7f23edb2812e9f57620a1395
bamboo_RIAK_BIN=/usr/sbin/riak
bamboo_repository_94273667_revision_number=3d37444a991104dd7f23edb2812e9f57620a1395
WRAPPER_BITS=32
bamboo_buildKey=SECOAUTH-NIGHTLY-JOB1
bamboo_repository_94273667_git_branch=master
bamboo_bintray_password=********
bamboo_sonar_token_password=********
PWD=/opt/bamboo-home/bin
bamboo_shortJobName=Default Job
bamboo_artifactory_override_resolver_password=********
bamboo_capability_system_builder_gradle___gradlew=./gradlew
bamboo_buildResultsUrl=https://build.spring.io/browse/SECOAUTH-NIGHTLY-JOB1-1677
bamboo_capability_system_builder_mvn3_Maven_3_3=/opt/maven-3.3
bamboo_capability_system_builder_mvn3_Maven_3_2=/opt/maven-3.2
bamboo_capability_system_builder_mvn3_Maven_3_1=/opt/maven-3.1
bamboo_planRepository_repositoryUrl=git://github.com/SpringSource/spring-security-oauth.git
bamboo_capability_system_builder_mvn3_Maven_3_6=/opt/maven-3.6
bamboo_agentId=286195723
bamboo_capability_system_builder_mvn3_Maven_3_5=/opt/maven-3.5
bamboo_capability_system_builder_mvn3_Maven_3_0=/opt/maven-3.0
bamboo_planRepository_revision=3d37444a991104dd7f23edb2812e9f57620a1395
bamboo_planRepository_previousRevision=3d37444a991104dd7f23edb2812e9f57620a1395
bamboo_capability_remote_build=true
bamboo_repository_branch_name=master
bamboo_sonatype_token_password=********
SHLVL=1
bamboo_org_jfrog_bamboo_buildInfo_serverUrl=https://repo.spring.io
bamboo_scdf_acceptance_tests_password=********
bamboo_repository_94273667_branch_name=master
WRAPPER_OS=linux
TERM=linux
XDG_SESSION_ID=c1
bamboo_planRepository_branch=master
bamboo_org_jfrog_bamboo_release_activated=false
bamboo_planRepository_1_type=gitv2
bamboo_planRepository_branchName=master
bamboo_capability_system_jdk_JDK_12=/opt/jdk-12
WRAPPER_FILE_SEPARATOR=/
_=/opt/bamboo-home/bin/bamboo-agent.sh
bamboo_capability_system_builder_ant_Ant_1_10=/opt/ant-1.10
bamboo_repository_94273667_name=Plan Repository
WRAPPER_PATH_SEPARATOR=:
bamboo_sonar_password=********
bamboo_hg_cache_directory=/opt/bamboo-home/xml-data/build-dir/_hg-repositories-cache
bamboo_planRepository_1_username=
bamboo_planRepository_type=gitv2
bamboo_git_cache_directory=/opt/bamboo-home/xml-data/build-dir/_git-repositories-cache
bamboo_artifactory_username=buildmaster
bamboo_tmp_directory=/opt/bamboo-home/temp
bamboo_planKey=SECOAUTH-NIGHTLY
bamboo_planRepository_username=
bamboo_JDK8_HOME=/opt/jdk-8
bamboo_repository_94273667_git_username=
bamboo_planRepository_1_branchName=master
bamboo_sonar_version=5.6.3
bamboo_sonar_jdbc_password=********
bamboo_bintray_api_key_password=********
XDG_DATA_DIRS=/usr/local/share:/usr/share:/var/lib/snapd/desktop
bamboo_capability_system_jdk_JDK_1_11=/opt/jdk-11
bamboo_resultsUrl=https://build.spring.io/browse/SECOAUTH-NIGHTLY-JOB1-1677
bamboo_capability_system_jdk_JDK_1_10=/opt/jdk-10
bamboo_build_working_directory=/opt/bamboo-home/xml-data/build-dir/SECOAUTH-NIGHTLY-JOB1
bamboo_planRepository_1_name=Plan Repository
bamboo_capability_system_os=ubuntu1804
bamboo_nexusPush_stagingProfile=buildmaster
bamboo_shortPlanName=2.1.x
MAIL=/var/mail/bamboo
bamboo_planRepository_name=Plan Repository
LOGNAME=bamboo
bamboo_buildNumber=1677
SHELL=/bin/bash
bamboo_planName=Spring Security OAuth - 2.1.x
bamboo_JDK7_HOME=/opt/jdk-7
bamboo_repository_94273667_git_repositoryUrl=git://github.com/SpringSource/spring-security-oauth.git
bamboo_shortPlanKey=NIGHTLY
OLDPWD=/opt/users/bamboo
bamboo_shortJobKey=JOB1
bamboo_artifactory_password=********
bamboo_buildTimeStamp=2019-06-17T00:00:04.836Z
bamboo_repository_previous_revision_number=3d37444a991104dd7f23edb2812e9f57620a1395
bamboo_sonar_username=buildmaster
bamboo_********_password=********
bamboo_repository_git_branch=master
bamboo_buildResultKey=SECOAUTH-NIGHTLY-JOB1-1677
bamboo_nexusPush_close=true
bamboo_artifactory_override_resolver_username=buildmaster
bamboo_buildPlanName=Spring Security OAuth - 2.1.x - Default Job
bamboo_planRepository_1_revision=3d37444a991104dd7f23edb2812e9f57620a1395
bamboo_repository_name=Plan Repository
bamboo_signing_key_password=********
bamboo_capability_system_builder_groovy_Groovy_2_5=/opt/groovy-2.5
LANG=en_US.UTF-8
bamboo_buildFailed=false
bamboo_capability_system_docker_executable=/usr/bin/docker
DISPLAY=localhost:1.0
bamboo_capability_system_jdk_OpenJDK_7=/opt/jdk-7
bamboo_capability_system_builder_groovy_Groovy_2_4=/opt/groovy-2.4
bamboo_artifactory_override_deployer_username=buildmaster
bamboo_capability_system_builder_command_Bash=/bin/bash
bamboo_artifactory_password_mask_a=********
bamboo_agentWorkingDirectory=/opt/bamboo-home/xml-data/build-dir
bamboo_capability_system_git_executable=/usr/bin/git
bamboo_repository_git_username=
bamboo_planRepository_1_previousRevision=3d37444a991104dd7f23edb2812e9f57620a1395
bamboo_capability_os_family=unix
bamboo_planRepository_branchDisplayName=master
bamboo_capability_system_builder_maven_Artifactory_Maven_3_6=/opt/maven-3.6
bamboo_capability_system_builder_maven_Artifactory_Maven_3_5=/opt/maven-3.5
GIT_SSL_NO_VERIFY=true
bamboo_capability_system_builder_maven_Artifactory_Maven_3_3=/opt/maven-3.3
bamboo_capability_system_builder_maven_Artifactory_Maven_3_2=/opt/maven-3.2
bamboo_s3_properties=/home/bamboo/tools/s3.properties
bamboo_capability_system_builder_maven_Artifactory_Maven_3_1=/opt/maven-3.1
bamboo_artifactory_override_deploy_repo=libs-snapshot-local
bamboo_capability_system_builder_maven_Artifactory_Maven_3_0=/opt/maven-3.0
bamboo_plan_storageTag=SECOAUTH-NIGHTLY
bamboo_bintray_username_password=********
USER=bamboo
bamboo_repository_git_repositoryUrl=git://github.com/SpringSource/spring-security-oauth.git
bamboo_working_directory=/opt/bamboo-home/xml-data/build-dir/SECOAUTH-NIGHTLY-JOB1
bamboo_org_jfrog_bamboo_buildInfo_activated=true
bamboo_planRepository_1_repositoryUrl=git://github.com/SpringSource/spring-security-oauth.git
bamboo_capability_system_jdk_JDK_1_8=/opt/jdk-8
bamboo_artifactory_override_deployer_password=********
bamboo_capability_system_jdk_JDK_1_9=/opt/jdk-9
WRAPPER_ARCH=x86
bamboo_capability_system_jdk_JDK_1_6=/opt/jdk-6
bamboo_sonatype_password=********
bamboo_capability_system_jdk_JDK_1_7=/opt/jdk-7
bamboo_sonar_ip=10.194.6.9
XDG_RUNTIME_DIR=/run/user/1002
HOME=/home/bamboo
PATH=/bin:/home/bamboo/bin:/usr/local/sbin:/usr/local/bin:/usr/sbin:/usr/bin:/sbin:/bin:/usr/games:/usr/local/games:/snap/bin:/home/bamboo/bin:/usr/local/bin:/bin:/home/bamboo/bin:/usr/local/sbin:/usr/local/bin:/usr/sbin:/usr/bin:/sbin:/bin:/usr/games:/usr/local/games:/snap/bin:/home/bamboo/bin:/usr/local/bin
17-Jun-2019 00:00:14 [INFO] Scanning for projects...
17-Jun-2019 00:00:16 [INFO] Initializing Artifactory Build-Info Recording
17-Jun-2019 00:00:16 [INFO] ------------------------------------------------------------------------
17-Jun-2019 00:00:16 [INFO] Reactor Build Order:
17-Jun-2019 00:00:16 [INFO]
17-Jun-2019 00:00:16 [INFO] OAuth for Spring Security
17-Jun-2019 00:00:16 [INFO] OAuth 1(a) for Spring Security
17-Jun-2019 00:00:16 [INFO] OAuth2 for Spring Security
17-Jun-2019 00:00:16 [INFO] spring-oauth2-tests
17-Jun-2019 00:00:16 [INFO] spring-oauth2-tests-common
17-Jun-2019 00:00:16 [INFO] spring-oauth2-tests-vanilla
17-Jun-2019 00:00:16 [INFO] spring-oauth2-tests-mappings
17-Jun-2019 00:00:16 [INFO] spring-oauth2-tests-form
17-Jun-2019 00:00:16 [INFO] spring-oauth2-tests-jwt
17-Jun-2019 00:00:16 [INFO] spring-oauth2-tests-approval
17-Jun-2019 00:00:16 [INFO] spring-oauth2-tests-jdbc
17-Jun-2019 00:00:16 [INFO] spring-oauth2-tests-jpa
17-Jun-2019 00:00:16 [INFO] spring-oauth2-tests-jaxb
17-Jun-2019 00:00:16 [INFO] spring-oauth-tests-custom-grant
17-Jun-2019 00:00:16 [INFO] spring-oauth2-tests-multi
17-Jun-2019 00:00:16 [INFO] spring-oauth2-tests-client
17-Jun-2019 00:00:16 [INFO] spring-oauth2-tests-resource
17-Jun-2019 00:00:16 [INFO] spring-oauth2-tests-custom-authentication
17-Jun-2019 00:00:16 [INFO] spring-oauth2-tests-xml
17-Jun-2019 00:00:16 [INFO] spring-oauth2-tests-xml-common
17-Jun-2019 00:00:16 [INFO] spring-oauth2-tests-xml-vanilla
17-Jun-2019 00:00:16 [INFO] spring-oauth2-tests-xml-mappings
17-Jun-2019 00:00:16 [INFO] spring-oauth2-tests-xml-form
17-Jun-2019 00:00:16 [INFO] spring-oauth2-tests-xml-jwt
17-Jun-2019 00:00:16 [INFO] spring-oauth2-tests-xml-approval
17-Jun-2019 00:00:16 [INFO] spring-oauth2-tests-xml-jdbc
17-Jun-2019 00:00:16 [INFO] spring-oauth2-tests-xml-client
17-Jun-2019 00:00:16 [INFO] OAuth for Spring Security - Integration Tests
17-Jun-2019 00:00:16 [INFO] OAuth for Spring Security - Sparklr (OAuth 1 Provider Example)
17-Jun-2019 00:00:16 [INFO] OAuth for Spring Security - Tonr (OAuth 1 Consumer Example)
17-Jun-2019 00:00:16 [INFO] OAuth for Spring Security - Sparklr2 (OAuth 2 Provider Example)
17-Jun-2019 00:00:16 [INFO] OAuth for Spring Security - Tonr2 (OAuth 2 Client Example)
17-Jun-2019 00:00:16 [INFO] OAuth for Spring Security - Samples
17-Jun-2019 00:00:16 [INFO]                                                                         
17-Jun-2019 00:00:16 [INFO] ------------------------------------------------------------------------
17-Jun-2019 00:00:16 [INFO] Building OAuth for Spring Security 2.3.7.BUILD-SNAPSHOT
17-Jun-2019 00:00:16 [INFO] ------------------------------------------------------------------------
17-Jun-2019 00:00:16 [INFO]
17-Jun-2019 00:00:16 [INFO] --- maven-clean-plugin:2.5:clean (default-clean) @ spring-security-oauth-parent ---
17-Jun-2019 00:00:16 [INFO]
17-Jun-2019 00:00:16 [INFO] >>> maven-source-plugin:2.1.2:jar (attach-sources) > generate-sources @ spring-security-oauth-parent >>>
17-Jun-2019 00:00:16 [INFO]
17-Jun-2019 00:00:16 [INFO] <<< maven-source-plugin:2.1.2:jar (attach-sources) < generate-sources @ spring-security-oauth-parent <<<
17-Jun-2019 00:00:16 [INFO]
17-Jun-2019 00:00:16 [INFO] --- maven-source-plugin:2.1.2:jar (attach-sources) @ spring-security-oauth-parent ---
17-Jun-2019 00:00:17 [INFO]
17-Jun-2019 00:00:17 [INFO] --- maven-javadoc-plugin:2.9.1:jar (javadoc) @ spring-security-oauth-parent ---
17-Jun-2019 00:00:17 [INFO] Not executing Javadoc as the project is not a Java classpath-capable package
17-Jun-2019 00:00:17 [INFO]
17-Jun-2019 00:00:17 [INFO] --- maven-install-plugin:2.4:install (default-install) @ spring-security-oauth-parent ---
17-Jun-2019 00:00:17 [INFO] Installing /opt/bamboo-home/xml-data/build-dir/SECOAUTH-NIGHTLY-JOB1/pom.xml to /home/bamboo/.m2/repository/org/springframework/security/oauth/spring-security-oauth-parent/2.3.7.BUILD-SNAPSHOT/spring-security-oauth-parent-2.3.7.BUILD-SNAPSHOT.pom
17-Jun-2019 00:00:17 [INFO]                                                                         
17-Jun-2019 00:00:17 [INFO] ------------------------------------------------------------------------
17-Jun-2019 00:00:17 [INFO] Building OAuth 1(a) for Spring Security 2.3.7.BUILD-SNAPSHOT
17-Jun-2019 00:00:17 [INFO] ------------------------------------------------------------------------
17-Jun-2019 00:00:17 [INFO]
17-Jun-2019 00:00:17 [INFO] --- maven-clean-plugin:2.5:clean (default-clean) @ spring-security-oauth ---
17-Jun-2019 00:00:17 [INFO]
17-Jun-2019 00:00:17 [INFO] --- maven-resources-plugin:2.6:resources (default-resources) @ spring-security-oauth ---
17-Jun-2019 00:00:17 [INFO] Using 'UTF-8' encoding to copy filtered resources.
17-Jun-2019 00:00:17 [INFO] Copying 3 resources
17-Jun-2019 00:00:17 [INFO]
17-Jun-2019 00:00:17 [INFO] --- maven-compiler-plugin:2.3.2:compile (default-compile) @ spring-security-oauth ---
17-Jun-2019 00:00:17 [INFO] Compiling 108 source files to /opt/bamboo-home/xml-data/build-dir/SECOAUTH-NIGHTLY-JOB1/spring-security-oauth/target/classes
17-Jun-2019 00:00:18 [WARNING] /opt/bamboo-home/xml-data/build-dir/SECOAUTH-NIGHTLY-JOB1/spring-security-oauth/src/main/java/org/springframework/security/oauth/consumer/net/OAuthOverHttpsURLStreamHandler.java:[36,78] Handler is internal proprietary API and may be removed in a future release
17-Jun-2019 00:00:18 [WARNING] /opt/bamboo-home/xml-data/build-dir/SECOAUTH-NIGHTLY-JOB1/spring-security-oauth/src/main/java/org/springframework/security/oauth/consumer/net/OAuthOverHttpURLStreamHandler.java:[36,76] Handler is internal proprietary API and may be removed in a future release
17-Jun-2019 00:00:18 [INFO]
17-Jun-2019 00:00:18 [INFO] --- maven-resources-plugin:2.6:testResources (default-testResources) @ spring-security-oauth ---
17-Jun-2019 00:00:18 [INFO] Using 'UTF-8' encoding to copy filtered resources.
17-Jun-2019 00:00:18 [INFO] Copying 8 resources
17-Jun-2019 00:00:18 [INFO]
17-Jun-2019 00:00:18 [INFO] --- maven-compiler-plugin:2.3.2:testCompile (default-testCompile) @ spring-security-oauth ---
17-Jun-2019 00:00:18 [INFO] Compiling 22 source files to /opt/bamboo-home/xml-data/build-dir/SECOAUTH-NIGHTLY-JOB1/spring-security-oauth/target/test-classes
17-Jun-2019 00:00:19 [WARNING] /opt/bamboo-home/xml-data/build-dir/SECOAUTH-NIGHTLY-JOB1/spring-security-oauth/src/test/java/org/springframework/security/oauth/consumer/client/CoreOAuthConsumerSupportTests.java:[65,32] Handler is internal proprietary API and may be removed in a future release
17-Jun-2019 00:00:19 [WARNING] /opt/bamboo-home/xml-data/build-dir/SECOAUTH-NIGHTLY-JOB1/spring-security-oauth/src/test/java/org/springframework/security/oauth/consumer/client/CoreOAuthConsumerSupportTests.java:[483,54] Handler is internal proprietary API and may be removed in a future release
17-Jun-2019 00:00:19 [INFO]
17-Jun-2019 00:00:19 [INFO] --- maven-surefire-plugin:2.12.4:test (default-test) @ spring-security-oauth ---
17-Jun-2019 00:00:19 [INFO] Surefire report directory: /opt/bamboo-home/xml-data/build-dir/SECOAUTH-NIGHTLY-JOB1/spring-security-oauth/target/surefire-reports
17-Jun-2019 00:00:19
17-Jun-2019 00:00:19 -------------------------------------------------------
17-Jun-2019 00:00:19 T E S T S
17-Jun-2019 00:00:19 -------------------------------------------------------
17-Jun-2019 00:00:20 Running org.springframework.security.oauth.config.FilterChainInitializationTests
17-Jun-2019 00:00:21 Tests run: 1, Failures: 0, Errors: 0, Skipped: 0, Time elapsed: 1.017 sec
17-Jun-2019 00:00:21 Running org.springframework.security.oauth.config.AuthorizationServerBeanDefinitionParserTests
17-Jun-2019 00:00:21 Tests run: 2, Failures: 0, Errors: 0, Skipped: 0, Time elapsed: 0.331 sec
17-Jun-2019 00:00:21 Running org.springframework.security.oauth.config.ConsumerServiceBeanDefinitionParserTests
17-Jun-2019 00:00:21 Tests run: 2, Failures: 0, Errors: 0, Skipped: 0, Time elapsed: 0.255 sec
17-Jun-2019 00:00:21 Running org.springframework.security.oauth.provider.nonce.InMemoryNonceServicesTests
17-Jun-2019 00:00:21 Tests run: 5, Failures: 0, Errors: 0, Skipped: 0, Time elapsed: 0.003 sec
17-Jun-2019 00:00:21 Running org.springframework.security.oauth.provider.filter.ProtectedResourceProcessingFilterTests
17-Jun-2019 00:00:21 Tests run: 1, Failures: 0, Errors: 0, Skipped: 0, Time elapsed: 0.145 sec
17-Jun-2019 00:00:21 Running org.springframework.security.oauth.provider.filter.OAuthProcessingFilterTests
17-Jun-2019 00:00:21 Tests run: 3, Failures: 0, Errors: 0, Skipped: 0, Time elapsed: 0.047 sec
17-Jun-2019 00:00:21 Running org.springframework.security.oauth.provider.filter.OAuthUserAuthorizationProcessingFilterTests
17-Jun-2019 00:00:21 Tests run: 1, Failures: 0, Errors: 0, Skipped: 0, Time elapsed: 0.005 sec
17-Jun-2019 00:00:21 Running org.springframework.security.oauth.provider.filter.UserAuthorizationSuccessfulAuthenticationHandlerTests
17-Jun-2019 00:00:21 Tests run: 1, Failures: 0, Errors: 0, Skipped: 0, Time elapsed: 0.004 sec
17-Jun-2019 00:00:21 Running org.springframework.security.oauth.provider.filter.AccessTokenProcessingFilterTests
17-Jun-2019 00:00:21 Tests run: 2, Failures: 0, Errors: 0, Skipped: 0, Time elapsed: 0.004 sec
17-Jun-2019 00:00:21 Running org.springframework.security.oauth.provider.filter.UnauthenticatedRequestTokenProcessingFilterTests
17-Jun-2019 00:00:21 Tests run: 2, Failures: 0, Errors: 0, Skipped: 0, Time elapsed: 0.005 sec
17-Jun-2019 00:00:21 Running org.springframework.security.oauth.provider.CoreOAuthProviderSupportTests
17-Jun-2019 00:00:21 Tests run: 2, Failures: 0, Errors: 0, Skipped: 0, Time elapsed: 0.005 sec
17-Jun-2019 00:00:21 Running org.springframework.security.oauth.common.signature.PlainTextSignatureMethodTests
17-Jun-2019 00:00:21 Tests run: 1, Failures: 0, Errors: 0, Skipped: 0, Time elapsed: 0.001 sec
17-Jun-2019 00:00:21 Running org.springframework.security.oauth.common.signature.CoreOAuthSignatureMethodFactoryTests
17-Jun-2019 00:00:22 Tests run: 1, Failures: 0, Errors: 0, Skipped: 0, Time elapsed: 0.213 sec
17-Jun-2019 00:00:22 Running org.springframework.security.oauth.common.signature.RSA_SHA1SignatureMethodTests
17-Jun-2019 00:00:22 Tests run: 2, Failures: 0, Errors: 0, Skipped: 0, Time elapsed: 0.058 sec
17-Jun-2019 00:00:22 Running org.springframework.security.oauth.common.signature.HMAC_SHA1SignatureMethodTests
17-Jun-2019 00:00:22 Tests run: 3, Failures: 0, Errors: 0, Skipped: 0, Time elapsed: 0.001 sec
17-Jun-2019 00:00:22 Running org.springframework.security.oauth.common.OAuthCodecTests
17-Jun-2019 00:00:22 Tests run: 1, Failures: 0, Errors: 0, Skipped: 0, Time elapsed: 0 sec
17-Jun-2019 00:00:22 Running org.springframework.security.oauth.consumer.client.CoreOAuthConsumerSupportTests
17-Jun-2019 00:00:22 Tests run: 10, Failures: 0, Errors: 0, Skipped: 0, Time elapsed: 0.001 sec
17-Jun-2019 00:00:22 Running org.springframework.security.oauth.consumer.client.OAuthRestTemplateTests
17-Jun-2019 00:00:22 Tests run: 2, Failures: 0, Errors: 0, Skipped: 0, Time elapsed: 0.105 sec
17-Jun-2019 00:00:22 Running org.springframework.security.oauth.consumer.GoogleOAuthTests
17-Jun-2019 00:00:22 Tests run: 1, Failures: 0, Errors: 0, Skipped: 0, Time elapsed: 0.003 sec
17-Jun-2019 00:00:22 Running org.springframework.security.oauth.consumer.filter.OAuthConsumerContextFilterTests
17-Jun-2019 00:00:22 Tests run: 2, Failures: 0, Errors: 0, Skipped: 0, Time elapsed: 0.019 sec
17-Jun-2019 00:00:22 Running org.springframework.security.oauth.consumer.rememberme.HttpSessionOAuthRememberMeServicesTests
17-Jun-2019 00:00:22 Tests run: 4, Failures: 0, Errors: 0, Skipped: 0, Time elapsed: 0.009 sec
17-Jun-2019 00:00:22 Running net.oauth.signature.GoogleCodeCompatibilityTests
17-Jun-2019 00:00:22 Tests run: 2, Failures: 0, Errors: 0, Skipped: 0, Time elapsed: 0.013 sec
17-Jun-2019 00:00:22
17-Jun-2019 00:00:22 Results :
17-Jun-2019 00:00:22
17-Jun-2019 00:00:22 Tests run: 51, Failures: 0, Errors: 0, Skipped: 0
17-Jun-2019 00:00:22
17-Jun-2019 00:00:22 [INFO]
17-Jun-2019 00:00:22 [INFO] --- maven-jar-plugin:2.4:jar (default-jar) @ spring-security-oauth ---
17-Jun-2019 00:00:22 [INFO] Building jar: /opt/bamboo-home/xml-data/build-dir/SECOAUTH-NIGHTLY-JOB1/spring-security-oauth/target/spring-security-oauth-2.3.7.BUILD-SNAPSHOT.jar
17-Jun-2019 00:00:22 [INFO]
17-Jun-2019 00:00:22 [INFO] >>> maven-source-plugin:2.1.2:jar (attach-sources) > generate-sources @ spring-security-oauth >>>
17-Jun-2019 00:00:22 [INFO]
17-Jun-2019 00:00:22 [INFO] <<< maven-source-plugin:2.1.2:jar (attach-sources) < generate-sources @ spring-security-oauth <<<
17-Jun-2019 00:00:22 [INFO]
17-Jun-2019 00:00:22 [INFO] --- maven-source-plugin:2.1.2:jar (attach-sources) @ spring-security-oauth ---
17-Jun-2019 00:00:22 [INFO] org already added, skipping
17-Jun-2019 00:00:22 [INFO] org/springframework already added, skipping
17-Jun-2019 00:00:22 [INFO] org/springframework/security already added, skipping
17-Jun-2019 00:00:22 [INFO] org/springframework/security/oauth already added, skipping
17-Jun-2019 00:00:23 [INFO] Building jar: /opt/bamboo-home/xml-data/build-dir/SECOAUTH-NIGHTLY-JOB1/spring-security-oauth/target/spring-security-oauth-2.3.7.BUILD-SNAPSHOT-sources.jar
17-Jun-2019 00:00:23 [INFO] org already added, skipping
17-Jun-2019 00:00:23 [INFO] org/springframework already added, skipping
17-Jun-2019 00:00:23 [INFO] org/springframework/security already added, skipping
17-Jun-2019 00:00:23 [INFO] org/springframework/security/oauth already added, skipping
17-Jun-2019 00:00:23 [INFO]
17-Jun-2019 00:00:23 [INFO] --- maven-javadoc-plugin:2.9.1:jar (javadoc) @ spring-security-oauth ---
17-Jun-2019 00:00:26 [INFO]
17-Jun-2019 00:00:26 2 warnings
17-Jun-2019 00:00:26 [WARNING] Javadoc Warnings
17-Jun-2019 00:00:26 [WARNING] /opt/bamboo-home/xml-data/build-dir/SECOAUTH-NIGHTLY-JOB1/spring-security-oauth/src/main/java/org/springframework/security/oauth/consumer/net/OAuthOverHttpURLStreamHandler.java:36: warning: Handler is internal proprietary API and may be removed in a future release
17-Jun-2019 00:00:26 [WARNING] public class OAuthOverHttpURLStreamHandler extends sun.net.www.protocol.http.Handler {
17-Jun-2019 00:00:26 [WARNING] ^
17-Jun-2019 00:00:26 [WARNING] /opt/bamboo-home/xml-data/build-dir/SECOAUTH-NIGHTLY-JOB1/spring-security-oauth/src/main/java/org/springframework/security/oauth/consumer/net/OAuthOverHttpsURLStreamHandler.java:36: warning: Handler is internal proprietary API and may be removed in a future release
17-Jun-2019 00:00:26 [WARNING] public class OAuthOverHttpsURLStreamHandler extends sun.net.www.protocol.https.Handler {
17-Jun-2019 00:00:26 [WARNING] ^
17-Jun-2019 00:00:26 [INFO] Building jar: /opt/bamboo-home/xml-data/build-dir/SECOAUTH-NIGHTLY-JOB1/spring-security-oauth/target/spring-security-oauth-2.3.7.BUILD-SNAPSHOT-javadoc.jar
17-Jun-2019 00:00:26 [INFO]
17-Jun-2019 00:00:26 [INFO] --- maven-install-plugin:2.4:install (default-install) @ spring-security-oauth ---
17-Jun-2019 00:00:26 [INFO] Installing /opt/bamboo-home/xml-data/build-dir/SECOAUTH-NIGHTLY-JOB1/spring-security-oauth/target/spring-security-oauth-2.3.7.BUILD-SNAPSHOT.jar to /home/bamboo/.m2/repository/org/springframework/security/oauth/spring-security-oauth/2.3.7.BUILD-SNAPSHOT/spring-security-oauth-2.3.7.BUILD-SNAPSHOT.jar
17-Jun-2019 00:00:26 [INFO] Installing /opt/bamboo-home/xml-data/build-dir/SECOAUTH-NIGHTLY-JOB1/spring-security-oauth/pom.xml to /home/bamboo/.m2/repository/org/springframework/security/oauth/spring-security-oauth/2.3.7.BUILD-SNAPSHOT/spring-security-oauth-2.3.7.BUILD-SNAPSHOT.pom
17-Jun-2019 00:00:26 [INFO] Installing /opt/bamboo-home/xml-data/build-dir/SECOAUTH-NIGHTLY-JOB1/spring-security-oauth/target/spring-security-oauth-2.3.7.BUILD-SNAPSHOT-sources.jar to /home/bamboo/.m2/repository/org/springframework/security/oauth/spring-security-oauth/2.3.7.BUILD-SNAPSHOT/spring-security-oauth-2.3.7.BUILD-SNAPSHOT-sources.jar
17-Jun-2019 00:00:26 [INFO] Installing /opt/bamboo-home/xml-data/build-dir/SECOAUTH-NIGHTLY-JOB1/spring-security-oauth/target/spring-security-oauth-2.3.7.BUILD-SNAPSHOT-javadoc.jar to /home/bamboo/.m2/repository/org/springframework/security/oauth/spring-security-oauth/2.3.7.BUILD-SNAPSHOT/spring-security-oauth-2.3.7.BUILD-SNAPSHOT-javadoc.jar
17-Jun-2019 00:00:26 [INFO]                                                                         
17-Jun-2019 00:00:26 [INFO] ------------------------------------------------------------------------
17-Jun-2019 00:00:26 [INFO] Building OAuth2 for Spring Security 2.3.7.BUILD-SNAPSHOT
17-Jun-2019 00:00:26 [INFO] ------------------------------------------------------------------------
17-Jun-2019 00:00:26 [INFO]
17-Jun-2019 00:00:26 [INFO] --- maven-clean-plugin:2.5:clean (default-clean) @ spring-security-oauth2 ---
17-Jun-2019 00:00:26 [INFO]
17-Jun-2019 00:00:26 [INFO] --- maven-resources-plugin:2.6:resources (default-resources) @ spring-security-oauth2 ---
17-Jun-2019 00:00:26 [INFO] Using 'UTF-8' encoding to copy filtered resources.
17-Jun-2019 00:00:26 [INFO] Copying 4 resources
17-Jun-2019 00:00:26 [INFO]
17-Jun-2019 00:00:26 [INFO] --- maven-compiler-plugin:2.3.2:compile (default-compile) @ spring-security-oauth2 ---
17-Jun-2019 00:00:26 [INFO] Compiling 249 source files to /opt/bamboo-home/xml-data/build-dir/SECOAUTH-NIGHTLY-JOB1/spring-security-oauth2/target/classes
17-Jun-2019 00:00:28 [INFO]
17-Jun-2019 00:00:28 [INFO] --- maven-resources-plugin:2.6:testResources (default-testResources) @ spring-security-oauth2 ---
17-Jun-2019 00:00:28 [INFO] Using 'UTF-8' encoding to copy filtered resources.
17-Jun-2019 00:00:28 [INFO] Copying 21 resources
17-Jun-2019 00:00:28 [INFO]
17-Jun-2019 00:00:28 [INFO] --- maven-compiler-plugin:2.3.2:testCompile (default-testCompile) @ spring-security-oauth2 ---
17-Jun-2019 00:00:28 [INFO] Compiling 120 source files to /opt/bamboo-home/xml-data/build-dir/SECOAUTH-NIGHTLY-JOB1/spring-security-oauth2/target/test-classes
17-Jun-2019 00:00:31 [INFO]
17-Jun-2019 00:00:31 [INFO] --- maven-surefire-plugin:2.12.4:test (default-test) @ spring-security-oauth2 ---
17-Jun-2019 00:00:31 [INFO] Surefire report directory: /opt/bamboo-home/xml-data/build-dir/SECOAUTH-NIGHTLY-JOB1/spring-security-oauth2/target/surefire-reports
17-Jun-2019 00:00:31
17-Jun-2019 00:00:31 -------------------------------------------------------
17-Jun-2019 00:00:31 T E S T S
17-Jun-2019 00:00:31 -------------------------------------------------------
17-Jun-2019 00:00:31 Running org.springframework.security.oauth2.config.annotation.TokenServicesMultipleBeansTests
17-Jun-2019 00:00:33 Tests run: 1, Failures: 0, Errors: 0, Skipped: 0, Time elapsed: 1.438 sec
17-Jun-2019 00:00:33 Running org.springframework.security.oauth2.config.annotation.Gh501EnableAuthorizationServerTests
17-Jun-2019 00:00:33 Tests run: 1, Failures: 0, Errors: 0, Skipped: 0, Time elapsed: 0.681 sec
17-Jun-2019 00:00:33 Running org.springframework.security.oauth2.config.annotation.ClientConfigurationTests
17-Jun-2019 00:00:34 Tests run: 1, Failures: 0, Errors: 0, Skipped: 0, Time elapsed: 0.234 sec
17-Jun-2019 00:00:34 Running org.springframework.security.oauth2.config.annotation.ResourceServerConfigurationTests
17-Jun-2019 00:00:34 [WARN] TokenEndpoint - Handling error: InvalidRequestException, Missing grant type
17-Jun-2019 00:00:35 [WARN] PageNotFound - No mapping found for HTTP request with URI [/] in DispatcherServlet with name ''
17-Jun-2019 00:00:35 [WARN] PageNotFound - No mapping found for HTTP request with URI [/] in DispatcherServlet with name ''
17-Jun-2019 00:00:35 [WARN] PageNotFound - No mapping found for HTTP request with URI [/] in DispatcherServlet with name ''
17-Jun-2019 00:00:35 [WARN] PageNotFound - No mapping found for HTTP request with URI [/] in DispatcherServlet with name ''
17-Jun-2019 00:00:35 [WARN] TokenEndpoint - Handling error: InvalidRequestException, Missing grant type
17-Jun-2019 00:00:35 Tests run: 9, Failures: 0, Errors: 0, Skipped: 0, Time elapsed: 1.586 sec
17-Jun-2019 00:00:35 Running org.springframework.security.oauth2.config.annotation.AuthorizationServerConfigurationTests
17-Jun-2019 00:00:35 [WARN] AnnotationConfigWebApplicationContext - Exception encountered during context initialization - cancelling refresh attempt: org.springframework.beans.factory.UnsatisfiedDependencyException: Error creating bean with name 'org.springframework.security.config.annotation.web.configuration.WebSecurityConfiguration': Unsatisfied dependency expressed through method 'setFilterChainProxySecurityConfigurer' parameter 1; nested exception is org.springframework.beans.factory.BeanExpressionException: Expression parsing failed; nested exception is org.springframework.beans.factory.UnsatisfiedDependencyException: Error creating bean with name 'org.springframework.security.oauth2.config.annotation.web.configuration.AuthorizationServerSecurityConfiguration': Unsatisfied dependency expressed through field 'configurers'; nested exception is org.springframework.beans.factory.NoSuchBeanDefinitionException: No qualifying bean of type 'java.util.List<org.springframework.security.oauth2.config.annotation.web.configuration.AuthorizationServerConfigurer>' available: expected at least 1 bean which qualifies as autowire candidate. Dependency annotations: {@org.springframework.beans.factory.annotation.Autowired(required=true)}
17-Jun-2019 00:00:36 [WARN] JwtAccessTokenConverter - Unable to create an RSA verifier from verifierKey (ignoreable if using MAC)
17-Jun-2019 00:00:37 [WARN] AnnotationConfigWebApplicationContext - Exception encountered during context initialization - cancelling refresh attempt: org.springframework.beans.factory.UnsatisfiedDependencyException: Error creating bean with name 'authorizationServerConfigurationTests.AuthorizationServerTypes': Unsatisfied dependency expressed through field 'tokenServices'; nested exception is org.springframework.beans.factory.BeanCreationException: Error creating bean with name 'org.springframework.security.oauth2.config.annotation.web.configuration.AuthorizationServerEndpointsConfiguration': Invocation of init method failed; nested exception is java.lang.AssertionError
17-Jun-2019 00:00:37 Tests run: 20, Failures: 0, Errors: 0, Skipped: 0, Time elapsed: 2.166 sec
17-Jun-2019 00:00:37 Running org.springframework.security.oauth2.config.annotation.Gh808EnableAuthorizationServerTests
17-Jun-2019 00:00:38 Tests run: 2, Failures: 0, Errors: 0, Skipped: 0, Time elapsed: 0.144 sec
17-Jun-2019 00:00:38 Running org.springframework.security.oauth2.config.xml.ResourceServerBeanDefinitionParserTests
17-Jun-2019 00:00:38 Tests run: 2, Failures: 0, Errors: 0, Skipped: 0, Time elapsed: 0.183 sec
17-Jun-2019 00:00:38 Running org.springframework.security.oauth2.config.xml.AuthorizationServerInvalidParserTests
17-Jun-2019 00:00:38 Tests run: 1, Failures: 0, Errors: 0, Skipped: 0, Time elapsed: 0.029 sec
17-Jun-2019 00:00:38 Running org.springframework.security.oauth2.config.xml.AuthorizationServerBeanDefinitionParserTests
17-Jun-2019 00:00:38 Tests run: 12, Failures: 0, Errors: 0, Skipped: 0, Time elapsed: 0.479 sec
17-Jun-2019 00:00:38 Running org.springframework.security.oauth2.config.xml.ClientDetailsServiceBeanDefinitionParserTests
17-Jun-2019 00:00:38 Tests run: 3, Failures: 0, Errors: 0, Skipped: 0, Time elapsed: 0.034 sec
17-Jun-2019 00:00:38 Running org.springframework.security.oauth2.config.xml.ResourceBeanDefinitionParserTests
17-Jun-2019 00:00:38 Tests run: 7, Failures: 0, Errors: 0, Skipped: 0, Time elapsed: 0.064 sec
17-Jun-2019 00:00:38 Running org.springframework.security.oauth2.config.xml.InvalidResourceBeanDefinitionParserTests
17-Jun-2019 00:00:38 Tests run: 5, Failures: 0, Errors: 0, Skipped: 0, Time elapsed: 0.056 sec
17-Jun-2019 00:00:38 Running org.springframework.security.oauth2.config.xml.AuthorizationServerCustomGrantParserTests
17-Jun-2019 00:00:38 Tests run: 1, Failures: 0, Errors: 0, Skipped: 0, Time elapsed: 0.022 sec
17-Jun-2019 00:00:38 Running org.springframework.security.oauth2.config.xml.AuthorizationServerClientCredentialsPasswordInvalidXmlTests
17-Jun-2019 00:00:39 Tests run: 2, Failures: 0, Errors: 0, Skipped: 0, Time elapsed: 0.337 sec
17-Jun-2019 00:00:39 Running org.springframework.security.oauth2.config.xml.AuthorizationServerClientCredentialsPasswordValidXmlTests
17-Jun-2019 00:00:39 Tests run: 2, Failures: 0, Errors: 0, Skipped: 0, Time elapsed: 0.226 sec
17-Jun-2019 00:00:39 Running org.springframework.security.oauth2.http.converter.jaxb.JaxbOAuth2ExceptionMessageConverterTests
17-Jun-2019 00:00:40 Tests run: 22, Failures: 0, Errors: 0, Skipped: 0, Time elapsed: 1.438 sec
17-Jun-2019 00:00:40 Running org.springframework.security.oauth2.http.converter.jaxb.JaxbOAuth2AccessTokenMessageConverterTests
17-Jun-2019 00:00:41 Tests run: 8, Failures: 0, Errors: 0, Skipped: 0, Time elapsed: 0.843 sec
17-Jun-2019 00:00:41 Running org.springframework.security.oauth2.client.http.OAuth2ErrorHandlerTests
17-Jun-2019 00:00:41 Tests run: 12, Failures: 0, Errors: 0, Skipped: 0, Time elapsed: 0.056 sec
17-Jun-2019 00:00:41 Running org.springframework.security.oauth2.client.DefaultOAuth2RequestAuthenticatorTests
17-Jun-2019 00:00:41 Tests run: 6, Failures: 0, Errors: 0, Skipped: 0, Time elapsed: 0.001 sec
17-Jun-2019 00:00:41 Running org.springframework.security.oauth2.client.token.grant.password.ResourceOwnerPasswordAccessTokenProviderTests
17-Jun-2019 00:00:41 Tests run: 3, Failures: 0, Errors: 0, Skipped: 0, Time elapsed: 0 sec
17-Jun-2019 00:00:41 Running org.springframework.security.oauth2.client.token.grant.implicit.ImplicitAccessTokenProviderTests
17-Jun-2019 00:00:41 Tests run: 2, Failures: 0, Errors: 0, Skipped: 0, Time elapsed: 0 sec
17-Jun-2019 00:00:41 Running org.springframework.security.oauth2.client.token.grant.code.AuthorizationCodeAccessTokenProviderWithConversionTests
17-Jun-2019 00:00:42 Tests run: 4, Failures: 0, Errors: 0, Skipped: 0, Time elapsed: 0.124 sec
17-Jun-2019 00:00:42 Running org.springframework.security.oauth2.client.token.grant.code.AuthorizationCodeAccessTokenProviderTests
17-Jun-2019 00:00:42 Tests run: 5, Failures: 0, Errors: 0, Skipped: 0, Time elapsed: 0.002 sec
17-Jun-2019 00:00:42 Running org.springframework.security.oauth2.client.token.grant.code.AuthorizationCodeResourceDetailsTests
17-Jun-2019 00:00:42 Tests run: 2, Failures: 0, Errors: 0, Skipped: 0, Time elapsed: 0.001 sec
17-Jun-2019 00:00:42 Running org.springframework.security.oauth2.client.token.JdbcClientTokenServicesTests
17-Jun-2019 00:00:42 Tests run: 3, Failures: 0, Errors: 0, Skipped: 0, Time elapsed: 0.32 sec
17-Jun-2019 00:00:42 Running org.springframework.security.oauth2.client.token.OAuth2AccessTokenSupportTests
17-Jun-2019 00:00:42 Tests run: 5, Failures: 0, Errors: 0, Skipped: 0, Time elapsed: 0.024 sec
17-Jun-2019 00:00:42 Running org.springframework.security.oauth2.client.token.AccessTokenProviderChainTests
17-Jun-2019 00:00:42 Tests run: 15, Failures: 0, Errors: 0, Skipped: 0, Time elapsed: 0.028 sec
17-Jun-2019 00:00:42 Running org.springframework.security.oauth2.client.filter.OAuth2ClientContextFilterTests
17-Jun-2019 00:00:42 Tests run: 11, Failures: 0, Errors: 0, Skipped: 0, Time elapsed: 0.007 sec
17-Jun-2019 00:00:42 Running org.springframework.security.oauth2.client.filter.OAuth2ClientAuthenticationProcessingFilterTests
17-Jun-2019 00:00:42 Tests run: 5, Failures: 0, Errors: 0, Skipped: 0, Time elapsed: 0.018 sec
17-Jun-2019 00:00:42 Running org.springframework.security.oauth2.client.OAuth2RestTemplateTests
17-Jun-2019 00:00:42 Tests run: 12, Failures: 0, Errors: 0, Skipped: 0, Time elapsed: 0.199 sec
17-Jun-2019 00:00:42 Running org.springframework.security.oauth2.provider.request.DefaultAuthorizationRequestFactoryTests
17-Jun-2019 00:00:42 Tests run: 9, Failures: 0, Errors: 0, Skipped: 0, Time elapsed: 0.002 sec
17-Jun-2019 00:00:42 Running org.springframework.security.oauth2.provider.request.DefaultOAuth2RequestValidatorTests
17-Jun-2019 00:00:42 Tests run: 3, Failures: 0, Errors: 0, Skipped: 0, Time elapsed: 0.001 sec
17-Jun-2019 00:00:42 Running org.springframework.security.oauth2.provider.password.ResourceOwnerPasswordTokenGranterTests
17-Jun-2019 00:00:42 Tests run: 7, Failures: 0, Errors: 0, Skipped: 0, Time elapsed: 0.004 sec
17-Jun-2019 00:00:42 Running org.springframework.security.oauth2.provider.client.BaseClientDetailsTests
17-Jun-2019 00:00:42 Tests run: 11, Failures: 0, Errors: 0, Skipped: 0, Time elapsed: 0.045 sec
17-Jun-2019 00:00:42 Running org.springframework.security.oauth2.provider.client.JdbcClientDetailsServiceTests
17-Jun-2019 00:00:42 Tests run: 14, Failures: 0, Errors: 0, Skipped: 0, Time elapsed: 0.265 sec
17-Jun-2019 00:00:42 Running org.springframework.security.oauth2.provider.client.ClientCredentialsTokenEndpointFilterTests
17-Jun-2019 00:00:42 Tests run: 3, Failures: 0, Errors: 0, Skipped: 0, Time elapsed: 0.019 sec
17-Jun-2019 00:00:42 Running org.springframework.security.oauth2.provider.client.ClientDetailsUserDetailsServiceTests
17-Jun-2019 00:00:42 Tests run: 2, Failures: 0, Errors: 0, Skipped: 0, Time elapsed: 0.004 sec
17-Jun-2019 00:00:42 Running org.springframework.security.oauth2.provider.approval.ApprovalStoreUserApprovalHandlerTests
17-Jun-2019 00:00:42 Tests run: 10, Failures: 0, Errors: 0, Skipped: 0, Time elapsed: 0.003 sec
17-Jun-2019 00:00:42 Running org.springframework.security.oauth2.provider.approval.DefaultUserApprovalHandlerTests
17-Jun-2019 00:00:42 Tests run: 1, Failures: 0, Errors: 0, Skipped: 0, Time elapsed: 0 sec
17-Jun-2019 00:00:42 Running org.springframework.security.oauth2.provider.approval.TokenStoreUserApprovalHandlerTests
17-Jun-2019 00:00:42 Tests run: 3, Failures: 0, Errors: 0, Skipped: 0, Time elapsed: 0.001 sec
17-Jun-2019 00:00:42 Running org.springframework.security.oauth2.provider.approval.JdbcApprovalStoreTests
17-Jun-2019 00:00:43 Tests run: 6, Failures: 0, Errors: 0, Skipped: 0, Time elapsed: 0.075 sec
17-Jun-2019 00:00:43 Running org.springframework.security.oauth2.provider.approval.InMemoryApprovalStoreTests
17-Jun-2019 00:00:43 Tests run: 5, Failures: 0, Errors: 0, Skipped: 0, Time elapsed: 0.001 sec
17-Jun-2019 00:00:43 Running org.springframework.security.oauth2.provider.approval.TokenApprovalStoreTests
17-Jun-2019 00:00:43 Tests run: 5, Failures: 0, Errors: 0, Skipped: 0, Time elapsed: 0.004 sec
17-Jun-2019 00:00:43 Running org.springframework.security.oauth2.provider.vote.ClientScopeVoterTests
17-Jun-2019 00:00:43 Tests run: 3, Failures: 0, Errors: 0, Skipped: 0, Time elapsed: 0.003 sec
17-Jun-2019 00:00:43 Running org.springframework.security.oauth2.provider.vote.ScopeVoterTests
17-Jun-2019 00:00:43 Tests run: 6, Failures: 0, Errors: 0, Skipped: 0, Time elapsed: 0.003 sec
17-Jun-2019 00:00:43 Running org.springframework.security.oauth2.provider.test.OAuth2RequestTests
17-Jun-2019 00:00:43 Tests run: 4, Failures: 0, Errors: 0, Skipped: 0, Time elapsed: 0.002 sec
17-Jun-2019 00:00:43 Running org.springframework.security.oauth2.provider.token.DefaultTokenServicesWithJdbcTests
17-Jun-2019 00:00:43 Tests run: 19, Failures: 0, Errors: 0, Skipped: 0, Time elapsed: 0.385 sec
17-Jun-2019 00:00:43 Running org.springframework.security.oauth2.provider.token.store.JwtAccessTokenConverterTests
17-Jun-2019 00:00:43 [WARN] JwtAccessTokenConverter - Unable to create an RSA verifier from verifierKey (ignoreable if using MAC)
17-Jun-2019 00:00:43 [WARN] JwtAccessTokenConverter - Unable to create an RSA verifier from verifierKey (ignoreable if using MAC)
17-Jun-2019 00:00:43 [WARN] JwtAccessTokenConverter - Unable to create an RSA verifier from verifierKey (ignoreable if using MAC)
17-Jun-2019 00:00:43 Tests run: 14, Failures: 0, Errors: 0, Skipped: 0, Time elapsed: 0.167 sec
17-Jun-2019 00:00:43 Running org.springframework.security.oauth2.provider.token.store.InMemoryTokenStoreTests
17-Jun-2019 00:00:43 Tests run: 16, Failures: 0, Errors: 0, Skipped: 0, Time elapsed: 0.01 sec
17-Jun-2019 00:00:43 Running org.springframework.security.oauth2.provider.token.store.JwtTokenStoreTests
17-Jun-2019 00:00:43 [WARN] JwtAccessTokenConverter - Unable to create an RSA verifier from verifierKey (ignoreable if using MAC)
17-Jun-2019 00:00:43 [WARN] JwtAccessTokenConverter - Unable to create an RSA verifier from verifierKey (ignoreable if using MAC)
17-Jun-2019 00:00:43 [WARN] JwtAccessTokenConverter - Unable to create an RSA verifier from verifierKey (ignoreable if using MAC)
17-Jun-2019 00:00:43 [WARN] JwtAccessTokenConverter - Unable to create an RSA verifier from verifierKey (ignoreable if using MAC)
17-Jun-2019 00:00:43 [WARN] JwtAccessTokenConverter - Unable to create an RSA verifier from verifierKey (ignoreable if using MAC)
17-Jun-2019 00:00:43 [WARN] JwtAccessTokenConverter - Unable to create an RSA verifier from verifierKey (ignoreable if using MAC)
17-Jun-2019 00:00:43 [WARN] JwtAccessTokenConverter - Unable to create an RSA verifier from verifierKey (ignoreable if using MAC)
17-Jun-2019 00:00:43 [WARN] JwtAccessTokenConverter - Unable to create an RSA verifier from verifierKey (ignoreable if using MAC)
17-Jun-2019 00:00:43 [WARN] JwtAccessTokenConverter - Unable to create an RSA verifier from verifierKey (ignoreable if using MAC)
17-Jun-2019 00:00:43 [WARN] JwtAccessTokenConverter - Unable to create an RSA verifier from verifierKey (ignoreable if using MAC)
17-Jun-2019 00:00:43 [WARN] JwtAccessTokenConverter - Unable to create an RSA verifier from verifierKey (ignoreable if using MAC)
17-Jun-2019 00:00:43 [WARN] JwtAccessTokenConverter - Unable to create an RSA verifier from verifierKey (ignoreable if using MAC)
17-Jun-2019 00:00:43 [WARN] JwtAccessTokenConverter - Unable to create an RSA verifier from verifierKey (ignoreable if using MAC)
17-Jun-2019 00:00:43 [WARN] JwtAccessTokenConverter - Unable to create an RSA verifier from verifierKey (ignoreable if using MAC)
17-Jun-2019 00:00:43 [WARN] JwtAccessTokenConverter - Unable to create an RSA verifier from verifierKey (ignoreable if using MAC)
17-Jun-2019 00:00:43 [WARN] JwtAccessTokenConverter - Unable to create an RSA verifier from verifierKey (ignoreable if using MAC)
17-Jun-2019 00:00:43 [WARN] JwtAccessTokenConverter - Unable to create an RSA verifier from verifierKey (ignoreable if using MAC)
17-Jun-2019 00:00:43 [WARN] JwtAccessTokenConverter - Unable to create an RSA verifier from verifierKey (ignoreable if using MAC)
17-Jun-2019 00:00:43 Tests run: 18, Failures: 0, Errors: 0, Skipped: 0, Time elapsed: 0.035 sec
17-Jun-2019 00:00:43 Running org.springframework.security.oauth2.provider.token.store.redis.RedisTokenStorePrefixTests
17-Jun-2019 00:00:46 Tests run: 15, Failures: 0, Errors: 0, Skipped: 0, Time elapsed: 3.111 sec
17-Jun-2019 00:00:46 Running org.springframework.security.oauth2.provider.token.store.redis.RedisTokenStoreMockTests
17-Jun-2019 00:00:46 Tests run: 2, Failures: 0, Errors: 0, Skipped: 0, Time elapsed: 0.065 sec
17-Jun-2019 00:00:46 Running org.springframework.security.oauth2.provider.token.store.redis.RedisTokenStoreTests
17-Jun-2019 00:00:49 Tests run: 16, Failures: 0, Errors: 0, Skipped: 0, Time elapsed: 3.055 sec
17-Jun-2019 00:00:49 Running org.springframework.security.oauth2.provider.token.store.JdbcTokenStoreTests
17-Jun-2019 00:00:50 Tests run: 14, Failures: 0, Errors: 0, Skipped: 0, Time elapsed: 0.159 sec
17-Jun-2019 00:00:50 Running org.springframework.security.oauth2.provider.token.DefaultTokenServicesAuthoritiesChangeTests
17-Jun-2019 00:00:50 Tests run: 1, Failures: 0, Errors: 0, Skipped: 0, Time elapsed: 0 sec
17-Jun-2019 00:00:50 Running org.springframework.security.oauth2.provider.token.DefaultUserAuthenticationConverterTests
17-Jun-2019 00:00:50 Tests run: 3, Failures: 0, Errors: 0, Skipped: 0, Time elapsed: 0.003 sec
17-Jun-2019 00:00:50 Running org.springframework.security.oauth2.provider.token.TokenServicesWithTokenEnhancerTests
17-Jun-2019 00:00:50 [WARN] JwtAccessTokenConverter - Unable to create an RSA verifier from verifierKey (ignoreable if using MAC)
17-Jun-2019 00:00:50 [WARN] JwtAccessTokenConverter - Unable to create an RSA verifier from verifierKey (ignoreable if using MAC)
17-Jun-2019 00:00:50 [WARN] JwtAccessTokenConverter - Unable to create an RSA verifier from verifierKey (ignoreable if using MAC)
17-Jun-2019 00:00:50 [WARN] JwtAccessTokenConverter - Unable to create an RSA verifier from verifierKey (ignoreable if using MAC)
17-Jun-2019 00:00:50 [WARN] JwtAccessTokenConverter - Unable to create an RSA verifier from verifierKey (ignoreable if using MAC)
17-Jun-2019 00:00:50 Tests run: 5, Failures: 0, Errors: 0, Skipped: 0, Time elapsed: 0.014 sec
17-Jun-2019 00:00:50 Running org.springframework.security.oauth2.provider.token.DefaultTokenServicesWithJwtTests
17-Jun-2019 00:00:50 [WARN] JwtAccessTokenConverter - Unable to create an RSA verifier from verifierKey (ignoreable if using MAC)
17-Jun-2019 00:00:50 [WARN] JwtAccessTokenConverter - Unable to create an RSA verifier from verifierKey (ignoreable if using MAC)
17-Jun-2019 00:00:50 [WARN] JwtAccessTokenConverter - Unable to create an RSA verifier from verifierKey (ignoreable if using MAC)
17-Jun-2019 00:00:50 [WARN] JwtAccessTokenConverter - Unable to create an RSA verifier from verifierKey (ignoreable if using MAC)
17-Jun-2019 00:00:50 [WARN] JwtAccessTokenConverter - Unable to create an RSA verifier from verifierKey (ignoreable if using MAC)
17-Jun-2019 00:00:50 [WARN] JwtAccessTokenConverter - Unable to create an RSA verifier from verifierKey (ignoreable if using MAC)
17-Jun-2019 00:00:50 [WARN] JwtAccessTokenConverter - Unable to create an RSA verifier from verifierKey (ignoreable if using MAC)
17-Jun-2019 00:00:50 [WARN] JwtAccessTokenConverter - Unable to create an RSA verifier from verifierKey (ignoreable if using MAC)
17-Jun-2019 00:00:50 [WARN] JwtAccessTokenConverter - Unable to create an RSA verifier from verifierKey (ignoreable if using MAC)
17-Jun-2019 00:00:50 [WARN] JwtAccessTokenConverter - Unable to create an RSA verifier from verifierKey (ignoreable if using MAC)
17-Jun-2019 00:00:50 [WARN] JwtAccessTokenConverter - Unable to create an RSA verifier from verifierKey (ignoreable if using MAC)
17-Jun-2019 00:00:50 [WARN] JwtAccessTokenConverter - Unable to create an RSA verifier from verifierKey (ignoreable if using MAC)
17-Jun-2019 00:00:50 [WARN] JwtAccessTokenConverter - Unable to create an RSA verifier from verifierKey (ignoreable if using MAC)
17-Jun-2019 00:00:50 [WARN] JwtAccessTokenConverter - Unable to create an RSA verifier from verifierKey (ignoreable if using MAC)
17-Jun-2019 00:00:50 [WARN] JwtAccessTokenConverter - Unable to create an RSA verifier from verifierKey (ignoreable if using MAC)
17-Jun-2019 00:00:50 Tests run: 15, Failures: 0, Errors: 0, Skipped: 0, Time elapsed: 0.037 sec
17-Jun-2019 00:00:50 Running org.springframework.security.oauth2.provider.token.DefaultTokenServicesTests
17-Jun-2019 00:00:50 Tests run: 1, Failures: 0, Errors: 0, Skipped: 0, Time elapsed: 0.004 sec
17-Jun-2019 00:00:50 Running org.springframework.security.oauth2.provider.token.DefaultTokenServicesWithInMemoryTests
17-Jun-2019 00:00:50 Tests run: 25, Failures: 0, Errors: 0, Skipped: 0, Time elapsed: 0.018 sec
17-Jun-2019 00:00:50 Running org.springframework.security.oauth2.provider.token.DefaultAccessTokenConverterTests
17-Jun-2019 00:00:50 Tests run: 15, Failures: 0, Errors: 0, Skipped: 0, Time elapsed: 0.003 sec
17-Jun-2019 00:00:50 Running org.springframework.security.oauth2.provider.implicit.InMemoryImplicitGrantServiceTests
17-Jun-2019 00:00:50 Tests run: 2, Failures: 0, Errors: 0, Skipped: 0, Time elapsed: 0 sec
17-Jun-2019 00:00:50 Running org.springframework.security.oauth2.provider.error.DefaultWebResponseExceptionTranslatorTests
17-Jun-2019 00:00:50 Tests run: 1, Failures: 0, Errors: 0, Skipped: 0, Time elapsed: 0 sec
17-Jun-2019 00:00:50 Running org.springframework.security.oauth2.provider.error.OAuth2AuthenticationEntryPointTests
17-Jun-2019 00:00:50 [WARN] DefaultHandlerExceptionResolver - Resolved exception caused by handler execution: org.springframework.web.HttpMediaTypeNotAcceptableException: Could not find acceptable representation
17-Jun-2019 00:00:50 Tests run: 7, Failures: 0, Errors: 0, Skipped: 0, Time elapsed: 0.034 sec
17-Jun-2019 00:00:50 Running org.springframework.security.oauth2.provider.error.OAuth2AccessDeniedHandlerTests
17-Jun-2019 00:00:50 Tests run: 1, Failures: 0, Errors: 0, Skipped: 0, Time elapsed: 0.004 sec
17-Jun-2019 00:00:50 Running org.springframework.security.oauth2.provider.authentication.OAuth2AuthenticationProcessingFilterTests
17-Jun-2019 00:00:50 Tests run: 8, Failures: 0, Errors: 0, Skipped: 0, Time elapsed: 0.039 sec
17-Jun-2019 00:00:50 Running org.springframework.security.oauth2.provider.authentication.OAuth2AuthenticationDetailsTests
17-Jun-2019 00:00:50 Tests run: 1, Failures: 0, Errors: 0, Skipped: 0, Time elapsed: 0 sec
17-Jun-2019 00:00:50 Running org.springframework.security.oauth2.provider.authentication.OAuth2AuthenticationManagerTests
17-Jun-2019 00:00:50 Tests run: 3, Failures: 0, Errors: 0, Skipped: 0, Time elapsed: 0.001 sec
17-Jun-2019 00:00:50 Running org.springframework.security.oauth2.provider.endpoint.FrameworkEndpointHandlerMappingTests
17-Jun-2019 00:00:50 Tests run: 4, Failures: 0, Errors: 0, Skipped: 0, Time elapsed: 0 sec
17-Jun-2019 00:00:50 Running org.springframework.security.oauth2.provider.endpoint.WhitelabelApprovalEndpointTests
17-Jun-2019 00:00:50 Tests run: 6, Failures: 0, Errors: 0, Skipped: 0, Time elapsed: 0.004 sec
17-Jun-2019 00:00:50 Running org.springframework.security.oauth2.provider.endpoint.ExactMatchRedirectResolverTests
17-Jun-2019 00:00:50 Tests run: 3, Failures: 0, Errors: 0, Skipped: 0, Time elapsed: 0.001 sec
17-Jun-2019 00:00:50 Running org.springframework.security.oauth2.provider.endpoint.AuthorizationEndpointTests
17-Jun-2019 00:00:50 Tests run: 34, Failures: 0, Errors: 0, Skipped: 0, Time elapsed: 0.019 sec
17-Jun-2019 00:00:50 Running org.springframework.security.oauth2.provider.endpoint.TokenEndpointTests
17-Jun-2019 00:00:50 Tests run: 6, Failures: 0, Errors: 0, Skipped: 0, Time elapsed: 0.008 sec
17-Jun-2019 00:00:50 Running org.springframework.security.oauth2.provider.endpoint.DefaultRedirectResolverTests
17-Jun-2019 00:00:50 Tests run: 31, Failures: 0, Errors: 0, Skipped: 0, Time elapsed: 0.007 sec
17-Jun-2019 00:00:50 Running org.springframework.security.oauth2.provider.endpoint.WhitelabelErrorEndpointTests
17-Jun-2019 00:00:50 Tests run: 3, Failures: 0, Errors: 0, Skipped: 0, Time elapsed: 0 sec
17-Jun-2019 00:00:50 Running org.springframework.security.oauth2.provider.endpoint.TokenEndpointAuthenticationFilterTests
17-Jun-2019 00:00:50 Tests run: 3, Failures: 0, Errors: 0, Skipped: 0, Time elapsed: 0.013 sec
17-Jun-2019 00:00:50 Running org.springframework.security.oauth2.provider.AuthorizationRequestTests
17-Jun-2019 00:00:50 Tests run: 9, Failures: 0, Errors: 0, Skipped: 0, Time elapsed: 0.003 sec
17-Jun-2019 00:00:50 Running org.springframework.security.oauth2.provider.OAuth2AuthenticationTests
17-Jun-2019 00:00:50 {"authorities":[{"authority":"ROLE_USER"}],"details":null,"authenticated":false,"userAuthentication":{"authorities":[{"authority":"ROLE_USER"}],"details":null,"authenticated":true,"principal":"foo","credentials":"bar","name":"foo"},"clientOnly":false,"oauth2Request":{"clientId":"id","scope":["read"],"requestParameters":{},"resourceIds":[],"authorities":[],"approved":false,"refresh":false,"redirectUri":null,"responseTypes":[],"extensions":{},"grantType":null,"refreshTokenRequest":null},"principal":"foo","credentials":"","name":"foo"}
17-Jun-2019 00:00:50 Tests run: 8, Failures: 0, Errors: 0, Skipped: 0, Time elapsed: 0.013 sec
17-Jun-2019 00:00:50 Running org.springframework.security.oauth2.provider.expression.OAuth2MethodSecurityExpressionHandlerTests
17-Jun-2019 00:00:50 Tests run: 9, Failures: 0, Errors: 0, Skipped: 0, Time elapsed: 0.007 sec
17-Jun-2019 00:00:50 Running org.springframework.security.oauth2.provider.expression.OAuth2SecurityExpressionMethodsTests
17-Jun-2019 00:00:50 Tests run: 10, Failures: 0, Errors: 0, Skipped: 0, Time elapsed: 0.002 sec
17-Jun-2019 00:00:50 Running org.springframework.security.oauth2.provider.expression.OAuth2WebSecurityExpressionHandlerTests
17-Jun-2019 00:00:50 Tests run: 6, Failures: 0, Errors: 0, Skipped: 0, Time elapsed: 0.003 sec
17-Jun-2019 00:00:50 Running org.springframework.security.oauth2.provider.expression.OAuth2ExpressionParserTests
17-Jun-2019 00:00:50 Tests run: 3, Failures: 0, Errors: 0, Skipped: 0, Time elapsed: 0.006 sec
17-Jun-2019 00:00:50 Running org.springframework.security.oauth2.provider.OAuth2RequestTests
17-Jun-2019 00:00:50 Tests run: 4, Failures: 0, Errors: 0, Skipped: 0, Time elapsed: 0 sec
17-Jun-2019 00:00:50 Running org.springframework.security.oauth2.provider.code.AuthorizationCodeTokenGranterTests
17-Jun-2019 00:00:50 Tests run: 5, Failures: 0, Errors: 0, Skipped: 0, Time elapsed: 0.002 sec
17-Jun-2019 00:00:50 Running org.springframework.security.oauth2.provider.code.InMemoryAuthorizationCodeServicesTests
17-Jun-2019 00:00:50 Tests run: 3, Failures: 0, Errors: 0, Skipped: 0, Time elapsed: 0 sec
17-Jun-2019 00:00:50 Running org.springframework.security.oauth2.provider.code.JdbcAuthorizationCodeServicesTests
17-Jun-2019 00:00:50 Tests run: 3, Failures: 0, Errors: 0, Skipped: 0, Time elapsed: 0.029 sec
17-Jun-2019 00:00:50 Running org.springframework.security.oauth2.provider.code.SubdomainRedirectResolverTests
17-Jun-2019 00:00:50 Tests run: 2, Failures: 0, Errors: 0, Skipped: 0, Time elapsed: 0 sec
17-Jun-2019 00:00:50 Running org.springframework.security.oauth2.common.OAuth2AccessTokenJackson1DeserializerTests
17-Jun-2019 00:00:51 Tests run: 8, Failures: 0, Errors: 0, Skipped: 0, Time elapsed: 1.203 sec
17-Jun-2019 00:00:51 Running org.springframework.security.oauth2.common.OAuth2AccessTokenJackson2DeserializerTests
17-Jun-2019 00:00:52 Tests run: 9, Failures: 0, Errors: 0, Skipped: 0, Time elapsed: 1.067 sec
17-Jun-2019 00:00:52 Running org.springframework.security.oauth2.common.exception.OAuth2ExceptionDeserializerTests
17-Jun-2019 00:00:52 Tests run: 13, Failures: 0, Errors: 0, Skipped: 0, Time elapsed: 0.007 sec
17-Jun-2019 00:00:52 Running org.springframework.security.oauth2.common.exception.OAuth2ExceptionSerializerTests
17-Jun-2019 00:00:52 Tests run: 11, Failures: 0, Errors: 0, Skipped: 0, Time elapsed: 0.006 sec
17-Jun-2019 00:00:52 Running org.springframework.security.oauth2.common.exception.OAuth2ExceptionJackson2DeserializerTests
17-Jun-2019 00:00:52 Tests run: 14, Failures: 0, Errors: 0, Skipped: 0, Time elapsed: 0.004 sec
17-Jun-2019 00:00:52 Running org.springframework.security.oauth2.common.OAuth2AccessTokenJackson2SerializerTests
17-Jun-2019 00:00:53 Tests run: 10, Failures: 0, Errors: 0, Skipped: 0, Time elapsed: 0.913 sec
17-Jun-2019 00:00:53 Running org.springframework.security.oauth2.common.OAuth2AccessTokenJackson1SerializerTests
17-Jun-2019 00:00:56 Tests run: 1, Failures: 0, Errors: 0, Skipped: 0, Time elapsed: 3.2 sec
17-Jun-2019 00:00:57 org.apache.maven.surefire.util.SurefireReflectionException: java.lang.reflect.InvocationTargetException; nested exception is java.lang.reflect.InvocationTargetException: null
17-Jun-2019 00:00:57 Exception: java.lang.OutOfMemoryError thrown from the UncaughtExceptionHandler in thread "main"
17-Jun-2019 00:00:58
17-Jun-2019 00:00:58 Results :
17-Jun-2019 00:00:58
17-Jun-2019 00:00:58 Tests run: 696, Failures: 0, Errors: 0, Skipped: 0
17-Jun-2019 00:00:58
17-Jun-2019 00:00:58 [INFO] ------------------------------------------------------------------------
17-Jun-2019 00:00:58 [INFO] Reactor Summary:
17-Jun-2019 00:00:58 [INFO]
17-Jun-2019 00:00:58 [INFO] OAuth for Spring Security .......................... SUCCESS [  1.010 s]
17-Jun-2019 00:00:58 [INFO] OAuth 1(a) for Spring Security ..................... SUCCESS [  8.731 s]
17-Jun-2019 00:00:58 [INFO] OAuth2 for Spring Security ......................... FAILURE [ 31.753 s]
17-Jun-2019 00:00:58 [INFO] spring-oauth2-tests ................................ SKIPPED
17-Jun-2019 00:00:58 [INFO] spring-oauth2-tests-common ......................... SKIPPED
17-Jun-2019 00:00:58 [INFO] spring-oauth2-tests-vanilla ........................ SKIPPED
17-Jun-2019 00:00:58 [INFO] spring-oauth2-tests-mappings ....................... SKIPPED
17-Jun-2019 00:00:58 [INFO] spring-oauth2-tests-form ........................... SKIPPED
17-Jun-2019 00:00:58 [INFO] spring-oauth2-tests-jwt ............................ SKIPPED
17-Jun-2019 00:00:58 [INFO] spring-oauth2-tests-approval ....................... SKIPPED
17-Jun-2019 00:00:58 [INFO] spring-oauth2-tests-jdbc ........................... SKIPPED
17-Jun-2019 00:00:58 [INFO] spring-oauth2-tests-jpa ............................ SKIPPED
17-Jun-2019 00:00:58 [INFO] spring-oauth2-tests-jaxb ........................... SKIPPED
17-Jun-2019 00:00:58 [INFO] spring-oauth-tests-custom-grant .................... SKIPPED
17-Jun-2019 00:00:58 [INFO] spring-oauth2-tests-multi .......................... SKIPPED
17-Jun-2019 00:00:58 [INFO] spring-oauth2-tests-client ......................... SKIPPED
17-Jun-2019 00:00:58 [INFO] spring-oauth2-tests-resource ....................... SKIPPED
17-Jun-2019 00:00:58 [INFO] spring-oauth2-tests-custom-authentication .......... SKIPPED
17-Jun-2019 00:00:58 [INFO] spring-oauth2-tests-xml ............................ SKIPPED
17-Jun-2019 00:00:58 [INFO] spring-oauth2-tests-xml-common ..................... SKIPPED
17-Jun-2019 00:00:58 [INFO] spring-oauth2-tests-xml-vanilla .................... SKIPPED
17-Jun-2019 00:00:58 [INFO] spring-oauth2-tests-xml-mappings ................... SKIPPED
17-Jun-2019 00:00:58 [INFO] spring-oauth2-tests-xml-form ....................... SKIPPED
17-Jun-2019 00:00:58 [INFO] spring-oauth2-tests-xml-jwt ........................ SKIPPED
17-Jun-2019 00:00:58 [INFO] spring-oauth2-tests-xml-approval ................... SKIPPED
17-Jun-2019 00:00:58 [INFO] spring-oauth2-tests-xml-jdbc ....................... SKIPPED
17-Jun-2019 00:00:58 [INFO] spring-oauth2-tests-xml-client ..................... SKIPPED
17-Jun-2019 00:00:58 [INFO] OAuth for Spring Security - Integration Tests ...... SKIPPED
17-Jun-2019 00:00:58 [INFO] OAuth for Spring Security - Sparklr (OAuth 1 Provider Example) SKIPPED
17-Jun-2019 00:00:58 [INFO] OAuth for Spring Security - Tonr (OAuth 1 Consumer Example) SKIPPED
17-Jun-2019 00:00:58 [INFO] OAuth for Spring Security - Sparklr2 (OAuth 2 Provider Example) SKIPPED
17-Jun-2019 00:00:58 [INFO] OAuth for Spring Security - Tonr2 (OAuth 2 Client Example) SKIPPED
17-Jun-2019 00:00:58 [INFO] OAuth for Spring Security - Samples ................ SKIPPED
17-Jun-2019 00:00:58 [INFO] ------------------------------------------------------------------------
17-Jun-2019 00:00:58 [INFO] BUILD FAILURE
17-Jun-2019 00:00:58 [INFO] ------------------------------------------------------------------------
17-Jun-2019 00:00:58 [INFO] Total time: 43.256 s
17-Jun-2019 00:00:58 [INFO] Finished at: 2019-06-17T00:00:58+00:00
17-Jun-2019 00:00:58 [INFO] Final Memory: 73M/489M
17-Jun-2019 00:00:58 [INFO] ------------------------------------------------------------------------
17-Jun-2019 00:00:58 [ERROR] Failed to execute goal org.apache.maven.plugins:maven-surefire-plugin:2.12.4:test (default-test) on project spring-security-oauth2: Execution default-test of goal org.apache.maven.plugins:maven-surefire-plugin:2.12.4:test failed: The forked VM terminated without saying properly goodbye. VM crash or System.exit called ? -> [Help 1]
17-Jun-2019 00:00:58 [ERROR]
17-Jun-2019 00:00:58 [ERROR] To see the full stack trace of the errors, re-run Maven with the -e switch.
17-Jun-2019 00:00:58 [ERROR] Re-run Maven using the -X switch to enable full debug logging.
17-Jun-2019 00:00:58 [ERROR]
17-Jun-2019 00:00:58 [ERROR] For more information about the errors and possible solutions, please read the following articles:
17-Jun-2019 00:00:58 [ERROR] [Help 1] http://cwiki.apache.org/confluence/display/MAVEN/PluginExecutionException
17-Jun-2019 00:00:58 [ERROR]
17-Jun-2019 00:00:58 [ERROR] After correcting the problems, you can resume the build with the command
17-Jun-2019 00:00:58 [ERROR]   mvn <goals> -rf :spring-security-oauth2
17-Jun-2019 00:00:58 Exception in thread "main"
17-Jun-2019 00:00:58
17-Jun-2019 00:00:58 Failing task since return code of [/opt/jdk-7/bin/java -cp /opt/maven-3.3/boot/plexus-classworlds-2.5.2.jar -Dclassworlds.conf=/tmp/artifactoryM22360449665266965460conf -DbuildInfoConfig.propertiesFile=/tmp/buildInfo5242694032212655459.properties -Xmx1256m -Xms128m -Dmaven.home=/opt/maven-3.3 -Dmaven.multiModuleProjectDirectory=/opt/bamboo-home/xml-data/build-dir/SECOAUTH-NIGHTLY-JOB1 org.codehaus.plexus.classworlds.launcher.Launcher clean install -P bootstrap -Dartifactory.publish.password=********] was 1 while expected 0
17-Jun-2019 00:00:58 Finished task 'Artifactory Maven 3' with result: Failed
17-Jun-2019 00:00:58 Running post build plugin 'Docker Container Cleanup'
17-Jun-2019 00:00:58 Running post build plugin 'NCover Results Collector'
17-Jun-2019 00:00:58 Running post build plugin 'Artifactory Release Management Staging'
17-Jun-2019 00:00:58 Running post build plugin 'Artifactory Build Info Copier'
17-Jun-2019 00:00:58 Running post build plugin 'Artifactory Gradle Properties Info Copier'
17-Jun-2019 00:00:58 Running post build plugin 'Clover Results Collector'
17-Jun-2019 00:00:58 Running post build plugin 'npm Cache Cleanup'
17-Jun-2019 00:00:58 Running post build plugin 'Artifact Copier'
17-Jun-2019 00:00:58 Successfully removed working directory at '/opt/bamboo-home/xml-data/build-dir/SECOAUTH-NIGHTLY-JOB1'
17-Jun-2019 00:00:58 Finalising the build...
17-Jun-2019 00:00:58 Stopping timer.
17-Jun-2019 00:00:58 Build SECOAUTH-NIGHTLY-JOB1-1677 completed.
17-Jun-2019 00:00:58 Running on server: post build plugin 'NCover Results Collector'
17-Jun-2019 00:00:58 Running on server: post build plugin 'Build Hanging Detection Configuration'
17-Jun-2019 00:00:58 Running on server: post build plugin 'Clover Delta Calculator'
17-Jun-2019 00:00:58 Running on server: post build plugin 'Maven Dependencies Postprocessor'
17-Jun-2019 00:00:58 All post build plugins have finished
17-Jun-2019 00:00:58 Generating build results summary...
17-Jun-2019 00:00:58 Saving build results to disk...
17-Jun-2019 00:00:58 Logging substituted variables...
17-Jun-2019 00:00:58 Indexing build results...
17-Jun-2019 00:00:58 Finished building SECOAUTH-NIGHTLY-JOB1-1677.