Build: #1678 failed

Job: Default Job failed

Stages & jobs

  1. Default Stage

Build log

The build generated 636 lines of output. Download or view full build log

18-Jun-2019 00:00:11 Build Spring Security OAuth - 2.1.x - Default Job #1678 (SECOAUTH-NIGHTLY-JOB1-1678) started building on agent bamboo-24.af.pivotal.io
18-Jun-2019 00:00:11 Remote agent on host bamboo-24.af.pivotal.io
18-Jun-2019 00:00:11 Build working directory is /opt/bamboo-home/xml-data/build-dir/SECOAUTH-NIGHTLY-JOB1
18-Jun-2019 00:00:11 Executing build Spring Security OAuth - 2.1.x - Default Job #1678 (SECOAUTH-NIGHTLY-JOB1-1678)
18-Jun-2019 00:00:11 Starting task 'Checkout Default Repository' of type 'com.atlassian.bamboo.plugins.vcs:task.vcs.checkout'
18-Jun-2019 00:00:11 Build always requires a clean checkout
18-Jun-2019 00:00:11 Cleaning build directory '/opt/bamboo-home/xml-data/build-dir/SECOAUTH-NIGHTLY-JOB1'
18-Jun-2019 00:00:11 Checking out into /opt/bamboo-home/xml-data/build-dir/SECOAUTH-NIGHTLY-JOB1
18-Jun-2019 00:00:11 Updating source code to revision: 3d37444a991104dd7f23edb2812e9f57620a1395
18-Jun-2019 00:00:11 Creating local git repository in '/opt/bamboo-home/xml-data/build-dir/SECOAUTH-NIGHTLY-JOB1/.git'.
18-Jun-2019 00:00:11 Initialized empty Git repository in /opt/bamboo-home/xml-data/build-dir/SECOAUTH-NIGHTLY-JOB1/.git/
18-Jun-2019 00:00:13 Fetching 'refs/heads/master' from 'git://github.com/SpringSource/spring-security-oauth.git'. Will try to do a shallow fetch.
18-Jun-2019 00:00:16 From git://github.com/SpringSource/spring-security-oauth
18-Jun-2019 00:00:16 * [new branch]      master     -> master
18-Jun-2019 00:00:16 Checking out revision 3d37444a991104dd7f23edb2812e9f57620a1395.
18-Jun-2019 00:00:17 Already on 'master'
18-Jun-2019 00:00:17 Updated source code to revision: 3d37444a991104dd7f23edb2812e9f57620a1395
18-Jun-2019 00:00:17 Finished task 'Checkout Default Repository' with result: Success
18-Jun-2019 00:00:17 Running pre-build action: Artifactory Release Staging
18-Jun-2019 00:00:17 Running pre-build action: VCS Version Collector
18-Jun-2019 00:00:17 Skipping execution of task 'Build' as it is disabled
18-Jun-2019 00:00:17 Starting task 'Artifactory Maven 3' of type 'org.jfrog.bamboo.bamboo-artifactory-plugin:maven3Task'
18-Jun-2019 00:00:17 Bamboo Artifactory Plugin version: 2.6.3
18-Jun-2019 00:00:17
Beginning to execute external process for build 'Spring Security OAuth - 2.1.x - Default Job #1678 (SECOAUTH-NIGHTLY-JOB1-1678)'
... running command line:
/opt/jdk-7/bin/java -cp /opt/maven-3.3/boot/plexus-classworlds-2.5.2.jar -Dclassworlds.conf=/tmp/artifactoryM28687311601259028024conf -DbuildInfoConfig.propertiesFile=/tmp/buildInfo8947943706275780365.properties -Xmx1256m -Xms128m -Dmaven.home=/opt/maven-3.3 -Dmaven.multiModuleProjectDirectory=/opt/bamboo-home/xml-data/build-dir/SECOAUTH-NIGHTLY-JOB1 org.codehaus.plexus.classworlds.launcher.Launcher clean install -P bootstrap -Dartifactory.publish.password=********
... in: /opt/bamboo-home/xml-data/build-dir/SECOAUTH-NIGHTLY-JOB1
... using extra environment variables:
bamboo_planRepository_1_branch=master
bamboo_repository_94273667_previous_revision_number=3d37444a991104dd7f23edb2812e9f57620a1395
bamboo_********_username_password=********
bamboo_signing_store_password=********
bamboo_capability_system_builder_ant_Ant_1_9=/opt/ant-1.9
bamboo_capability_system_builder_ant_Ant_1_8=/opt/ant-1.8
bamboo_planRepository_1_branchDisplayName=master
bamboo_artifactory_override_resolve_repo=libs-milestone
bamboo_capability_system_builder_node_Node_js_10_16=/opt/node-10.16/bin/node
bamboo_repository_revision_number=3d37444a991104dd7f23edb2812e9f57620a1395
bamboo_RIAK_BIN=/usr/sbin/riak
bamboo_repository_94273667_revision_number=3d37444a991104dd7f23edb2812e9f57620a1395
WRAPPER_BITS=32
bamboo_buildKey=SECOAUTH-NIGHTLY-JOB1
bamboo_repository_94273667_git_branch=master
bamboo_bintray_password=********
bamboo_sonar_token_password=********
PWD=/opt/bamboo-home/bin
bamboo_shortJobName=Default Job
bamboo_artifactory_override_resolver_password=********
bamboo_sonatype_token=RSJChaox
bamboo_capability_system_builder_gradle___gradlew=./gradlew
bamboo_buildResultsUrl=https://build.spring.io/browse/SECOAUTH-NIGHTLY-JOB1-1678
bamboo_capability_system_builder_mvn3_Maven_3_3=/opt/maven-3.3
bamboo_capability_system_builder_mvn3_Maven_3_2=/opt/maven-3.2
bamboo_capability_system_builder_mvn3_Maven_3_1=/opt/maven-3.1
bamboo_planRepository_repositoryUrl=git://github.com/SpringSource/spring-security-oauth.git
bamboo_capability_system_builder_mvn3_Maven_3_6=/opt/maven-3.6
bamboo_agentId=284196868
bamboo_capability_system_builder_mvn3_Maven_3_5=/opt/maven-3.5
bamboo_capability_system_builder_mvn3_Maven_3_0=/opt/maven-3.0
bamboo_planRepository_revision=3d37444a991104dd7f23edb2812e9f57620a1395
bamboo_planRepository_previousRevision=3d37444a991104dd7f23edb2812e9f57620a1395
bamboo_capability_remote_build=true
bamboo_repository_branch_name=master
bamboo_sonatype_token_password=********
bamboo_sonatype_user=springsource
SHLVL=1
bamboo_org_jfrog_bamboo_buildInfo_serverUrl=https://repo.spring.io
bamboo_scdf_acceptance_tests_password=********
bamboo_repository_94273667_branch_name=master
WRAPPER_OS=linux
TERM=linux
XDG_SESSION_ID=c1
bamboo_planRepository_branch=master
bamboo_org_jfrog_bamboo_release_activated=false
bamboo_planRepository_1_type=gitv2
bamboo_planRepository_branchName=master
bamboo_capability_system_jdk_JDK_12=/opt/jdk-12
WRAPPER_FILE_SEPARATOR=/
_=/opt/bamboo-home/bin/bamboo-agent.sh
bamboo_capability_system_builder_ant_Ant_1_10=/opt/ant-1.10
bamboo_repository_94273667_name=Plan Repository
WRAPPER_PATH_SEPARATOR=:
bamboo_sonar_password=********
bamboo_hg_cache_directory=/opt/bamboo-home/xml-data/build-dir/_hg-repositories-cache
bamboo_planRepository_1_username=
bamboo_planRepository_type=gitv2
bamboo_git_cache_directory=/opt/bamboo-home/xml-data/build-dir/_git-repositories-cache
bamboo_artifactory_username=buildmaster
bamboo_tmp_directory=/opt/bamboo-home/temp
bamboo_planKey=SECOAUTH-NIGHTLY
bamboo_planRepository_username=
bamboo_JDK8_HOME=/opt/jdk-8
bamboo_repository_94273667_git_username=
bamboo_planRepository_1_branchName=master
bamboo_sonar_version=5.6.3
bamboo_sonar_jdbc_password=********
bamboo_bintray_api_key_password=********
XDG_DATA_DIRS=/usr/local/share:/usr/share:/var/lib/snapd/desktop
bamboo_capability_system_jdk_JDK_1_11=/opt/jdk-11
bamboo_resultsUrl=https://build.spring.io/browse/SECOAUTH-NIGHTLY-JOB1-1678
bamboo_capability_system_jdk_JDK_1_10=/opt/jdk-10
bamboo_build_working_directory=/opt/bamboo-home/xml-data/build-dir/SECOAUTH-NIGHTLY-JOB1
bamboo_planRepository_1_name=Plan Repository
bamboo_capability_system_os=ubuntu1804
bamboo_nexusPush_stagingProfile=buildmaster
bamboo_shortPlanName=2.1.x
MAIL=/var/mail/bamboo
bamboo_planRepository_name=Plan Repository
LOGNAME=bamboo
bamboo_buildNumber=1678
SHELL=/bin/bash
bamboo_planName=Spring Security OAuth - 2.1.x
bamboo_JDK7_HOME=/opt/jdk-7
bamboo_repository_94273667_git_repositoryUrl=git://github.com/SpringSource/spring-security-oauth.git
bamboo_shortPlanKey=NIGHTLY
OLDPWD=/opt/users/bamboo
bamboo_shortJobKey=JOB1
bamboo_artifactory_password=********
bamboo_buildTimeStamp=2019-06-18T00:00:09.074Z
bamboo_repository_previous_revision_number=3d37444a991104dd7f23edb2812e9f57620a1395
bamboo_sonar_username=buildmaster
bamboo_********_password=********
bamboo_repository_git_branch=master
bamboo_buildResultKey=SECOAUTH-NIGHTLY-JOB1-1678
bamboo_nexusPush_close=true
bamboo_artifactory_override_resolver_username=buildmaster
bamboo_buildPlanName=Spring Security OAuth - 2.1.x - Default Job
bamboo_planRepository_1_revision=3d37444a991104dd7f23edb2812e9f57620a1395
bamboo_repository_name=Plan Repository
bamboo_signing_key_password=********
bamboo_capability_system_builder_groovy_Groovy_2_5=/opt/groovy-2.5
LANG=en_US.UTF-8
bamboo_buildFailed=false
bamboo_capability_system_docker_executable=/usr/bin/docker
DISPLAY=localhost:1.0
bamboo_capability_system_jdk_OpenJDK_7=/opt/jdk-7
bamboo_capability_system_builder_groovy_Groovy_2_4=/opt/groovy-2.4
bamboo_artifactory_override_deployer_username=buildmaster
bamboo_capability_system_builder_command_Bash=/bin/bash
bamboo_artifactory_password_mask_a=********
bamboo_agentWorkingDirectory=/opt/bamboo-home/xml-data/build-dir
bamboo_capability_system_git_executable=/usr/bin/git
bamboo_repository_git_username=
bamboo_planRepository_1_previousRevision=3d37444a991104dd7f23edb2812e9f57620a1395
bamboo_capability_os_family=unix
bamboo_planRepository_branchDisplayName=master
bamboo_capability_system_builder_maven_Artifactory_Maven_3_6=/opt/maven-3.6
bamboo_capability_system_builder_maven_Artifactory_Maven_3_5=/opt/maven-3.5
GIT_SSL_NO_VERIFY=true
bamboo_capability_system_builder_maven_Artifactory_Maven_3_3=/opt/maven-3.3
bamboo_capability_system_builder_maven_Artifactory_Maven_3_2=/opt/maven-3.2
bamboo_s3_properties=/home/bamboo/tools/s3.properties
bamboo_capability_system_builder_maven_Artifactory_Maven_3_1=/opt/maven-3.1
bamboo_artifactory_override_deploy_repo=libs-snapshot-local
bamboo_capability_system_builder_maven_Artifactory_Maven_3_0=/opt/maven-3.0
bamboo_plan_storageTag=SECOAUTH-NIGHTLY
bamboo_bintray_username_password=********
USER=bamboo
bamboo_repository_git_repositoryUrl=git://github.com/SpringSource/spring-security-oauth.git
bamboo_working_directory=/opt/bamboo-home/xml-data/build-dir/SECOAUTH-NIGHTLY-JOB1
bamboo_org_jfrog_bamboo_buildInfo_activated=true
bamboo_planRepository_1_repositoryUrl=git://github.com/SpringSource/spring-security-oauth.git
bamboo_capability_system_jdk_JDK_1_8=/opt/jdk-8
bamboo_artifactory_override_deployer_password=********
bamboo_capability_system_jdk_JDK_1_9=/opt/jdk-9
WRAPPER_ARCH=x86
bamboo_capability_system_jdk_JDK_1_6=/opt/jdk-6
bamboo_sonatype_password=********
bamboo_capability_system_jdk_JDK_1_7=/opt/jdk-7
bamboo_sonar_ip=10.194.6.9
XDG_RUNTIME_DIR=/run/user/1002
HOME=/home/bamboo
PATH=/bin:/home/bamboo/bin:/usr/local/sbin:/usr/local/bin:/usr/sbin:/usr/bin:/sbin:/bin:/usr/games:/usr/local/games:/snap/bin:/home/bamboo/bin:/usr/local/bin:/bin:/home/bamboo/bin:/usr/local/sbin:/usr/local/bin:/usr/sbin:/usr/bin:/sbin:/bin:/usr/games:/usr/local/games:/snap/bin:/home/bamboo/bin:/usr/local/bin
18-Jun-2019 00:00:18 [INFO] Scanning for projects...
18-Jun-2019 00:00:18 Downloading: https://repo.spring.io/libs-snapshot-local/org/springframework/boot/spring-boot-starter-parent/1.5.1.RELEASE/spring-boot-starter-parent-1.5.1.RELEASE.pom
18-Jun-2019 00:00:19
18-Jun-2019 00:00:19 Downloading: https://repo.spring.io/libs-milestone-local/org/springframework/boot/spring-boot-starter-parent/1.5.1.RELEASE/spring-boot-starter-parent-1.5.1.RELEASE.pom
18-Jun-2019 00:00:19
18-Jun-2019 00:00:19 Downloading: https://repo.spring.io/release/org/springframework/boot/spring-boot-starter-parent/1.5.1.RELEASE/spring-boot-starter-parent-1.5.1.RELEASE.pom
18-Jun-2019 00:00:19 1/8 KB   
18-Jun-2019 00:00:19 3/8 KB   
18-Jun-2019 00:00:19 4/8 KB   
18-Jun-2019 00:00:19 5/8 KB   
18-Jun-2019 00:00:19 7/8 KB   
18-Jun-2019 00:00:19 8/8 KB   
18-Jun-2019 00:00:19          
18-Jun-2019 00:00:19 Downloaded: https://repo.spring.io/release/org/springframework/boot/spring-boot-starter-parent/1.5.1.RELEASE/spring-boot-starter-parent-1.5.1.RELEASE.pom (8 KB at 25.6 KB/sec)
18-Jun-2019 00:00:19 Downloading: https://repo.spring.io/libs-snapshot-local/org/springframework/boot/spring-boot-dependencies/1.5.1.RELEASE/spring-boot-dependencies-1.5.1.RELEASE.pom
18-Jun-2019 00:00:19          
18-Jun-2019 00:00:19 Downloading: https://repo.spring.io/libs-milestone-local/org/springframework/boot/spring-boot-dependencies/1.5.1.RELEASE/spring-boot-dependencies-1.5.1.RELEASE.pom
18-Jun-2019 00:00:19          
18-Jun-2019 00:00:19 Downloading: https://repo.spring.io/release/org/springframework/boot/spring-boot-dependencies/1.5.1.RELEASE/spring-boot-dependencies-1.5.1.RELEASE.pom
18-Jun-2019 00:00:20 1/88 KB   
18-Jun-2019 00:00:20 3/88 KB   
18-Jun-2019 00:00:20 4/88 KB   
18-Jun-2019 00:00:20 5/88 KB   
18-Jun-2019 00:00:20 7/88 KB   
18-Jun-2019 00:00:20 8/88 KB   
18-Jun-2019 00:00:20 9/88 KB   
18-Jun-2019 00:00:20 11/88 KB   
18-Jun-2019 00:00:20 12/88 KB   
18-Jun-2019 00:00:20 13/88 KB   
18-Jun-2019 00:00:20 14/88 KB   
18-Jun-2019 00:00:20 15/88 KB   
18-Jun-2019 00:00:20 16/88 KB   
18-Jun-2019 00:00:20 18/88 KB   
18-Jun-2019 00:00:20 19/88 KB   
18-Jun-2019 00:00:20 20/88 KB   
18-Jun-2019 00:00:20 22/88 KB   
18-Jun-2019 00:00:20 23/88 KB   
18-Jun-2019 00:00:20 24/88 KB   
18-Jun-2019 00:00:20 26/88 KB   
18-Jun-2019 00:00:20 27/88 KB   
18-Jun-2019 00:00:20 28/88 KB   
18-Jun-2019 00:00:20 30/88 KB   
18-Jun-2019 00:00:20 31/88 KB   
18-Jun-2019 00:00:20 32/88 KB   
18-Jun-2019 00:00:20 34/88 KB   
18-Jun-2019 00:00:20 35/88 KB   
18-Jun-2019 00:00:20 36/88 KB   
18-Jun-2019 00:00:20 38/88 KB   
18-Jun-2019 00:00:20 39/88 KB   
18-Jun-2019 00:00:20 40/88 KB   
18-Jun-2019 00:00:20 41/88 KB   
18-Jun-2019 00:00:20 43/88 KB   
18-Jun-2019 00:00:20 44/88 KB   
18-Jun-2019 00:00:20 45/88 KB   
18-Jun-2019 00:00:20 47/88 KB   
18-Jun-2019 00:00:20 48/88 KB   
18-Jun-2019 00:00:20 49/88 KB   
18-Jun-2019 00:00:20 51/88 KB   
18-Jun-2019 00:00:20 52/88 KB   
18-Jun-2019 00:00:20 53/88 KB   
18-Jun-2019 00:00:20 55/88 KB   
18-Jun-2019 00:00:20 56/88 KB   
18-Jun-2019 00:00:20 57/88 KB   
18-Jun-2019 00:00:20 59/88 KB   
18-Jun-2019 00:00:20 60/88 KB   
18-Jun-2019 00:00:20 61/88 KB   
18-Jun-2019 00:00:20 63/88 KB   
18-Jun-2019 00:00:20 63/88 KB   
18-Jun-2019 00:00:20 64/88 KB   
18-Jun-2019 00:00:20 65/88 KB   
18-Jun-2019 00:00:20 67/88 KB   
18-Jun-2019 00:00:20 68/88 KB   
18-Jun-2019 00:00:20 69/88 KB   
18-Jun-2019 00:00:20 71/88 KB   
18-Jun-2019 00:00:20 72/88 KB   
18-Jun-2019 00:00:20 73/88 KB   
18-Jun-2019 00:00:20 75/88 KB   
18-Jun-2019 00:00:20 76/88 KB   
18-Jun-2019 00:00:20 77/88 KB   
18-Jun-2019 00:00:20 79/88 KB   
18-Jun-2019 00:00:20 80/88 KB   
18-Jun-2019 00:00:20 81/88 KB   
18-Jun-2019 00:00:20 83/88 KB   
18-Jun-2019 00:00:20 84/88 KB   
18-Jun-2019 00:00:20 85/88 KB   
18-Jun-2019 00:00:20 87/88 KB   
18-Jun-2019 00:00:20 88/88 KB   
18-Jun-2019 00:00:20            
18-Jun-2019 00:00:20 Downloaded: https://repo.spring.io/release/org/springframework/boot/spring-boot-dependencies/1.5.1.RELEASE/spring-boot-dependencies-1.5.1.RELEASE.pom (88 KB at 175.3 KB/sec)
18-Jun-2019 00:00:21 [INFO] Initializing Artifactory Build-Info Recording
18-Jun-2019 00:00:21 [INFO] ------------------------------------------------------------------------
18-Jun-2019 00:00:21 [INFO] Reactor Build Order:
18-Jun-2019 00:00:21 [INFO]
18-Jun-2019 00:00:21 [INFO] OAuth for Spring Security
18-Jun-2019 00:00:21 [INFO] OAuth 1(a) for Spring Security
18-Jun-2019 00:00:21 [INFO] OAuth2 for Spring Security
18-Jun-2019 00:00:21 [INFO] spring-oauth2-tests
18-Jun-2019 00:00:21 [INFO] spring-oauth2-tests-common
18-Jun-2019 00:00:21 [INFO] spring-oauth2-tests-vanilla
18-Jun-2019 00:00:21 [INFO] spring-oauth2-tests-mappings
18-Jun-2019 00:00:21 [INFO] spring-oauth2-tests-form
18-Jun-2019 00:00:21 [INFO] spring-oauth2-tests-jwt
18-Jun-2019 00:00:21 [INFO] spring-oauth2-tests-approval
18-Jun-2019 00:00:21 [INFO] spring-oauth2-tests-jdbc
18-Jun-2019 00:00:21 [INFO] spring-oauth2-tests-jpa
18-Jun-2019 00:00:21 [INFO] spring-oauth2-tests-jaxb
18-Jun-2019 00:00:21 [INFO] spring-oauth-tests-custom-grant
18-Jun-2019 00:00:21 [INFO] spring-oauth2-tests-multi
18-Jun-2019 00:00:21 [INFO] spring-oauth2-tests-client
18-Jun-2019 00:00:21 [INFO] spring-oauth2-tests-resource
18-Jun-2019 00:00:21 [INFO] spring-oauth2-tests-custom-authentication
18-Jun-2019 00:00:21 [INFO] spring-oauth2-tests-xml
18-Jun-2019 00:00:21 [INFO] spring-oauth2-tests-xml-common
18-Jun-2019 00:00:21 [INFO] spring-oauth2-tests-xml-vanilla
18-Jun-2019 00:00:21 [INFO] spring-oauth2-tests-xml-mappings
18-Jun-2019 00:00:21 [INFO] spring-oauth2-tests-xml-form
18-Jun-2019 00:00:21 [INFO] spring-oauth2-tests-xml-jwt
18-Jun-2019 00:00:21 [INFO] spring-oauth2-tests-xml-approval
18-Jun-2019 00:00:21 [INFO] spring-oauth2-tests-xml-jdbc
18-Jun-2019 00:00:21 [INFO] spring-oauth2-tests-xml-client
18-Jun-2019 00:00:21 [INFO] OAuth for Spring Security - Integration Tests
18-Jun-2019 00:00:21 [INFO] OAuth for Spring Security - Sparklr (OAuth 1 Provider Example)
18-Jun-2019 00:00:21 [INFO] OAuth for Spring Security - Tonr (OAuth 1 Consumer Example)
18-Jun-2019 00:00:21 [INFO] OAuth for Spring Security - Sparklr2 (OAuth 2 Provider Example)
18-Jun-2019 00:00:21 [INFO] OAuth for Spring Security - Tonr2 (OAuth 2 Client Example)
18-Jun-2019 00:00:21 [INFO] OAuth for Spring Security - Samples
18-Jun-2019 00:00:21 [INFO]                                                                         
18-Jun-2019 00:00:21 [INFO] ------------------------------------------------------------------------
18-Jun-2019 00:00:21 [INFO] Building OAuth for Spring Security 2.3.7.BUILD-SNAPSHOT
18-Jun-2019 00:00:21 [INFO] ------------------------------------------------------------------------
18-Jun-2019 00:00:22 [INFO]
18-Jun-2019 00:00:22 [INFO] --- maven-clean-plugin:2.5:clean (default-clean) @ spring-security-oauth-parent ---
18-Jun-2019 00:00:22 [INFO]
18-Jun-2019 00:00:22 [INFO] >>> maven-source-plugin:2.1.2:jar (attach-sources) > generate-sources @ spring-security-oauth-parent >>>
18-Jun-2019 00:00:22 [INFO]
18-Jun-2019 00:00:22 [INFO] <<< maven-source-plugin:2.1.2:jar (attach-sources) < generate-sources @ spring-security-oauth-parent <<<
18-Jun-2019 00:00:22 [INFO]
18-Jun-2019 00:00:22 [INFO] --- maven-source-plugin:2.1.2:jar (attach-sources) @ spring-security-oauth-parent ---
18-Jun-2019 00:00:22 [INFO]
18-Jun-2019 00:00:22 [INFO] --- maven-javadoc-plugin:2.9.1:jar (javadoc) @ spring-security-oauth-parent ---
18-Jun-2019 00:00:22 [INFO] Not executing Javadoc as the project is not a Java classpath-capable package
18-Jun-2019 00:00:22 [INFO]
18-Jun-2019 00:00:22 [INFO] --- maven-install-plugin:2.4:install (default-install) @ spring-security-oauth-parent ---
18-Jun-2019 00:00:22 [INFO] Installing /opt/bamboo-home/xml-data/build-dir/SECOAUTH-NIGHTLY-JOB1/pom.xml to /home/bamboo/.m2/repository/org/springframework/security/oauth/spring-security-oauth-parent/2.3.7.BUILD-SNAPSHOT/spring-security-oauth-parent-2.3.7.BUILD-SNAPSHOT.pom
18-Jun-2019 00:00:22 [INFO]                                                                         
18-Jun-2019 00:00:22 [INFO] ------------------------------------------------------------------------
18-Jun-2019 00:00:22 [INFO] Building OAuth 1(a) for Spring Security 2.3.7.BUILD-SNAPSHOT
18-Jun-2019 00:00:22 [INFO] ------------------------------------------------------------------------
18-Jun-2019 00:00:23 [INFO]
18-Jun-2019 00:00:23 [INFO] --- maven-clean-plugin:2.5:clean (default-clean) @ spring-security-oauth ---
18-Jun-2019 00:00:23 [INFO]
18-Jun-2019 00:00:23 [INFO] --- maven-resources-plugin:2.6:resources (default-resources) @ spring-security-oauth ---
18-Jun-2019 00:00:23 [INFO] Using 'UTF-8' encoding to copy filtered resources.
18-Jun-2019 00:00:23 [INFO] Copying 3 resources
18-Jun-2019 00:00:23 [INFO]
18-Jun-2019 00:00:23 [INFO] --- maven-compiler-plugin:2.3.2:compile (default-compile) @ spring-security-oauth ---
18-Jun-2019 00:00:23 [INFO] Compiling 108 source files to /opt/bamboo-home/xml-data/build-dir/SECOAUTH-NIGHTLY-JOB1/spring-security-oauth/target/classes
18-Jun-2019 00:00:24 [WARNING] /opt/bamboo-home/xml-data/build-dir/SECOAUTH-NIGHTLY-JOB1/spring-security-oauth/src/main/java/org/springframework/security/oauth/consumer/net/OAuthOverHttpsURLStreamHandler.java:[36,78] Handler is internal proprietary API and may be removed in a future release
18-Jun-2019 00:00:24 [WARNING] /opt/bamboo-home/xml-data/build-dir/SECOAUTH-NIGHTLY-JOB1/spring-security-oauth/src/main/java/org/springframework/security/oauth/consumer/net/OAuthOverHttpURLStreamHandler.java:[36,76] Handler is internal proprietary API and may be removed in a future release
18-Jun-2019 00:00:24 [INFO]
18-Jun-2019 00:00:24 [INFO] --- maven-resources-plugin:2.6:testResources (default-testResources) @ spring-security-oauth ---
18-Jun-2019 00:00:24 [INFO] Using 'UTF-8' encoding to copy filtered resources.
18-Jun-2019 00:00:24 [INFO] Copying 8 resources
18-Jun-2019 00:00:24 [INFO]
18-Jun-2019 00:00:24 [INFO] --- maven-compiler-plugin:2.3.2:testCompile (default-testCompile) @ spring-security-oauth ---
18-Jun-2019 00:00:24 [INFO] Compiling 22 source files to /opt/bamboo-home/xml-data/build-dir/SECOAUTH-NIGHTLY-JOB1/spring-security-oauth/target/test-classes
18-Jun-2019 00:00:25 [WARNING] /opt/bamboo-home/xml-data/build-dir/SECOAUTH-NIGHTLY-JOB1/spring-security-oauth/src/test/java/org/springframework/security/oauth/consumer/client/CoreOAuthConsumerSupportTests.java:[65,32] Handler is internal proprietary API and may be removed in a future release
18-Jun-2019 00:00:25 [WARNING] /opt/bamboo-home/xml-data/build-dir/SECOAUTH-NIGHTLY-JOB1/spring-security-oauth/src/test/java/org/springframework/security/oauth/consumer/client/CoreOAuthConsumerSupportTests.java:[483,54] Handler is internal proprietary API and may be removed in a future release
18-Jun-2019 00:00:25 [INFO]
18-Jun-2019 00:00:25 [INFO] --- maven-surefire-plugin:2.12.4:test (default-test) @ spring-security-oauth ---
18-Jun-2019 00:00:25 [INFO] Surefire report directory: /opt/bamboo-home/xml-data/build-dir/SECOAUTH-NIGHTLY-JOB1/spring-security-oauth/target/surefire-reports
18-Jun-2019 00:00:25
18-Jun-2019 00:00:25 -------------------------------------------------------
18-Jun-2019 00:00:25 T E S T S
18-Jun-2019 00:00:25 -------------------------------------------------------
18-Jun-2019 00:00:25 Running org.springframework.security.oauth.config.FilterChainInitializationTests
18-Jun-2019 00:00:26 Tests run: 1, Failures: 0, Errors: 0, Skipped: 0, Time elapsed: 1.026 sec
18-Jun-2019 00:00:26 Running org.springframework.security.oauth.config.AuthorizationServerBeanDefinitionParserTests
18-Jun-2019 00:00:27 Tests run: 2, Failures: 0, Errors: 0, Skipped: 0, Time elapsed: 0.335 sec
18-Jun-2019 00:00:27 Running org.springframework.security.oauth.config.ConsumerServiceBeanDefinitionParserTests
18-Jun-2019 00:00:27 Tests run: 2, Failures: 0, Errors: 0, Skipped: 0, Time elapsed: 0.249 sec
18-Jun-2019 00:00:27 Running org.springframework.security.oauth.provider.nonce.InMemoryNonceServicesTests
18-Jun-2019 00:00:27 Tests run: 5, Failures: 0, Errors: 0, Skipped: 0, Time elapsed: 0.004 sec
18-Jun-2019 00:00:27 Running org.springframework.security.oauth.provider.filter.ProtectedResourceProcessingFilterTests
18-Jun-2019 00:00:27 Tests run: 1, Failures: 0, Errors: 0, Skipped: 0, Time elapsed: 0.146 sec
18-Jun-2019 00:00:27 Running org.springframework.security.oauth.provider.filter.OAuthProcessingFilterTests
18-Jun-2019 00:00:27 Tests run: 3, Failures: 0, Errors: 0, Skipped: 0, Time elapsed: 0.044 sec
18-Jun-2019 00:00:27 Running org.springframework.security.oauth.provider.filter.OAuthUserAuthorizationProcessingFilterTests
18-Jun-2019 00:00:27 Tests run: 1, Failures: 0, Errors: 0, Skipped: 0, Time elapsed: 0.003 sec
18-Jun-2019 00:00:27 Running org.springframework.security.oauth.provider.filter.UserAuthorizationSuccessfulAuthenticationHandlerTests
18-Jun-2019 00:00:27 Tests run: 1, Failures: 0, Errors: 0, Skipped: 0, Time elapsed: 0.004 sec
18-Jun-2019 00:00:27 Running org.springframework.security.oauth.provider.filter.AccessTokenProcessingFilterTests
18-Jun-2019 00:00:27 Tests run: 2, Failures: 0, Errors: 0, Skipped: 0, Time elapsed: 0.002 sec
18-Jun-2019 00:00:27 Running org.springframework.security.oauth.provider.filter.UnauthenticatedRequestTokenProcessingFilterTests
18-Jun-2019 00:00:27 Tests run: 2, Failures: 0, Errors: 0, Skipped: 0, Time elapsed: 0.003 sec
18-Jun-2019 00:00:27 Running org.springframework.security.oauth.provider.CoreOAuthProviderSupportTests
18-Jun-2019 00:00:27 Tests run: 2, Failures: 0, Errors: 0, Skipped: 0, Time elapsed: 0.003 sec
18-Jun-2019 00:00:27 Running org.springframework.security.oauth.common.signature.PlainTextSignatureMethodTests
18-Jun-2019 00:00:27 Tests run: 1, Failures: 0, Errors: 0, Skipped: 0, Time elapsed: 0 sec
18-Jun-2019 00:00:27 Running org.springframework.security.oauth.common.signature.CoreOAuthSignatureMethodFactoryTests
18-Jun-2019 00:00:27 Tests run: 1, Failures: 0, Errors: 0, Skipped: 0, Time elapsed: 0.185 sec
18-Jun-2019 00:00:27 Running org.springframework.security.oauth.common.signature.RSA_SHA1SignatureMethodTests
18-Jun-2019 00:00:27 Tests run: 2, Failures: 0, Errors: 0, Skipped: 0, Time elapsed: 0.073 sec
18-Jun-2019 00:00:27 Running org.springframework.security.oauth.common.signature.HMAC_SHA1SignatureMethodTests
18-Jun-2019 00:00:27 Tests run: 3, Failures: 0, Errors: 0, Skipped: 0, Time elapsed: 0.028 sec
18-Jun-2019 00:00:27 Running org.springframework.security.oauth.common.OAuthCodecTests
18-Jun-2019 00:00:27 Tests run: 1, Failures: 0, Errors: 0, Skipped: 0, Time elapsed: 0 sec
18-Jun-2019 00:00:27 Running org.springframework.security.oauth.consumer.client.CoreOAuthConsumerSupportTests
18-Jun-2019 00:00:27 Tests run: 10, Failures: 0, Errors: 0, Skipped: 0, Time elapsed: 0.019 sec
18-Jun-2019 00:00:27 Running org.springframework.security.oauth.consumer.client.OAuthRestTemplateTests
18-Jun-2019 00:00:27 Tests run: 2, Failures: 0, Errors: 0, Skipped: 0, Time elapsed: 0.128 sec
18-Jun-2019 00:00:27 Running org.springframework.security.oauth.consumer.GoogleOAuthTests
18-Jun-2019 00:00:27 Tests run: 1, Failures: 0, Errors: 0, Skipped: 0, Time elapsed: 0.003 sec
18-Jun-2019 00:00:27 Running org.springframework.security.oauth.consumer.filter.OAuthConsumerContextFilterTests
18-Jun-2019 00:00:27 Tests run: 2, Failures: 0, Errors: 0, Skipped: 0, Time elapsed: 0.016 sec
18-Jun-2019 00:00:27 Running org.springframework.security.oauth.consumer.rememberme.HttpSessionOAuthRememberMeServicesTests
18-Jun-2019 00:00:27 Tests run: 4, Failures: 0, Errors: 0, Skipped: 0, Time elapsed: 0.009 sec
18-Jun-2019 00:00:27 Running net.oauth.signature.GoogleCodeCompatibilityTests
18-Jun-2019 00:00:28 Tests run: 2, Failures: 0, Errors: 0, Skipped: 0, Time elapsed: 0.014 sec
18-Jun-2019 00:00:28
18-Jun-2019 00:00:28 Results :
18-Jun-2019 00:00:28
18-Jun-2019 00:00:28 Tests run: 51, Failures: 0, Errors: 0, Skipped: 0
18-Jun-2019 00:00:28
18-Jun-2019 00:00:28 [INFO]
18-Jun-2019 00:00:28 [INFO] --- maven-jar-plugin:2.4:jar (default-jar) @ spring-security-oauth ---
18-Jun-2019 00:00:28 [INFO] Building jar: /opt/bamboo-home/xml-data/build-dir/SECOAUTH-NIGHTLY-JOB1/spring-security-oauth/target/spring-security-oauth-2.3.7.BUILD-SNAPSHOT.jar
18-Jun-2019 00:00:28 [INFO]
18-Jun-2019 00:00:28 [INFO] >>> maven-source-plugin:2.1.2:jar (attach-sources) > generate-sources @ spring-security-oauth >>>
18-Jun-2019 00:00:28 [INFO]
18-Jun-2019 00:00:28 [INFO] <<< maven-source-plugin:2.1.2:jar (attach-sources) < generate-sources @ spring-security-oauth <<<
18-Jun-2019 00:00:28 [INFO]
18-Jun-2019 00:00:28 [INFO] --- maven-source-plugin:2.1.2:jar (attach-sources) @ spring-security-oauth ---
18-Jun-2019 00:00:28 [INFO] org already added, skipping
18-Jun-2019 00:00:28 [INFO] org/springframework already added, skipping
18-Jun-2019 00:00:28 [INFO] org/springframework/security already added, skipping
18-Jun-2019 00:00:28 [INFO] org/springframework/security/oauth already added, skipping
18-Jun-2019 00:00:28 [INFO] Building jar: /opt/bamboo-home/xml-data/build-dir/SECOAUTH-NIGHTLY-JOB1/spring-security-oauth/target/spring-security-oauth-2.3.7.BUILD-SNAPSHOT-sources.jar
18-Jun-2019 00:00:28 [INFO] org already added, skipping
18-Jun-2019 00:00:28 [INFO] org/springframework already added, skipping
18-Jun-2019 00:00:28 [INFO] org/springframework/security already added, skipping
18-Jun-2019 00:00:28 [INFO] org/springframework/security/oauth already added, skipping
18-Jun-2019 00:00:28 [INFO]
18-Jun-2019 00:00:28 [INFO] --- maven-javadoc-plugin:2.9.1:jar (javadoc) @ spring-security-oauth ---
18-Jun-2019 00:00:31 [INFO]
18-Jun-2019 00:00:31 2 warnings
18-Jun-2019 00:00:31 [WARNING] Javadoc Warnings
18-Jun-2019 00:00:31 [WARNING] /opt/bamboo-home/xml-data/build-dir/SECOAUTH-NIGHTLY-JOB1/spring-security-oauth/src/main/java/org/springframework/security/oauth/consumer/net/OAuthOverHttpURLStreamHandler.java:36: warning: Handler is internal proprietary API and may be removed in a future release
18-Jun-2019 00:00:31 [WARNING] public class OAuthOverHttpURLStreamHandler extends sun.net.www.protocol.http.Handler {
18-Jun-2019 00:00:31 [WARNING] ^
18-Jun-2019 00:00:31 [WARNING] /opt/bamboo-home/xml-data/build-dir/SECOAUTH-NIGHTLY-JOB1/spring-security-oauth/src/main/java/org/springframework/security/oauth/consumer/net/OAuthOverHttpsURLStreamHandler.java:36: warning: Handler is internal proprietary API and may be removed in a future release
18-Jun-2019 00:00:31 [WARNING] public class OAuthOverHttpsURLStreamHandler extends sun.net.www.protocol.https.Handler {
18-Jun-2019 00:00:31 [WARNING] ^
18-Jun-2019 00:00:31 [INFO] Building jar: /opt/bamboo-home/xml-data/build-dir/SECOAUTH-NIGHTLY-JOB1/spring-security-oauth/target/spring-security-oauth-2.3.7.BUILD-SNAPSHOT-javadoc.jar
18-Jun-2019 00:00:31 [INFO]
18-Jun-2019 00:00:31 [INFO] --- maven-install-plugin:2.4:install (default-install) @ spring-security-oauth ---
18-Jun-2019 00:00:31 [INFO] Installing /opt/bamboo-home/xml-data/build-dir/SECOAUTH-NIGHTLY-JOB1/spring-security-oauth/target/spring-security-oauth-2.3.7.BUILD-SNAPSHOT.jar to /home/bamboo/.m2/repository/org/springframework/security/oauth/spring-security-oauth/2.3.7.BUILD-SNAPSHOT/spring-security-oauth-2.3.7.BUILD-SNAPSHOT.jar
18-Jun-2019 00:00:31 [INFO] Installing /opt/bamboo-home/xml-data/build-dir/SECOAUTH-NIGHTLY-JOB1/spring-security-oauth/pom.xml to /home/bamboo/.m2/repository/org/springframework/security/oauth/spring-security-oauth/2.3.7.BUILD-SNAPSHOT/spring-security-oauth-2.3.7.BUILD-SNAPSHOT.pom
18-Jun-2019 00:00:31 [INFO] Installing /opt/bamboo-home/xml-data/build-dir/SECOAUTH-NIGHTLY-JOB1/spring-security-oauth/target/spring-security-oauth-2.3.7.BUILD-SNAPSHOT-sources.jar to /home/bamboo/.m2/repository/org/springframework/security/oauth/spring-security-oauth/2.3.7.BUILD-SNAPSHOT/spring-security-oauth-2.3.7.BUILD-SNAPSHOT-sources.jar
18-Jun-2019 00:00:31 [INFO] Installing /opt/bamboo-home/xml-data/build-dir/SECOAUTH-NIGHTLY-JOB1/spring-security-oauth/target/spring-security-oauth-2.3.7.BUILD-SNAPSHOT-javadoc.jar to /home/bamboo/.m2/repository/org/springframework/security/oauth/spring-security-oauth/2.3.7.BUILD-SNAPSHOT/spring-security-oauth-2.3.7.BUILD-SNAPSHOT-javadoc.jar
18-Jun-2019 00:00:32 [INFO]                                                                         
18-Jun-2019 00:00:32 [INFO] ------------------------------------------------------------------------
18-Jun-2019 00:00:32 [INFO] Building OAuth2 for Spring Security 2.3.7.BUILD-SNAPSHOT
18-Jun-2019 00:00:32 [INFO] ------------------------------------------------------------------------
18-Jun-2019 00:00:32 [INFO]
18-Jun-2019 00:00:32 [INFO] --- maven-clean-plugin:2.5:clean (default-clean) @ spring-security-oauth2 ---
18-Jun-2019 00:00:32 [INFO]
18-Jun-2019 00:00:32 [INFO] --- maven-resources-plugin:2.6:resources (default-resources) @ spring-security-oauth2 ---
18-Jun-2019 00:00:32 [INFO] Using 'UTF-8' encoding to copy filtered resources.
18-Jun-2019 00:00:32 [INFO] Copying 4 resources
18-Jun-2019 00:00:32 [INFO]
18-Jun-2019 00:00:32 [INFO] --- maven-compiler-plugin:2.3.2:compile (default-compile) @ spring-security-oauth2 ---
18-Jun-2019 00:00:32 [INFO] Compiling 249 source files to /opt/bamboo-home/xml-data/build-dir/SECOAUTH-NIGHTLY-JOB1/spring-security-oauth2/target/classes
18-Jun-2019 00:00:34 [INFO]
18-Jun-2019 00:00:34 [INFO] --- maven-resources-plugin:2.6:testResources (default-testResources) @ spring-security-oauth2 ---
18-Jun-2019 00:00:34 [INFO] Using 'UTF-8' encoding to copy filtered resources.
18-Jun-2019 00:00:34 [INFO] Copying 21 resources
18-Jun-2019 00:00:34 [INFO]
18-Jun-2019 00:00:34 [INFO] --- maven-compiler-plugin:2.3.2:testCompile (default-testCompile) @ spring-security-oauth2 ---
18-Jun-2019 00:00:34 [INFO] Compiling 120 source files to /opt/bamboo-home/xml-data/build-dir/SECOAUTH-NIGHTLY-JOB1/spring-security-oauth2/target/test-classes
18-Jun-2019 00:00:37 [INFO]
18-Jun-2019 00:00:37 [INFO] --- maven-surefire-plugin:2.12.4:test (default-test) @ spring-security-oauth2 ---
18-Jun-2019 00:00:37 [INFO] Surefire report directory: /opt/bamboo-home/xml-data/build-dir/SECOAUTH-NIGHTLY-JOB1/spring-security-oauth2/target/surefire-reports
18-Jun-2019 00:00:37
18-Jun-2019 00:00:37 -------------------------------------------------------
18-Jun-2019 00:00:37 T E S T S
18-Jun-2019 00:00:37 -------------------------------------------------------
18-Jun-2019 00:00:37 Running org.springframework.security.oauth2.config.annotation.TokenServicesMultipleBeansTests
18-Jun-2019 00:00:38 Tests run: 1, Failures: 0, Errors: 0, Skipped: 0, Time elapsed: 1.429 sec
18-Jun-2019 00:00:38 Running org.springframework.security.oauth2.config.annotation.Gh501EnableAuthorizationServerTests
18-Jun-2019 00:00:39 Tests run: 1, Failures: 0, Errors: 0, Skipped: 0, Time elapsed: 0.68 sec
18-Jun-2019 00:00:39 Running org.springframework.security.oauth2.config.annotation.ClientConfigurationTests
18-Jun-2019 00:00:39 Tests run: 1, Failures: 0, Errors: 0, Skipped: 0, Time elapsed: 0.232 sec
18-Jun-2019 00:00:39 Running org.springframework.security.oauth2.config.annotation.ResourceServerConfigurationTests
18-Jun-2019 00:00:40 [WARN] TokenEndpoint - Handling error: InvalidRequestException, Missing grant type
18-Jun-2019 00:00:40 [WARN] PageNotFound - No mapping found for HTTP request with URI [/] in DispatcherServlet with name ''
18-Jun-2019 00:00:40 [WARN] PageNotFound - No mapping found for HTTP request with URI [/] in DispatcherServlet with name ''
18-Jun-2019 00:00:40 [WARN] PageNotFound - No mapping found for HTTP request with URI [/] in DispatcherServlet with name ''
18-Jun-2019 00:00:41 [WARN] PageNotFound - No mapping found for HTTP request with URI [/] in DispatcherServlet with name ''
18-Jun-2019 00:00:41 [WARN] TokenEndpoint - Handling error: InvalidRequestException, Missing grant type
18-Jun-2019 00:00:41 Tests run: 9, Failures: 0, Errors: 0, Skipped: 0, Time elapsed: 1.637 sec
18-Jun-2019 00:00:41 Running org.springframework.security.oauth2.config.annotation.AuthorizationServerConfigurationTests
18-Jun-2019 00:00:41 [WARN] AnnotationConfigWebApplicationContext - Exception encountered during context initialization - cancelling refresh attempt: org.springframework.beans.factory.UnsatisfiedDependencyException: Error creating bean with name 'org.springframework.security.oauth2.config.annotation.web.configuration.AuthorizationServerEndpointsConfiguration': Unsatisfied dependency expressed through field 'configurers'; nested exception is org.springframework.beans.factory.NoSuchBeanDefinitionException: No qualifying bean of type 'java.util.List<org.springframework.security.oauth2.config.annotation.web.configuration.AuthorizationServerConfigurer>' available: expected at least 1 bean which qualifies as autowire candidate. Dependency annotations: {@org.springframework.beans.factory.annotation.Autowired(required=true)}
18-Jun-2019 00:00:42 [WARN] JwtAccessTokenConverter - Unable to create an RSA verifier from verifierKey (ignoreable if using MAC)
18-Jun-2019 00:00:43 [WARN] AnnotationConfigWebApplicationContext - Exception encountered during context initialization - cancelling refresh attempt: org.springframework.beans.factory.UnsatisfiedDependencyException: Error creating bean with name 'authorizationServerConfigurationTests.AuthorizationServerTypes': Unsatisfied dependency expressed through field 'tokenServices'; nested exception is org.springframework.beans.factory.BeanCreationException: Error creating bean with name 'org.springframework.security.oauth2.config.annotation.web.configuration.AuthorizationServerEndpointsConfiguration': Invocation of init method failed; nested exception is java.lang.AssertionError
18-Jun-2019 00:00:43 Tests run: 20, Failures: 0, Errors: 0, Skipped: 0, Time elapsed: 2.163 sec
18-Jun-2019 00:00:43 Running org.springframework.security.oauth2.config.annotation.Gh808EnableAuthorizationServerTests
18-Jun-2019 00:00:43 Tests run: 2, Failures: 0, Errors: 0, Skipped: 0, Time elapsed: 0.151 sec
18-Jun-2019 00:00:43 Running org.springframework.security.oauth2.config.xml.ResourceServerBeanDefinitionParserTests
18-Jun-2019 00:00:43 Tests run: 2, Failures: 0, Errors: 0, Skipped: 0, Time elapsed: 0.187 sec
18-Jun-2019 00:00:43 Running org.springframework.security.oauth2.config.xml.AuthorizationServerInvalidParserTests
18-Jun-2019 00:00:43 Tests run: 1, Failures: 0, Errors: 0, Skipped: 0, Time elapsed: 0.031 sec
18-Jun-2019 00:00:43 Running org.springframework.security.oauth2.config.xml.AuthorizationServerBeanDefinitionParserTests
18-Jun-2019 00:00:44 Tests run: 12, Failures: 0, Errors: 0, Skipped: 0, Time elapsed: 0.482 sec
18-Jun-2019 00:00:44 Running org.springframework.security.oauth2.config.xml.ClientDetailsServiceBeanDefinitionParserTests
18-Jun-2019 00:00:44 Tests run: 3, Failures: 0, Errors: 0, Skipped: 0, Time elapsed: 0.035 sec
18-Jun-2019 00:00:44 Running org.springframework.security.oauth2.config.xml.ResourceBeanDefinitionParserTests
18-Jun-2019 00:00:44 Tests run: 7, Failures: 0, Errors: 0, Skipped: 0, Time elapsed: 0.065 sec
18-Jun-2019 00:00:44 Running org.springframework.security.oauth2.config.xml.InvalidResourceBeanDefinitionParserTests
18-Jun-2019 00:00:44 Tests run: 5, Failures: 0, Errors: 0, Skipped: 0, Time elapsed: 0.059 sec
18-Jun-2019 00:00:44 Running org.springframework.security.oauth2.config.xml.AuthorizationServerCustomGrantParserTests
18-Jun-2019 00:00:44 Tests run: 1, Failures: 0, Errors: 0, Skipped: 0, Time elapsed: 0.023 sec
18-Jun-2019 00:00:44 Running org.springframework.security.oauth2.config.xml.AuthorizationServerClientCredentialsPasswordInvalidXmlTests
18-Jun-2019 00:00:44 Tests run: 2, Failures: 0, Errors: 0, Skipped: 0, Time elapsed: 0.312 sec
18-Jun-2019 00:00:44 Running org.springframework.security.oauth2.config.xml.AuthorizationServerClientCredentialsPasswordValidXmlTests
18-Jun-2019 00:00:45 Tests run: 2, Failures: 0, Errors: 0, Skipped: 0, Time elapsed: 0.209 sec
18-Jun-2019 00:00:45 Running org.springframework.security.oauth2.http.converter.jaxb.JaxbOAuth2ExceptionMessageConverterTests
18-Jun-2019 00:00:46 Tests run: 22, Failures: 0, Errors: 0, Skipped: 0, Time elapsed: 1.471 sec
18-Jun-2019 00:00:46 Running org.springframework.security.oauth2.http.converter.jaxb.JaxbOAuth2AccessTokenMessageConverterTests
18-Jun-2019 00:00:47 Tests run: 8, Failures: 0, Errors: 0, Skipped: 0, Time elapsed: 0.83 sec
18-Jun-2019 00:00:47 Running org.springframework.security.oauth2.client.http.OAuth2ErrorHandlerTests
18-Jun-2019 00:00:47 Tests run: 12, Failures: 0, Errors: 0, Skipped: 0, Time elapsed: 0.055 sec
18-Jun-2019 00:00:47 Running org.springframework.security.oauth2.client.DefaultOAuth2RequestAuthenticatorTests
18-Jun-2019 00:00:47 Tests run: 6, Failures: 0, Errors: 0, Skipped: 0, Time elapsed: 0.002 sec
18-Jun-2019 00:00:47 Running org.springframework.security.oauth2.client.token.grant.password.ResourceOwnerPasswordAccessTokenProviderTests
18-Jun-2019 00:00:47 Tests run: 3, Failures: 0, Errors: 0, Skipped: 0, Time elapsed: 0.001 sec
18-Jun-2019 00:00:47 Running org.springframework.security.oauth2.client.token.grant.implicit.ImplicitAccessTokenProviderTests
18-Jun-2019 00:00:47 Tests run: 2, Failures: 0, Errors: 0, Skipped: 0, Time elapsed: 0 sec
18-Jun-2019 00:00:47 Running org.springframework.security.oauth2.client.token.grant.code.AuthorizationCodeAccessTokenProviderWithConversionTests
18-Jun-2019 00:00:47 Tests run: 4, Failures: 0, Errors: 0, Skipped: 0, Time elapsed: 0.121 sec
18-Jun-2019 00:00:47 Running org.springframework.security.oauth2.client.token.grant.code.AuthorizationCodeAccessTokenProviderTests
18-Jun-2019 00:00:47 Tests run: 5, Failures: 0, Errors: 0, Skipped: 0, Time elapsed: 0.002 sec
18-Jun-2019 00:00:47 Running org.springframework.security.oauth2.client.token.grant.code.AuthorizationCodeResourceDetailsTests
18-Jun-2019 00:00:47 Tests run: 2, Failures: 0, Errors: 0, Skipped: 0, Time elapsed: 0 sec
18-Jun-2019 00:00:47 Running org.springframework.security.oauth2.client.token.JdbcClientTokenServicesTests
18-Jun-2019 00:00:47 Tests run: 3, Failures: 0, Errors: 0, Skipped: 0, Time elapsed: 0.311 sec
18-Jun-2019 00:00:47 Running org.springframework.security.oauth2.client.token.OAuth2AccessTokenSupportTests
18-Jun-2019 00:00:47 Tests run: 5, Failures: 0, Errors: 0, Skipped: 0, Time elapsed: 0.024 sec
18-Jun-2019 00:00:47 Running org.springframework.security.oauth2.client.token.AccessTokenProviderChainTests
18-Jun-2019 00:00:47 Tests run: 15, Failures: 0, Errors: 0, Skipped: 0, Time elapsed: 0.028 sec
18-Jun-2019 00:00:47 Running org.springframework.security.oauth2.client.filter.OAuth2ClientContextFilterTests
18-Jun-2019 00:00:47 Tests run: 11, Failures: 0, Errors: 0, Skipped: 0, Time elapsed: 0.007 sec
18-Jun-2019 00:00:47 Running org.springframework.security.oauth2.client.filter.OAuth2ClientAuthenticationProcessingFilterTests
18-Jun-2019 00:00:47 Tests run: 5, Failures: 0, Errors: 0, Skipped: 0, Time elapsed: 0.017 sec
18-Jun-2019 00:00:47 Running org.springframework.security.oauth2.client.OAuth2RestTemplateTests
18-Jun-2019 00:00:48 Tests run: 12, Failures: 0, Errors: 0, Skipped: 0, Time elapsed: 0.216 sec
18-Jun-2019 00:00:48 Running org.springframework.security.oauth2.provider.request.DefaultAuthorizationRequestFactoryTests
18-Jun-2019 00:00:48 Tests run: 9, Failures: 0, Errors: 0, Skipped: 0, Time elapsed: 0.003 sec
18-Jun-2019 00:00:48 Running org.springframework.security.oauth2.provider.request.DefaultOAuth2RequestValidatorTests
18-Jun-2019 00:00:48 Tests run: 3, Failures: 0, Errors: 0, Skipped: 0, Time elapsed: 0.002 sec
18-Jun-2019 00:00:48 Running org.springframework.security.oauth2.provider.password.ResourceOwnerPasswordTokenGranterTests
18-Jun-2019 00:00:48 Tests run: 7, Failures: 0, Errors: 0, Skipped: 0, Time elapsed: 0.004 sec
18-Jun-2019 00:00:48 Running org.springframework.security.oauth2.provider.client.BaseClientDetailsTests
18-Jun-2019 00:00:48 Tests run: 11, Failures: 0, Errors: 0, Skipped: 0, Time elapsed: 0.044 sec
18-Jun-2019 00:00:48 Running org.springframework.security.oauth2.provider.client.JdbcClientDetailsServiceTests
18-Jun-2019 00:00:48 Tests run: 14, Failures: 0, Errors: 0, Skipped: 0, Time elapsed: 0.265 sec
18-Jun-2019 00:00:48 Running org.springframework.security.oauth2.provider.client.ClientCredentialsTokenEndpointFilterTests
18-Jun-2019 00:00:48 Tests run: 3, Failures: 0, Errors: 0, Skipped: 0, Time elapsed: 0.02 sec
18-Jun-2019 00:00:48 Running org.springframework.security.oauth2.provider.client.ClientDetailsUserDetailsServiceTests
18-Jun-2019 00:00:48 Tests run: 2, Failures: 0, Errors: 0, Skipped: 0, Time elapsed: 0.004 sec
18-Jun-2019 00:00:48 Running org.springframework.security.oauth2.provider.approval.ApprovalStoreUserApprovalHandlerTests
18-Jun-2019 00:00:48 Tests run: 10, Failures: 0, Errors: 0, Skipped: 0, Time elapsed: 0.004 sec
18-Jun-2019 00:00:48 Running org.springframework.security.oauth2.provider.approval.DefaultUserApprovalHandlerTests
18-Jun-2019 00:00:48 Tests run: 1, Failures: 0, Errors: 0, Skipped: 0, Time elapsed: 0 sec
18-Jun-2019 00:00:48 Running org.springframework.security.oauth2.provider.approval.TokenStoreUserApprovalHandlerTests
18-Jun-2019 00:00:48 Tests run: 3, Failures: 0, Errors: 0, Skipped: 0, Time elapsed: 0.001 sec
18-Jun-2019 00:00:48 Running org.springframework.security.oauth2.provider.approval.JdbcApprovalStoreTests
18-Jun-2019 00:00:48 Tests run: 6, Failures: 0, Errors: 0, Skipped: 0, Time elapsed: 0.071 sec
18-Jun-2019 00:00:48 Running org.springframework.security.oauth2.provider.approval.InMemoryApprovalStoreTests
18-Jun-2019 00:00:48 Tests run: 5, Failures: 0, Errors: 0, Skipped: 0, Time elapsed: 0.001 sec
18-Jun-2019 00:00:48 Running org.springframework.security.oauth2.provider.approval.TokenApprovalStoreTests
18-Jun-2019 00:00:48 Tests run: 5, Failures: 0, Errors: 0, Skipped: 0, Time elapsed: 0.003 sec
18-Jun-2019 00:00:48 Running org.springframework.security.oauth2.provider.vote.ClientScopeVoterTests
18-Jun-2019 00:00:48 Tests run: 3, Failures: 0, Errors: 0, Skipped: 0, Time elapsed: 0.001 sec
18-Jun-2019 00:00:48 Running org.springframework.security.oauth2.provider.vote.ScopeVoterTests
18-Jun-2019 00:00:48 Tests run: 6, Failures: 0, Errors: 0, Skipped: 0, Time elapsed: 0.002 sec
18-Jun-2019 00:00:48 Running org.springframework.security.oauth2.provider.test.OAuth2RequestTests
18-Jun-2019 00:00:48 Tests run: 4, Failures: 0, Errors: 0, Skipped: 0, Time elapsed: 0 sec
18-Jun-2019 00:00:48 Running org.springframework.security.oauth2.provider.token.DefaultTokenServicesWithJdbcTests
18-Jun-2019 00:00:49 Tests run: 19, Failures: 0, Errors: 0, Skipped: 0, Time elapsed: 0.365 sec
18-Jun-2019 00:00:49 Running org.springframework.security.oauth2.provider.token.store.JwtAccessTokenConverterTests
18-Jun-2019 00:00:49 [WARN] JwtAccessTokenConverter - Unable to create an RSA verifier from verifierKey (ignoreable if using MAC)
18-Jun-2019 00:00:49 [WARN] JwtAccessTokenConverter - Unable to create an RSA verifier from verifierKey (ignoreable if using MAC)
18-Jun-2019 00:00:49 [WARN] JwtAccessTokenConverter - Unable to create an RSA verifier from verifierKey (ignoreable if using MAC)
18-Jun-2019 00:00:49 Tests run: 14, Failures: 0, Errors: 0, Skipped: 0, Time elapsed: 0.165 sec
18-Jun-2019 00:00:49 Running org.springframework.security.oauth2.provider.token.store.InMemoryTokenStoreTests
18-Jun-2019 00:00:49 Tests run: 16, Failures: 0, Errors: 0, Skipped: 0, Time elapsed: 0.01 sec
18-Jun-2019 00:00:49 Running org.springframework.security.oauth2.provider.token.store.JwtTokenStoreTests
18-Jun-2019 00:00:49 [WARN] JwtAccessTokenConverter - Unable to create an RSA verifier from verifierKey (ignoreable if using MAC)
18-Jun-2019 00:00:49 [WARN] JwtAccessTokenConverter - Unable to create an RSA verifier from verifierKey (ignoreable if using MAC)
18-Jun-2019 00:00:49 [WARN] JwtAccessTokenConverter - Unable to create an RSA verifier from verifierKey (ignoreable if using MAC)
18-Jun-2019 00:00:49 [WARN] JwtAccessTokenConverter - Unable to create an RSA verifier from verifierKey (ignoreable if using MAC)
18-Jun-2019 00:00:49 [WARN] JwtAccessTokenConverter - Unable to create an RSA verifier from verifierKey (ignoreable if using MAC)
18-Jun-2019 00:00:49 [WARN] JwtAccessTokenConverter - Unable to create an RSA verifier from verifierKey (ignoreable if using MAC)
18-Jun-2019 00:00:49 [WARN] JwtAccessTokenConverter - Unable to create an RSA verifier from verifierKey (ignoreable if using MAC)
18-Jun-2019 00:00:49 [WARN] JwtAccessTokenConverter - Unable to create an RSA verifier from verifierKey (ignoreable if using MAC)
18-Jun-2019 00:00:49 [WARN] JwtAccessTokenConverter - Unable to create an RSA verifier from verifierKey (ignoreable if using MAC)
18-Jun-2019 00:00:49 [WARN] JwtAccessTokenConverter - Unable to create an RSA verifier from verifierKey (ignoreable if using MAC)
18-Jun-2019 00:00:49 [WARN] JwtAccessTokenConverter - Unable to create an RSA verifier from verifierKey (ignoreable if using MAC)
18-Jun-2019 00:00:49 [WARN] JwtAccessTokenConverter - Unable to create an RSA verifier from verifierKey (ignoreable if using MAC)
18-Jun-2019 00:00:49 [WARN] JwtAccessTokenConverter - Unable to create an RSA verifier from verifierKey (ignoreable if using MAC)
18-Jun-2019 00:00:49 [WARN] JwtAccessTokenConverter - Unable to create an RSA verifier from verifierKey (ignoreable if using MAC)
18-Jun-2019 00:00:49 [WARN] JwtAccessTokenConverter - Unable to create an RSA verifier from verifierKey (ignoreable if using MAC)
18-Jun-2019 00:00:49 [WARN] JwtAccessTokenConverter - Unable to create an RSA verifier from verifierKey (ignoreable if using MAC)
18-Jun-2019 00:00:49 [WARN] JwtAccessTokenConverter - Unable to create an RSA verifier from verifierKey (ignoreable if using MAC)
18-Jun-2019 00:00:49 [WARN] JwtAccessTokenConverter - Unable to create an RSA verifier from verifierKey (ignoreable if using MAC)
18-Jun-2019 00:00:49 Tests run: 18, Failures: 0, Errors: 0, Skipped: 0, Time elapsed: 0.033 sec
18-Jun-2019 00:00:49 Running org.springframework.security.oauth2.provider.token.store.redis.RedisTokenStorePrefixTests
18-Jun-2019 00:00:52 Tests run: 15, Failures: 0, Errors: 0, Skipped: 0, Time elapsed: 3.115 sec
18-Jun-2019 00:00:52 Running org.springframework.security.oauth2.provider.token.store.redis.RedisTokenStoreMockTests
18-Jun-2019 00:00:52 Tests run: 2, Failures: 0, Errors: 0, Skipped: 0, Time elapsed: 0.066 sec
18-Jun-2019 00:00:52 Running org.springframework.security.oauth2.provider.token.store.redis.RedisTokenStoreTests
18-Jun-2019 00:00:55 Tests run: 16, Failures: 0, Errors: 0, Skipped: 0, Time elapsed: 3.054 sec
18-Jun-2019 00:00:55 Running org.springframework.security.oauth2.provider.token.store.JdbcTokenStoreTests
18-Jun-2019 00:00:55 Tests run: 14, Failures: 0, Errors: 0, Skipped: 0, Time elapsed: 0.154 sec
18-Jun-2019 00:00:55 Running org.springframework.security.oauth2.provider.token.DefaultTokenServicesAuthoritiesChangeTests
18-Jun-2019 00:00:55 Tests run: 1, Failures: 0, Errors: 0, Skipped: 0, Time elapsed: 0.001 sec
18-Jun-2019 00:00:55 Running org.springframework.security.oauth2.provider.token.DefaultUserAuthenticationConverterTests
18-Jun-2019 00:00:55 Tests run: 3, Failures: 0, Errors: 0, Skipped: 0, Time elapsed: 0.003 sec
18-Jun-2019 00:00:55 Running org.springframework.security.oauth2.provider.token.TokenServicesWithTokenEnhancerTests
18-Jun-2019 00:00:55 [WARN] JwtAccessTokenConverter - Unable to create an RSA verifier from verifierKey (ignoreable if using MAC)
18-Jun-2019 00:00:55 [WARN] JwtAccessTokenConverter - Unable to create an RSA verifier from verifierKey (ignoreable if using MAC)
18-Jun-2019 00:00:55 [WARN] JwtAccessTokenConverter - Unable to create an RSA verifier from verifierKey (ignoreable if using MAC)
18-Jun-2019 00:00:55 [WARN] JwtAccessTokenConverter - Unable to create an RSA verifier from verifierKey (ignoreable if using MAC)
18-Jun-2019 00:00:55 [WARN] JwtAccessTokenConverter - Unable to create an RSA verifier from verifierKey (ignoreable if using MAC)
18-Jun-2019 00:00:55 Tests run: 5, Failures: 0, Errors: 0, Skipped: 0, Time elapsed: 0.016 sec
18-Jun-2019 00:00:55 Running org.springframework.security.oauth2.provider.token.DefaultTokenServicesWithJwtTests
18-Jun-2019 00:00:55 [WARN] JwtAccessTokenConverter - Unable to create an RSA verifier from verifierKey (ignoreable if using MAC)
18-Jun-2019 00:00:55 [WARN] JwtAccessTokenConverter - Unable to create an RSA verifier from verifierKey (ignoreable if using MAC)
18-Jun-2019 00:00:55 [WARN] JwtAccessTokenConverter - Unable to create an RSA verifier from verifierKey (ignoreable if using MAC)
18-Jun-2019 00:00:55 [WARN] JwtAccessTokenConverter - Unable to create an RSA verifier from verifierKey (ignoreable if using MAC)
18-Jun-2019 00:00:55 [WARN] JwtAccessTokenConverter - Unable to create an RSA verifier from verifierKey (ignoreable if using MAC)
18-Jun-2019 00:00:55 [WARN] JwtAccessTokenConverter - Unable to create an RSA verifier from verifierKey (ignoreable if using MAC)
18-Jun-2019 00:00:55 [WARN] JwtAccessTokenConverter - Unable to create an RSA verifier from verifierKey (ignoreable if using MAC)
18-Jun-2019 00:00:55 [WARN] JwtAccessTokenConverter - Unable to create an RSA verifier from verifierKey (ignoreable if using MAC)
18-Jun-2019 00:00:55 [WARN] JwtAccessTokenConverter - Unable to create an RSA verifier from verifierKey (ignoreable if using MAC)
18-Jun-2019 00:00:55 [WARN] JwtAccessTokenConverter - Unable to create an RSA verifier from verifierKey (ignoreable if using MAC)
18-Jun-2019 00:00:55 [WARN] JwtAccessTokenConverter - Unable to create an RSA verifier from verifierKey (ignoreable if using MAC)
18-Jun-2019 00:00:55 [WARN] JwtAccessTokenConverter - Unable to create an RSA verifier from verifierKey (ignoreable if using MAC)
18-Jun-2019 00:00:55 [WARN] JwtAccessTokenConverter - Unable to create an RSA verifier from verifierKey (ignoreable if using MAC)
18-Jun-2019 00:00:55 [WARN] JwtAccessTokenConverter - Unable to create an RSA verifier from verifierKey (ignoreable if using MAC)
18-Jun-2019 00:00:55 [WARN] JwtAccessTokenConverter - Unable to create an RSA verifier from verifierKey (ignoreable if using MAC)
18-Jun-2019 00:00:55 Tests run: 15, Failures: 0, Errors: 0, Skipped: 0, Time elapsed: 0.038 sec
18-Jun-2019 00:00:55 Running org.springframework.security.oauth2.provider.token.DefaultTokenServicesTests
18-Jun-2019 00:00:55 Tests run: 1, Failures: 0, Errors: 0, Skipped: 0, Time elapsed: 0.004 sec
18-Jun-2019 00:00:55 Running org.springframework.security.oauth2.provider.token.DefaultTokenServicesWithInMemoryTests
18-Jun-2019 00:00:55 Tests run: 25, Failures: 0, Errors: 0, Skipped: 0, Time elapsed: 0.018 sec
18-Jun-2019 00:00:55 Running org.springframework.security.oauth2.provider.token.DefaultAccessTokenConverterTests
18-Jun-2019 00:00:55 Tests run: 15, Failures: 0, Errors: 0, Skipped: 0, Time elapsed: 0.003 sec
18-Jun-2019 00:00:55 Running org.springframework.security.oauth2.provider.implicit.InMemoryImplicitGrantServiceTests
18-Jun-2019 00:00:55 Tests run: 2, Failures: 0, Errors: 0, Skipped: 0, Time elapsed: 0.001 sec
18-Jun-2019 00:00:55 Running org.springframework.security.oauth2.provider.error.DefaultWebResponseExceptionTranslatorTests
18-Jun-2019 00:00:55 Tests run: 1, Failures: 0, Errors: 0, Skipped: 0, Time elapsed: 0 sec
18-Jun-2019 00:00:55 Running org.springframework.security.oauth2.provider.error.OAuth2AuthenticationEntryPointTests
18-Jun-2019 00:00:55 [WARN] DefaultHandlerExceptionResolver - Resolved exception caused by handler execution: org.springframework.web.HttpMediaTypeNotAcceptableException: Could not find acceptable representation
18-Jun-2019 00:00:55 Tests run: 7, Failures: 0, Errors: 0, Skipped: 0, Time elapsed: 0.034 sec
18-Jun-2019 00:00:55 Running org.springframework.security.oauth2.provider.error.OAuth2AccessDeniedHandlerTests
18-Jun-2019 00:00:55 Tests run: 1, Failures: 0, Errors: 0, Skipped: 0, Time elapsed: 0.004 sec
18-Jun-2019 00:00:55 Running org.springframework.security.oauth2.provider.authentication.OAuth2AuthenticationProcessingFilterTests
18-Jun-2019 00:00:55 Tests run: 8, Failures: 0, Errors: 0, Skipped: 0, Time elapsed: 0.039 sec
18-Jun-2019 00:00:55 Running org.springframework.security.oauth2.provider.authentication.OAuth2AuthenticationDetailsTests
18-Jun-2019 00:00:55 Tests run: 1, Failures: 0, Errors: 0, Skipped: 0, Time elapsed: 0.001 sec
18-Jun-2019 00:00:55 Running org.springframework.security.oauth2.provider.authentication.OAuth2AuthenticationManagerTests
18-Jun-2019 00:00:55 Tests run: 3, Failures: 0, Errors: 0, Skipped: 0, Time elapsed: 0.001 sec
18-Jun-2019 00:00:55 Running org.springframework.security.oauth2.provider.endpoint.FrameworkEndpointHandlerMappingTests
18-Jun-2019 00:00:55 Tests run: 4, Failures: 0, Errors: 0, Skipped: 0, Time elapsed: 0.001 sec
18-Jun-2019 00:00:55 Running org.springframework.security.oauth2.provider.endpoint.WhitelabelApprovalEndpointTests
18-Jun-2019 00:00:55 Tests run: 6, Failures: 0, Errors: 0, Skipped: 0, Time elapsed: 0.003 sec
18-Jun-2019 00:00:55 Running org.springframework.security.oauth2.provider.endpoint.ExactMatchRedirectResolverTests
18-Jun-2019 00:00:55 Tests run: 3, Failures: 0, Errors: 0, Skipped: 0, Time elapsed: 0.001 sec
18-Jun-2019 00:00:55 Running org.springframework.security.oauth2.provider.endpoint.AuthorizationEndpointTests
18-Jun-2019 00:00:55 Tests run: 34, Failures: 0, Errors: 0, Skipped: 0, Time elapsed: 0.022 sec
18-Jun-2019 00:00:55 Running org.springframework.security.oauth2.provider.endpoint.TokenEndpointTests
18-Jun-2019 00:00:55 Tests run: 6, Failures: 0, Errors: 0, Skipped: 0, Time elapsed: 0.009 sec
18-Jun-2019 00:00:55 Running org.springframework.security.oauth2.provider.endpoint.DefaultRedirectResolverTests
18-Jun-2019 00:00:55 Tests run: 31, Failures: 0, Errors: 0, Skipped: 0, Time elapsed: 0.009 sec
18-Jun-2019 00:00:55 Running org.springframework.security.oauth2.provider.endpoint.WhitelabelErrorEndpointTests
18-Jun-2019 00:00:55 Tests run: 3, Failures: 0, Errors: 0, Skipped: 0, Time elapsed: 0.001 sec
18-Jun-2019 00:00:55 Running org.springframework.security.oauth2.provider.endpoint.TokenEndpointAuthenticationFilterTests
18-Jun-2019 00:00:55 Tests run: 3, Failures: 0, Errors: 0, Skipped: 0, Time elapsed: 0.015 sec
18-Jun-2019 00:00:55 Running org.springframework.security.oauth2.provider.AuthorizationRequestTests
18-Jun-2019 00:00:55 Tests run: 9, Failures: 0, Errors: 0, Skipped: 0, Time elapsed: 0.004 sec
18-Jun-2019 00:00:55 Running org.springframework.security.oauth2.provider.OAuth2AuthenticationTests
18-Jun-2019 00:00:55 {"authorities":[{"authority":"ROLE_USER"}],"details":null,"authenticated":false,"userAuthentication":{"authorities":[{"authority":"ROLE_USER"}],"details":null,"authenticated":true,"principal":"foo","credentials":"bar","name":"foo"},"clientOnly":false,"oauth2Request":{"clientId":"id","scope":["read"],"requestParameters":{},"resourceIds":[],"authorities":[],"approved":false,"refresh":false,"redirectUri":null,"responseTypes":[],"extensions":{},"grantType":null,"refreshTokenRequest":null},"principal":"foo","credentials":"","name":"foo"}
18-Jun-2019 00:00:55 Tests run: 8, Failures: 0, Errors: 0, Skipped: 0, Time elapsed: 0.014 sec
18-Jun-2019 00:00:55 Running org.springframework.security.oauth2.provider.expression.OAuth2MethodSecurityExpressionHandlerTests
18-Jun-2019 00:00:55 Tests run: 9, Failures: 0, Errors: 0, Skipped: 0, Time elapsed: 0.007 sec
18-Jun-2019 00:00:55 Running org.springframework.security.oauth2.provider.expression.OAuth2SecurityExpressionMethodsTests
18-Jun-2019 00:00:55 Tests run: 10, Failures: 0, Errors: 0, Skipped: 0, Time elapsed: 0.002 sec
18-Jun-2019 00:00:55 Running org.springframework.security.oauth2.provider.expression.OAuth2WebSecurityExpressionHandlerTests
18-Jun-2019 00:00:55 Tests run: 6, Failures: 0, Errors: 0, Skipped: 0, Time elapsed: 0.003 sec
18-Jun-2019 00:00:55 Running org.springframework.security.oauth2.provider.expression.OAuth2ExpressionParserTests
18-Jun-2019 00:00:55 Tests run: 3, Failures: 0, Errors: 0, Skipped: 0, Time elapsed: 0.006 sec
18-Jun-2019 00:00:55 Running org.springframework.security.oauth2.provider.OAuth2RequestTests
18-Jun-2019 00:00:55 Tests run: 4, Failures: 0, Errors: 0, Skipped: 0, Time elapsed: 0.004 sec
18-Jun-2019 00:00:55 Running org.springframework.security.oauth2.provider.code.AuthorizationCodeTokenGranterTests
18-Jun-2019 00:00:55 Tests run: 5, Failures: 0, Errors: 0, Skipped: 0, Time elapsed: 0.002 sec
18-Jun-2019 00:00:55 Running org.springframework.security.oauth2.provider.code.InMemoryAuthorizationCodeServicesTests
18-Jun-2019 00:00:55 Tests run: 3, Failures: 0, Errors: 0, Skipped: 0, Time elapsed: 0.001 sec
18-Jun-2019 00:00:55 Running org.springframework.security.oauth2.provider.code.JdbcAuthorizationCodeServicesTests
18-Jun-2019 00:00:55 Tests run: 3, Failures: 0, Errors: 0, Skipped: 0, Time elapsed: 0.029 sec
18-Jun-2019 00:00:55 Running org.springframework.security.oauth2.provider.code.SubdomainRedirectResolverTests
18-Jun-2019 00:00:55 Tests run: 2, Failures: 0, Errors: 0, Skipped: 0, Time elapsed: 0.001 sec
18-Jun-2019 00:00:55 Running org.springframework.security.oauth2.common.OAuth2AccessTokenJackson1DeserializerTests
18-Jun-2019 00:00:57 Tests run: 8, Failures: 0, Errors: 0, Skipped: 0, Time elapsed: 1.082 sec
18-Jun-2019 00:00:57 Running org.springframework.security.oauth2.common.OAuth2AccessTokenJackson2DeserializerTests
18-Jun-2019 00:00:58 Tests run: 9, Failures: 0, Errors: 0, Skipped: 0, Time elapsed: 1.019 sec
18-Jun-2019 00:00:58 Running org.springframework.security.oauth2.common.exception.OAuth2ExceptionDeserializerTests
18-Jun-2019 00:00:58 Tests run: 13, Failures: 0, Errors: 0, Skipped: 0, Time elapsed: 0.007 sec
18-Jun-2019 00:00:58 Running org.springframework.security.oauth2.common.exception.OAuth2ExceptionSerializerTests
18-Jun-2019 00:00:58 Tests run: 11, Failures: 0, Errors: 0, Skipped: 0, Time elapsed: 0.008 sec
18-Jun-2019 00:00:58 Running org.springframework.security.oauth2.common.exception.OAuth2ExceptionJackson2DeserializerTests
18-Jun-2019 00:00:58 Tests run: 14, Failures: 0, Errors: 0, Skipped: 0, Time elapsed: 0.005 sec
18-Jun-2019 00:00:58 Running org.springframework.security.oauth2.common.OAuth2AccessTokenJackson2SerializerTests
18-Jun-2019 00:00:58 Tests run: 10, Failures: 0, Errors: 0, Skipped: 0, Time elapsed: 0.91 sec
18-Jun-2019 00:00:58 Running org.springframework.security.oauth2.common.OAuth2AccessTokenJackson1SerializerTests
18-Jun-2019 00:01:02 Tests run: 1, Failures: 0, Errors: 0, Skipped: 0, Time elapsed: 3.618 sec
18-Jun-2019 00:01:03 Exception: java.lang.OutOfMemoryError thrown from the UncaughtExceptionHandler in thread "main"
18-Jun-2019 00:01:04
18-Jun-2019 00:01:04 Results :
18-Jun-2019 00:01:04
18-Jun-2019 00:01:04 Tests run: 696, Failures: 0, Errors: 0, Skipped: 0
18-Jun-2019 00:01:04
18-Jun-2019 00:01:04 [INFO] ------------------------------------------------------------------------
18-Jun-2019 00:01:04 [INFO] Reactor Summary:
18-Jun-2019 00:01:04 [INFO]
18-Jun-2019 00:01:04 [INFO] OAuth for Spring Security .......................... SUCCESS [  1.125 s]
18-Jun-2019 00:01:04 [INFO] OAuth 1(a) for Spring Security ..................... SUCCESS [  9.043 s]
18-Jun-2019 00:01:04 [INFO] OAuth2 for Spring Security ......................... FAILURE [ 32.115 s]
18-Jun-2019 00:01:04 [INFO] spring-oauth2-tests ................................ SKIPPED
18-Jun-2019 00:01:04 [INFO] spring-oauth2-tests-common ......................... SKIPPED
18-Jun-2019 00:01:04 [INFO] spring-oauth2-tests-vanilla ........................ SKIPPED
18-Jun-2019 00:01:04 [INFO] spring-oauth2-tests-mappings ....................... SKIPPED
18-Jun-2019 00:01:04 [INFO] spring-oauth2-tests-form ........................... SKIPPED
18-Jun-2019 00:01:04 [INFO] spring-oauth2-tests-jwt ............................ SKIPPED
18-Jun-2019 00:01:04 [INFO] spring-oauth2-tests-approval ....................... SKIPPED
18-Jun-2019 00:01:04 [INFO] spring-oauth2-tests-jdbc ........................... SKIPPED
18-Jun-2019 00:01:04 [INFO] spring-oauth2-tests-jpa ............................ SKIPPED
18-Jun-2019 00:01:04 [INFO] spring-oauth2-tests-jaxb ........................... SKIPPED
18-Jun-2019 00:01:04 [INFO] spring-oauth-tests-custom-grant .................... SKIPPED
18-Jun-2019 00:01:04 [INFO] spring-oauth2-tests-multi .......................... SKIPPED
18-Jun-2019 00:01:04 [INFO] spring-oauth2-tests-client ......................... SKIPPED
18-Jun-2019 00:01:04 [INFO] spring-oauth2-tests-resource ....................... SKIPPED
18-Jun-2019 00:01:04 [INFO] spring-oauth2-tests-custom-authentication .......... SKIPPED
18-Jun-2019 00:01:04 [INFO] spring-oauth2-tests-xml ............................ SKIPPED
18-Jun-2019 00:01:04 [INFO] spring-oauth2-tests-xml-common ..................... SKIPPED
18-Jun-2019 00:01:04 [INFO] spring-oauth2-tests-xml-vanilla .................... SKIPPED
18-Jun-2019 00:01:04 [INFO] spring-oauth2-tests-xml-mappings ................... SKIPPED
18-Jun-2019 00:01:04 [INFO] spring-oauth2-tests-xml-form ....................... SKIPPED
18-Jun-2019 00:01:04 [INFO] spring-oauth2-tests-xml-jwt ........................ SKIPPED
18-Jun-2019 00:01:04 [INFO] spring-oauth2-tests-xml-approval ................... SKIPPED
18-Jun-2019 00:01:04 [INFO] spring-oauth2-tests-xml-jdbc ....................... SKIPPED
18-Jun-2019 00:01:04 [INFO] spring-oauth2-tests-xml-client ..................... SKIPPED
18-Jun-2019 00:01:04 [INFO] OAuth for Spring Security - Integration Tests ...... SKIPPED
18-Jun-2019 00:01:04 [INFO] OAuth for Spring Security - Sparklr (OAuth 1 Provider Example) SKIPPED
18-Jun-2019 00:01:04 [INFO] OAuth for Spring Security - Tonr (OAuth 1 Consumer Example) SKIPPED
18-Jun-2019 00:01:04 [INFO] OAuth for Spring Security - Sparklr2 (OAuth 2 Provider Example) SKIPPED
18-Jun-2019 00:01:04 [INFO] OAuth for Spring Security - Tonr2 (OAuth 2 Client Example) SKIPPED
18-Jun-2019 00:01:04 [INFO] OAuth for Spring Security - Samples ................ SKIPPED
18-Jun-2019 00:01:04 [INFO] ------------------------------------------------------------------------
18-Jun-2019 00:01:04 [INFO] BUILD FAILURE
18-Jun-2019 00:01:04 [INFO] ------------------------------------------------------------------------
18-Jun-2019 00:01:04 [INFO] Total time: 45.694 s
18-Jun-2019 00:01:04 [INFO] Finished at: 2019-06-18T00:01:04+00:00
18-Jun-2019 00:01:04 [INFO] Final Memory: 75M/527M
18-Jun-2019 00:01:04 [INFO] ------------------------------------------------------------------------
18-Jun-2019 00:01:04 [ERROR] Failed to execute goal org.apache.maven.plugins:maven-surefire-plugin:2.12.4:test (default-test) on project spring-security-oauth2: Execution default-test of goal org.apache.maven.plugins:maven-surefire-plugin:2.12.4:test failed: The forked VM terminated without saying properly goodbye. VM crash or System.exit called ? -> [Help 1]
18-Jun-2019 00:01:04 [ERROR]
18-Jun-2019 00:01:04 [ERROR] To see the full stack trace of the errors, re-run Maven with the -e switch.
18-Jun-2019 00:01:04 [ERROR] Re-run Maven using the -X switch to enable full debug logging.
18-Jun-2019 00:01:04 [ERROR]
18-Jun-2019 00:01:04 [ERROR] For more information about the errors and possible solutions, please read the following articles:
18-Jun-2019 00:01:04 [ERROR] [Help 1] http://cwiki.apache.org/confluence/display/MAVEN/PluginExecutionException
18-Jun-2019 00:01:04 [ERROR]
18-Jun-2019 00:01:04 [ERROR] After correcting the problems, you can resume the build with the command
18-Jun-2019 00:01:04 [ERROR]   mvn <goals> -rf :spring-security-oauth2
18-Jun-2019 00:01:04 Exception in thread "main"
18-Jun-2019 00:01:04
18-Jun-2019 00:01:04 Failing task since return code of [/opt/jdk-7/bin/java -cp /opt/maven-3.3/boot/plexus-classworlds-2.5.2.jar -Dclassworlds.conf=/tmp/artifactoryM28687311601259028024conf -DbuildInfoConfig.propertiesFile=/tmp/buildInfo8947943706275780365.properties -Xmx1256m -Xms128m -Dmaven.home=/opt/maven-3.3 -Dmaven.multiModuleProjectDirectory=/opt/bamboo-home/xml-data/build-dir/SECOAUTH-NIGHTLY-JOB1 org.codehaus.plexus.classworlds.launcher.Launcher clean install -P bootstrap -Dartifactory.publish.password=********] was 1 while expected 0
18-Jun-2019 00:01:04 Finished task 'Artifactory Maven 3' with result: Failed
18-Jun-2019 00:01:04 Running post build plugin 'Docker Container Cleanup'
18-Jun-2019 00:01:04 Running post build plugin 'NCover Results Collector'
18-Jun-2019 00:01:04 Running post build plugin 'Artifactory Release Management Staging'
18-Jun-2019 00:01:04 Running post build plugin 'Artifactory Build Info Copier'
18-Jun-2019 00:01:04 Running post build plugin 'Artifactory Gradle Properties Info Copier'
18-Jun-2019 00:01:04 Running post build plugin 'Clover Results Collector'
18-Jun-2019 00:01:04 Running post build plugin 'npm Cache Cleanup'
18-Jun-2019 00:01:04 Running post build plugin 'Artifact Copier'
18-Jun-2019 00:01:04 Successfully removed working directory at '/opt/bamboo-home/xml-data/build-dir/SECOAUTH-NIGHTLY-JOB1'
18-Jun-2019 00:01:04 Finalising the build...
18-Jun-2019 00:01:04 Stopping timer.
18-Jun-2019 00:01:04 Build SECOAUTH-NIGHTLY-JOB1-1678 completed.
18-Jun-2019 00:01:04 Running on server: post build plugin 'NCover Results Collector'
18-Jun-2019 00:01:04 Running on server: post build plugin 'Build Hanging Detection Configuration'
18-Jun-2019 00:01:04 Running on server: post build plugin 'Clover Delta Calculator'
18-Jun-2019 00:01:04 Running on server: post build plugin 'Maven Dependencies Postprocessor'
18-Jun-2019 00:01:04 All post build plugins have finished
18-Jun-2019 00:01:04 Generating build results summary...
18-Jun-2019 00:01:04 Saving build results to disk...
18-Jun-2019 00:01:04 Logging substituted variables...
18-Jun-2019 00:01:04 Indexing build results...
18-Jun-2019 00:01:04 Finished building SECOAUTH-NIGHTLY-JOB1-1678.