Build: #1681 failed

Job: Default Job failed

Stages & jobs

  1. Default Stage

Build log

The build generated 548 lines of output. Download or view full build log

21-Jun-2019 00:00:03 Build Spring Security OAuth - 2.1.x - Default Job #1681 (SECOAUTH-NIGHTLY-JOB1-1681) started building on agent bamboo-24.af.pivotal.io
21-Jun-2019 00:00:03 Remote agent on host bamboo-24.af.pivotal.io
21-Jun-2019 00:00:04 Build working directory is /opt/bamboo-home/xml-data/build-dir/SECOAUTH-NIGHTLY-JOB1
21-Jun-2019 00:00:04 Executing build Spring Security OAuth - 2.1.x - Default Job #1681 (SECOAUTH-NIGHTLY-JOB1-1681)
21-Jun-2019 00:00:04 Starting task 'Checkout Default Repository' of type 'com.atlassian.bamboo.plugins.vcs:task.vcs.checkout'
21-Jun-2019 00:00:04 Build always requires a clean checkout
21-Jun-2019 00:00:04 Cleaning build directory '/opt/bamboo-home/xml-data/build-dir/SECOAUTH-NIGHTLY-JOB1'
21-Jun-2019 00:00:04 Checking out into /opt/bamboo-home/xml-data/build-dir/SECOAUTH-NIGHTLY-JOB1
21-Jun-2019 00:00:04 Updating source code to revision: 3d37444a991104dd7f23edb2812e9f57620a1395
21-Jun-2019 00:00:04 Creating local git repository in '/opt/bamboo-home/xml-data/build-dir/SECOAUTH-NIGHTLY-JOB1/.git'.
21-Jun-2019 00:00:04 Initialized empty Git repository in /opt/bamboo-home/xml-data/build-dir/SECOAUTH-NIGHTLY-JOB1/.git/
21-Jun-2019 00:00:05 Fetching 'refs/heads/master' from 'git://github.com/SpringSource/spring-security-oauth.git'. Will try to do a shallow fetch.
21-Jun-2019 00:00:09 From git://github.com/SpringSource/spring-security-oauth
21-Jun-2019 00:00:09 * [new branch]      master     -> master
21-Jun-2019 00:00:09 Checking out revision 3d37444a991104dd7f23edb2812e9f57620a1395.
21-Jun-2019 00:00:10 Already on 'master'
21-Jun-2019 00:00:10 Updated source code to revision: 3d37444a991104dd7f23edb2812e9f57620a1395
21-Jun-2019 00:00:10 Finished task 'Checkout Default Repository' with result: Success
21-Jun-2019 00:00:10 Running pre-build action: Artifactory Release Staging
21-Jun-2019 00:00:10 Running pre-build action: VCS Version Collector
21-Jun-2019 00:00:10 Skipping execution of task 'Build' as it is disabled
21-Jun-2019 00:00:10 Starting task 'Artifactory Maven 3' of type 'org.jfrog.bamboo.bamboo-artifactory-plugin:maven3Task'
21-Jun-2019 00:00:10 Bamboo Artifactory Plugin version: 2.6.3
21-Jun-2019 00:00:10
Beginning to execute external process for build 'Spring Security OAuth - 2.1.x - Default Job #1681 (SECOAUTH-NIGHTLY-JOB1-1681)'
... running command line:
/opt/jdk-7/bin/java -cp /opt/maven-3.3/boot/plexus-classworlds-2.5.2.jar -Dclassworlds.conf=/tmp/artifactoryM28022751953194497373conf -DbuildInfoConfig.propertiesFile=/tmp/buildInfo46643617610358046.properties -Xmx1256m -Xms128m -Dmaven.home=/opt/maven-3.3 -Dmaven.multiModuleProjectDirectory=/opt/bamboo-home/xml-data/build-dir/SECOAUTH-NIGHTLY-JOB1 org.codehaus.plexus.classworlds.launcher.Launcher clean install -P bootstrap -Dartifactory.publish.password=********
... in: /opt/bamboo-home/xml-data/build-dir/SECOAUTH-NIGHTLY-JOB1
... using extra environment variables:
bamboo_planRepository_1_branch=master
bamboo_repository_94273667_previous_revision_number=3d37444a991104dd7f23edb2812e9f57620a1395
bamboo_********_username_password=********
bamboo_signing_store_password=********
bamboo_capability_system_builder_ant_Ant_1_9=/opt/ant-1.9
bamboo_capability_system_builder_ant_Ant_1_8=/opt/ant-1.8
bamboo_planRepository_1_branchDisplayName=master
bamboo_artifactory_override_resolve_repo=libs-milestone
bamboo_capability_system_builder_node_Node_js_10_16=/opt/node-10.16/bin/node
bamboo_repository_revision_number=3d37444a991104dd7f23edb2812e9f57620a1395
bamboo_RIAK_BIN=/usr/sbin/riak
bamboo_repository_94273667_revision_number=3d37444a991104dd7f23edb2812e9f57620a1395
WRAPPER_BITS=32
bamboo_buildKey=SECOAUTH-NIGHTLY-JOB1
bamboo_repository_94273667_git_branch=master
bamboo_bintray_password=********
bamboo_sonar_token_password=********
PWD=/opt/bamboo-home/bin
bamboo_shortJobName=Default Job
bamboo_artifactory_override_resolver_password=********
bamboo_sonatype_token=RSJChaox
bamboo_capability_system_builder_gradle___gradlew=./gradlew
bamboo_buildResultsUrl=https://build.spring.io/browse/SECOAUTH-NIGHTLY-JOB1-1681
bamboo_capability_system_builder_mvn3_Maven_3_3=/opt/maven-3.3
bamboo_capability_system_builder_mvn3_Maven_3_2=/opt/maven-3.2
bamboo_capability_system_builder_mvn3_Maven_3_1=/opt/maven-3.1
bamboo_planRepository_repositoryUrl=git://github.com/SpringSource/spring-security-oauth.git
bamboo_capability_system_builder_mvn3_Maven_3_6=/opt/maven-3.6
bamboo_agentId=284196868
bamboo_capability_system_builder_mvn3_Maven_3_5=/opt/maven-3.5
bamboo_capability_system_builder_mvn3_Maven_3_0=/opt/maven-3.0
bamboo_planRepository_revision=3d37444a991104dd7f23edb2812e9f57620a1395
bamboo_planRepository_previousRevision=3d37444a991104dd7f23edb2812e9f57620a1395
bamboo_capability_remote_build=true
bamboo_repository_branch_name=master
bamboo_sonatype_token_password=********
bamboo_sonatype_user=springsource
SHLVL=1
bamboo_org_jfrog_bamboo_buildInfo_serverUrl=https://repo.spring.io
bamboo_scdf_acceptance_tests_password=********
bamboo_repository_94273667_branch_name=master
WRAPPER_OS=linux
TERM=linux
XDG_SESSION_ID=c1
bamboo_planRepository_branch=master
bamboo_org_jfrog_bamboo_release_activated=false
bamboo_planRepository_1_type=gitv2
bamboo_planRepository_branchName=master
bamboo_capability_system_jdk_JDK_12=/opt/jdk-12
WRAPPER_FILE_SEPARATOR=/
_=/opt/bamboo-home/bin/bamboo-agent.sh
bamboo_capability_system_builder_ant_Ant_1_10=/opt/ant-1.10
bamboo_repository_94273667_name=Plan Repository
WRAPPER_PATH_SEPARATOR=:
bamboo_sonar_password=********
bamboo_hg_cache_directory=/opt/bamboo-home/xml-data/build-dir/_hg-repositories-cache
bamboo_planRepository_1_username=
bamboo_planRepository_type=gitv2
bamboo_git_cache_directory=/opt/bamboo-home/xml-data/build-dir/_git-repositories-cache
bamboo_artifactory_username=buildmaster
bamboo_tmp_directory=/opt/bamboo-home/temp
bamboo_planKey=SECOAUTH-NIGHTLY
bamboo_planRepository_username=
bamboo_JDK8_HOME=/opt/jdk-8
bamboo_repository_94273667_git_username=
bamboo_planRepository_1_branchName=master
bamboo_sonar_version=5.6.3
bamboo_sonar_jdbc_password=********
bamboo_bintray_api_key_password=********
XDG_DATA_DIRS=/usr/local/share:/usr/share:/var/lib/snapd/desktop
bamboo_capability_system_jdk_JDK_1_11=/opt/jdk-11
bamboo_resultsUrl=https://build.spring.io/browse/SECOAUTH-NIGHTLY-JOB1-1681
bamboo_capability_system_jdk_JDK_1_10=/opt/jdk-10
bamboo_build_working_directory=/opt/bamboo-home/xml-data/build-dir/SECOAUTH-NIGHTLY-JOB1
bamboo_planRepository_1_name=Plan Repository
bamboo_capability_system_os=ubuntu1804
bamboo_nexusPush_stagingProfile=buildmaster
bamboo_shortPlanName=2.1.x
MAIL=/var/mail/bamboo
bamboo_planRepository_name=Plan Repository
LOGNAME=bamboo
bamboo_buildNumber=1681
SHELL=/bin/bash
bamboo_planName=Spring Security OAuth - 2.1.x
bamboo_JDK7_HOME=/opt/jdk-7
bamboo_repository_94273667_git_repositoryUrl=git://github.com/SpringSource/spring-security-oauth.git
bamboo_shortPlanKey=NIGHTLY
OLDPWD=/opt/users/bamboo
bamboo_shortJobKey=JOB1
bamboo_artifactory_password=********
bamboo_buildTimeStamp=2019-06-21T00:00:05.910Z
bamboo_repository_previous_revision_number=3d37444a991104dd7f23edb2812e9f57620a1395
bamboo_sonar_username=buildmaster
bamboo_********_password=********
bamboo_repository_git_branch=master
bamboo_buildResultKey=SECOAUTH-NIGHTLY-JOB1-1681
bamboo_nexusPush_close=true
bamboo_artifactory_override_resolver_username=buildmaster
bamboo_buildPlanName=Spring Security OAuth - 2.1.x - Default Job
bamboo_planRepository_1_revision=3d37444a991104dd7f23edb2812e9f57620a1395
bamboo_repository_name=Plan Repository
bamboo_signing_key_password=********
bamboo_capability_system_builder_groovy_Groovy_2_5=/opt/groovy-2.5
LANG=en_US.UTF-8
bamboo_buildFailed=false
bamboo_capability_system_docker_executable=/usr/bin/docker
DISPLAY=localhost:1.0
bamboo_capability_system_jdk_OpenJDK_7=/opt/jdk-7
bamboo_capability_system_builder_groovy_Groovy_2_4=/opt/groovy-2.4
bamboo_artifactory_override_deployer_username=buildmaster
bamboo_capability_system_builder_command_Bash=/bin/bash
bamboo_artifactory_password_mask_a=********
bamboo_agentWorkingDirectory=/opt/bamboo-home/xml-data/build-dir
bamboo_capability_system_git_executable=/usr/bin/git
bamboo_repository_git_username=
bamboo_planRepository_1_previousRevision=3d37444a991104dd7f23edb2812e9f57620a1395
bamboo_capability_os_family=unix
bamboo_planRepository_branchDisplayName=master
bamboo_capability_system_builder_maven_Artifactory_Maven_3_6=/opt/maven-3.6
bamboo_capability_system_builder_maven_Artifactory_Maven_3_5=/opt/maven-3.5
GIT_SSL_NO_VERIFY=true
bamboo_capability_system_builder_maven_Artifactory_Maven_3_3=/opt/maven-3.3
bamboo_capability_system_builder_maven_Artifactory_Maven_3_2=/opt/maven-3.2
bamboo_s3_properties=/home/bamboo/tools/s3.properties
bamboo_capability_system_builder_maven_Artifactory_Maven_3_1=/opt/maven-3.1
bamboo_artifactory_override_deploy_repo=libs-snapshot-local
bamboo_capability_system_builder_maven_Artifactory_Maven_3_0=/opt/maven-3.0
bamboo_plan_storageTag=SECOAUTH-NIGHTLY
bamboo_bintray_username_password=********
USER=bamboo
bamboo_repository_git_repositoryUrl=git://github.com/SpringSource/spring-security-oauth.git
bamboo_working_directory=/opt/bamboo-home/xml-data/build-dir/SECOAUTH-NIGHTLY-JOB1
bamboo_org_jfrog_bamboo_buildInfo_activated=true
bamboo_planRepository_1_repositoryUrl=git://github.com/SpringSource/spring-security-oauth.git
bamboo_capability_system_jdk_JDK_1_8=/opt/jdk-8
bamboo_artifactory_override_deployer_password=********
bamboo_capability_system_jdk_JDK_1_9=/opt/jdk-9
WRAPPER_ARCH=x86
bamboo_capability_system_jdk_JDK_1_6=/opt/jdk-6
bamboo_sonatype_password=********
bamboo_capability_system_jdk_JDK_1_7=/opt/jdk-7
bamboo_sonar_ip=10.194.6.9
XDG_RUNTIME_DIR=/run/user/1002
HOME=/home/bamboo
PATH=/bin:/home/bamboo/bin:/usr/local/sbin:/usr/local/bin:/usr/sbin:/usr/bin:/sbin:/bin:/usr/games:/usr/local/games:/snap/bin:/home/bamboo/bin:/usr/local/bin:/bin:/home/bamboo/bin:/usr/local/sbin:/usr/local/bin:/usr/sbin:/usr/bin:/sbin:/bin:/usr/games:/usr/local/games:/snap/bin:/home/bamboo/bin:/usr/local/bin
21-Jun-2019 00:00:11 [INFO] Scanning for projects...
21-Jun-2019 00:00:13 [INFO] Initializing Artifactory Build-Info Recording
21-Jun-2019 00:00:13 [INFO] ------------------------------------------------------------------------
21-Jun-2019 00:00:13 [INFO] Reactor Build Order:
21-Jun-2019 00:00:13 [INFO]
21-Jun-2019 00:00:13 [INFO] OAuth for Spring Security
21-Jun-2019 00:00:13 [INFO] OAuth 1(a) for Spring Security
21-Jun-2019 00:00:13 [INFO] OAuth2 for Spring Security
21-Jun-2019 00:00:13 [INFO] spring-oauth2-tests
21-Jun-2019 00:00:13 [INFO] spring-oauth2-tests-common
21-Jun-2019 00:00:13 [INFO] spring-oauth2-tests-vanilla
21-Jun-2019 00:00:13 [INFO] spring-oauth2-tests-mappings
21-Jun-2019 00:00:13 [INFO] spring-oauth2-tests-form
21-Jun-2019 00:00:13 [INFO] spring-oauth2-tests-jwt
21-Jun-2019 00:00:13 [INFO] spring-oauth2-tests-approval
21-Jun-2019 00:00:13 [INFO] spring-oauth2-tests-jdbc
21-Jun-2019 00:00:13 [INFO] spring-oauth2-tests-jpa
21-Jun-2019 00:00:13 [INFO] spring-oauth2-tests-jaxb
21-Jun-2019 00:00:13 [INFO] spring-oauth-tests-custom-grant
21-Jun-2019 00:00:13 [INFO] spring-oauth2-tests-multi
21-Jun-2019 00:00:13 [INFO] spring-oauth2-tests-client
21-Jun-2019 00:00:13 [INFO] spring-oauth2-tests-resource
21-Jun-2019 00:00:13 [INFO] spring-oauth2-tests-custom-authentication
21-Jun-2019 00:00:13 [INFO] spring-oauth2-tests-xml
21-Jun-2019 00:00:13 [INFO] spring-oauth2-tests-xml-common
21-Jun-2019 00:00:13 [INFO] spring-oauth2-tests-xml-vanilla
21-Jun-2019 00:00:13 [INFO] spring-oauth2-tests-xml-mappings
21-Jun-2019 00:00:13 [INFO] spring-oauth2-tests-xml-form
21-Jun-2019 00:00:13 [INFO] spring-oauth2-tests-xml-jwt
21-Jun-2019 00:00:13 [INFO] spring-oauth2-tests-xml-approval
21-Jun-2019 00:00:13 [INFO] spring-oauth2-tests-xml-jdbc
21-Jun-2019 00:00:13 [INFO] spring-oauth2-tests-xml-client
21-Jun-2019 00:00:13 [INFO] OAuth for Spring Security - Integration Tests
21-Jun-2019 00:00:13 [INFO] OAuth for Spring Security - Sparklr (OAuth 1 Provider Example)
21-Jun-2019 00:00:13 [INFO] OAuth for Spring Security - Tonr (OAuth 1 Consumer Example)
21-Jun-2019 00:00:13 [INFO] OAuth for Spring Security - Sparklr2 (OAuth 2 Provider Example)
21-Jun-2019 00:00:13 [INFO] OAuth for Spring Security - Tonr2 (OAuth 2 Client Example)
21-Jun-2019 00:00:13 [INFO] OAuth for Spring Security - Samples
21-Jun-2019 00:00:13 [INFO]                                                                         
21-Jun-2019 00:00:13 [INFO] ------------------------------------------------------------------------
21-Jun-2019 00:00:13 [INFO] Building OAuth for Spring Security 2.3.7.BUILD-SNAPSHOT
21-Jun-2019 00:00:13 [INFO] ------------------------------------------------------------------------
21-Jun-2019 00:00:13 [INFO]
21-Jun-2019 00:00:13 [INFO] --- maven-clean-plugin:2.5:clean (default-clean) @ spring-security-oauth-parent ---
21-Jun-2019 00:00:13 [INFO]
21-Jun-2019 00:00:13 [INFO] >>> maven-source-plugin:2.1.2:jar (attach-sources) > generate-sources @ spring-security-oauth-parent >>>
21-Jun-2019 00:00:13 [INFO]
21-Jun-2019 00:00:13 [INFO] <<< maven-source-plugin:2.1.2:jar (attach-sources) < generate-sources @ spring-security-oauth-parent <<<
21-Jun-2019 00:00:13 [INFO]
21-Jun-2019 00:00:13 [INFO] --- maven-source-plugin:2.1.2:jar (attach-sources) @ spring-security-oauth-parent ---
21-Jun-2019 00:00:13 [INFO]
21-Jun-2019 00:00:13 [INFO] --- maven-javadoc-plugin:2.9.1:jar (javadoc) @ spring-security-oauth-parent ---
21-Jun-2019 00:00:14 [INFO] Not executing Javadoc as the project is not a Java classpath-capable package
21-Jun-2019 00:00:14 [INFO]
21-Jun-2019 00:00:14 [INFO] --- maven-install-plugin:2.4:install (default-install) @ spring-security-oauth-parent ---
21-Jun-2019 00:00:14 [INFO] Installing /opt/bamboo-home/xml-data/build-dir/SECOAUTH-NIGHTLY-JOB1/pom.xml to /home/bamboo/.m2/repository/org/springframework/security/oauth/spring-security-oauth-parent/2.3.7.BUILD-SNAPSHOT/spring-security-oauth-parent-2.3.7.BUILD-SNAPSHOT.pom
21-Jun-2019 00:00:14 [INFO]                                                                         
21-Jun-2019 00:00:14 [INFO] ------------------------------------------------------------------------
21-Jun-2019 00:00:14 [INFO] Building OAuth 1(a) for Spring Security 2.3.7.BUILD-SNAPSHOT
21-Jun-2019 00:00:14 [INFO] ------------------------------------------------------------------------
21-Jun-2019 00:00:14 [INFO]
21-Jun-2019 00:00:14 [INFO] --- maven-clean-plugin:2.5:clean (default-clean) @ spring-security-oauth ---
21-Jun-2019 00:00:14 [INFO]
21-Jun-2019 00:00:14 [INFO] --- maven-resources-plugin:2.6:resources (default-resources) @ spring-security-oauth ---
21-Jun-2019 00:00:14 [INFO] Using 'UTF-8' encoding to copy filtered resources.
21-Jun-2019 00:00:14 [INFO] Copying 3 resources
21-Jun-2019 00:00:14 [INFO]
21-Jun-2019 00:00:14 [INFO] --- maven-compiler-plugin:2.3.2:compile (default-compile) @ spring-security-oauth ---
21-Jun-2019 00:00:14 [INFO] Compiling 108 source files to /opt/bamboo-home/xml-data/build-dir/SECOAUTH-NIGHTLY-JOB1/spring-security-oauth/target/classes
21-Jun-2019 00:00:15 [WARNING] /opt/bamboo-home/xml-data/build-dir/SECOAUTH-NIGHTLY-JOB1/spring-security-oauth/src/main/java/org/springframework/security/oauth/consumer/net/OAuthOverHttpsURLStreamHandler.java:[36,78] Handler is internal proprietary API and may be removed in a future release
21-Jun-2019 00:00:15 [WARNING] /opt/bamboo-home/xml-data/build-dir/SECOAUTH-NIGHTLY-JOB1/spring-security-oauth/src/main/java/org/springframework/security/oauth/consumer/net/OAuthOverHttpURLStreamHandler.java:[36,76] Handler is internal proprietary API and may be removed in a future release
21-Jun-2019 00:00:15 [INFO]
21-Jun-2019 00:00:15 [INFO] --- maven-resources-plugin:2.6:testResources (default-testResources) @ spring-security-oauth ---
21-Jun-2019 00:00:15 [INFO] Using 'UTF-8' encoding to copy filtered resources.
21-Jun-2019 00:00:15 [INFO] Copying 8 resources
21-Jun-2019 00:00:15 [INFO]
21-Jun-2019 00:00:15 [INFO] --- maven-compiler-plugin:2.3.2:testCompile (default-testCompile) @ spring-security-oauth ---
21-Jun-2019 00:00:15 [INFO] Compiling 22 source files to /opt/bamboo-home/xml-data/build-dir/SECOAUTH-NIGHTLY-JOB1/spring-security-oauth/target/test-classes
21-Jun-2019 00:00:16 [WARNING] /opt/bamboo-home/xml-data/build-dir/SECOAUTH-NIGHTLY-JOB1/spring-security-oauth/src/test/java/org/springframework/security/oauth/consumer/client/CoreOAuthConsumerSupportTests.java:[65,32] Handler is internal proprietary API and may be removed in a future release
21-Jun-2019 00:00:16 [WARNING] /opt/bamboo-home/xml-data/build-dir/SECOAUTH-NIGHTLY-JOB1/spring-security-oauth/src/test/java/org/springframework/security/oauth/consumer/client/CoreOAuthConsumerSupportTests.java:[483,54] Handler is internal proprietary API and may be removed in a future release
21-Jun-2019 00:00:16 [INFO]
21-Jun-2019 00:00:16 [INFO] --- maven-surefire-plugin:2.12.4:test (default-test) @ spring-security-oauth ---
21-Jun-2019 00:00:16 [INFO] Surefire report directory: /opt/bamboo-home/xml-data/build-dir/SECOAUTH-NIGHTLY-JOB1/spring-security-oauth/target/surefire-reports
21-Jun-2019 00:00:16
21-Jun-2019 00:00:16 -------------------------------------------------------
21-Jun-2019 00:00:16 T E S T S
21-Jun-2019 00:00:16 -------------------------------------------------------
21-Jun-2019 00:00:17 Running org.springframework.security.oauth.config.FilterChainInitializationTests
21-Jun-2019 00:00:18 Tests run: 1, Failures: 0, Errors: 0, Skipped: 0, Time elapsed: 1.031 sec
21-Jun-2019 00:00:18 Running org.springframework.security.oauth.config.AuthorizationServerBeanDefinitionParserTests
21-Jun-2019 00:00:18 Tests run: 2, Failures: 0, Errors: 0, Skipped: 0, Time elapsed: 0.358 sec
21-Jun-2019 00:00:18 Running org.springframework.security.oauth.config.ConsumerServiceBeanDefinitionParserTests
21-Jun-2019 00:00:18 Tests run: 2, Failures: 0, Errors: 0, Skipped: 0, Time elapsed: 0.272 sec
21-Jun-2019 00:00:18 Running org.springframework.security.oauth.provider.nonce.InMemoryNonceServicesTests
21-Jun-2019 00:00:18 Tests run: 5, Failures: 0, Errors: 0, Skipped: 0, Time elapsed: 0.003 sec
21-Jun-2019 00:00:18 Running org.springframework.security.oauth.provider.filter.ProtectedResourceProcessingFilterTests
21-Jun-2019 00:00:18 Tests run: 1, Failures: 0, Errors: 0, Skipped: 0, Time elapsed: 0.142 sec
21-Jun-2019 00:00:18 Running org.springframework.security.oauth.provider.filter.OAuthProcessingFilterTests
21-Jun-2019 00:00:18 Tests run: 3, Failures: 0, Errors: 0, Skipped: 0, Time elapsed: 0.049 sec
21-Jun-2019 00:00:18 Running org.springframework.security.oauth.provider.filter.OAuthUserAuthorizationProcessingFilterTests
21-Jun-2019 00:00:19 Tests run: 1, Failures: 0, Errors: 0, Skipped: 0, Time elapsed: 0.004 sec
21-Jun-2019 00:00:19 Running org.springframework.security.oauth.provider.filter.UserAuthorizationSuccessfulAuthenticationHandlerTests
21-Jun-2019 00:00:19 Tests run: 1, Failures: 0, Errors: 0, Skipped: 0, Time elapsed: 0.003 sec
21-Jun-2019 00:00:19 Running org.springframework.security.oauth.provider.filter.AccessTokenProcessingFilterTests
21-Jun-2019 00:00:19 Tests run: 2, Failures: 0, Errors: 0, Skipped: 0, Time elapsed: 0.002 sec
21-Jun-2019 00:00:19 Running org.springframework.security.oauth.provider.filter.UnauthenticatedRequestTokenProcessingFilterTests
21-Jun-2019 00:00:19 Tests run: 2, Failures: 0, Errors: 0, Skipped: 0, Time elapsed: 0.004 sec
21-Jun-2019 00:00:19 Running org.springframework.security.oauth.provider.CoreOAuthProviderSupportTests
21-Jun-2019 00:00:19 Tests run: 2, Failures: 0, Errors: 0, Skipped: 0, Time elapsed: 0.004 sec
21-Jun-2019 00:00:19 Running org.springframework.security.oauth.common.signature.PlainTextSignatureMethodTests
21-Jun-2019 00:00:19 Tests run: 1, Failures: 0, Errors: 0, Skipped: 0, Time elapsed: 0.001 sec
21-Jun-2019 00:00:19 Running org.springframework.security.oauth.common.signature.CoreOAuthSignatureMethodFactoryTests
21-Jun-2019 00:00:19 Tests run: 1, Failures: 0, Errors: 0, Skipped: 0, Time elapsed: 0.211 sec
21-Jun-2019 00:00:19 Running org.springframework.security.oauth.common.signature.RSA_SHA1SignatureMethodTests
21-Jun-2019 00:00:19 Tests run: 2, Failures: 0, Errors: 0, Skipped: 0, Time elapsed: 0.069 sec
21-Jun-2019 00:00:19 Running org.springframework.security.oauth.common.signature.HMAC_SHA1SignatureMethodTests
21-Jun-2019 00:00:19 Tests run: 3, Failures: 0, Errors: 0, Skipped: 0, Time elapsed: 0.028 sec
21-Jun-2019 00:00:19 Running org.springframework.security.oauth.common.OAuthCodecTests
21-Jun-2019 00:00:19 Tests run: 1, Failures: 0, Errors: 0, Skipped: 0, Time elapsed: 0 sec
21-Jun-2019 00:00:19 Running org.springframework.security.oauth.consumer.client.CoreOAuthConsumerSupportTests
21-Jun-2019 00:00:19 Tests run: 10, Failures: 0, Errors: 0, Skipped: 0, Time elapsed: 0.023 sec
21-Jun-2019 00:00:19 Running org.springframework.security.oauth.consumer.client.OAuthRestTemplateTests
21-Jun-2019 00:00:19 Tests run: 2, Failures: 0, Errors: 0, Skipped: 0, Time elapsed: 0.126 sec
21-Jun-2019 00:00:19 Running org.springframework.security.oauth.consumer.GoogleOAuthTests
21-Jun-2019 00:00:19 Tests run: 1, Failures: 0, Errors: 0, Skipped: 0, Time elapsed: 0.004 sec
21-Jun-2019 00:00:19 Running org.springframework.security.oauth.consumer.filter.OAuthConsumerContextFilterTests
21-Jun-2019 00:00:19 Tests run: 2, Failures: 0, Errors: 0, Skipped: 0, Time elapsed: 0.016 sec
21-Jun-2019 00:00:19 Running org.springframework.security.oauth.consumer.rememberme.HttpSessionOAuthRememberMeServicesTests
21-Jun-2019 00:00:19 Tests run: 4, Failures: 0, Errors: 0, Skipped: 0, Time elapsed: 0.009 sec
21-Jun-2019 00:00:19 Running net.oauth.signature.GoogleCodeCompatibilityTests
21-Jun-2019 00:00:19 Tests run: 2, Failures: 0, Errors: 0, Skipped: 0, Time elapsed: 0.014 sec
21-Jun-2019 00:00:19
21-Jun-2019 00:00:19 Results :
21-Jun-2019 00:00:19
21-Jun-2019 00:00:19 Tests run: 51, Failures: 0, Errors: 0, Skipped: 0
21-Jun-2019 00:00:19
21-Jun-2019 00:00:19 [INFO]
21-Jun-2019 00:00:19 [INFO] --- maven-jar-plugin:2.4:jar (default-jar) @ spring-security-oauth ---
21-Jun-2019 00:00:19 [INFO] Building jar: /opt/bamboo-home/xml-data/build-dir/SECOAUTH-NIGHTLY-JOB1/spring-security-oauth/target/spring-security-oauth-2.3.7.BUILD-SNAPSHOT.jar
21-Jun-2019 00:00:19 [INFO]
21-Jun-2019 00:00:19 [INFO] >>> maven-source-plugin:2.1.2:jar (attach-sources) > generate-sources @ spring-security-oauth >>>
21-Jun-2019 00:00:19 [INFO]
21-Jun-2019 00:00:19 [INFO] <<< maven-source-plugin:2.1.2:jar (attach-sources) < generate-sources @ spring-security-oauth <<<
21-Jun-2019 00:00:19 [INFO]
21-Jun-2019 00:00:19 [INFO] --- maven-source-plugin:2.1.2:jar (attach-sources) @ spring-security-oauth ---
21-Jun-2019 00:00:20 [INFO] org already added, skipping
21-Jun-2019 00:00:20 [INFO] org/springframework already added, skipping
21-Jun-2019 00:00:20 [INFO] org/springframework/security already added, skipping
21-Jun-2019 00:00:20 [INFO] org/springframework/security/oauth already added, skipping
21-Jun-2019 00:00:20 [INFO] Building jar: /opt/bamboo-home/xml-data/build-dir/SECOAUTH-NIGHTLY-JOB1/spring-security-oauth/target/spring-security-oauth-2.3.7.BUILD-SNAPSHOT-sources.jar
21-Jun-2019 00:00:20 [INFO] org already added, skipping
21-Jun-2019 00:00:20 [INFO] org/springframework already added, skipping
21-Jun-2019 00:00:20 [INFO] org/springframework/security already added, skipping
21-Jun-2019 00:00:20 [INFO] org/springframework/security/oauth already added, skipping
21-Jun-2019 00:00:20 [INFO]
21-Jun-2019 00:00:20 [INFO] --- maven-javadoc-plugin:2.9.1:jar (javadoc) @ spring-security-oauth ---
21-Jun-2019 00:00:23 [INFO]
21-Jun-2019 00:00:23 2 warnings
21-Jun-2019 00:00:23 [WARNING] Javadoc Warnings
21-Jun-2019 00:00:23 [WARNING] /opt/bamboo-home/xml-data/build-dir/SECOAUTH-NIGHTLY-JOB1/spring-security-oauth/src/main/java/org/springframework/security/oauth/consumer/net/OAuthOverHttpURLStreamHandler.java:36: warning: Handler is internal proprietary API and may be removed in a future release
21-Jun-2019 00:00:23 [WARNING] public class OAuthOverHttpURLStreamHandler extends sun.net.www.protocol.http.Handler {
21-Jun-2019 00:00:23 [WARNING] ^
21-Jun-2019 00:00:23 [WARNING] /opt/bamboo-home/xml-data/build-dir/SECOAUTH-NIGHTLY-JOB1/spring-security-oauth/src/main/java/org/springframework/security/oauth/consumer/net/OAuthOverHttpsURLStreamHandler.java:36: warning: Handler is internal proprietary API and may be removed in a future release
21-Jun-2019 00:00:23 [WARNING] public class OAuthOverHttpsURLStreamHandler extends sun.net.www.protocol.https.Handler {
21-Jun-2019 00:00:23 [WARNING] ^
21-Jun-2019 00:00:23 [INFO] Building jar: /opt/bamboo-home/xml-data/build-dir/SECOAUTH-NIGHTLY-JOB1/spring-security-oauth/target/spring-security-oauth-2.3.7.BUILD-SNAPSHOT-javadoc.jar
21-Jun-2019 00:00:23 [INFO]
21-Jun-2019 00:00:23 [INFO] --- maven-install-plugin:2.4:install (default-install) @ spring-security-oauth ---
21-Jun-2019 00:00:23 [INFO] Installing /opt/bamboo-home/xml-data/build-dir/SECOAUTH-NIGHTLY-JOB1/spring-security-oauth/target/spring-security-oauth-2.3.7.BUILD-SNAPSHOT.jar to /home/bamboo/.m2/repository/org/springframework/security/oauth/spring-security-oauth/2.3.7.BUILD-SNAPSHOT/spring-security-oauth-2.3.7.BUILD-SNAPSHOT.jar
21-Jun-2019 00:00:23 [INFO] Installing /opt/bamboo-home/xml-data/build-dir/SECOAUTH-NIGHTLY-JOB1/spring-security-oauth/pom.xml to /home/bamboo/.m2/repository/org/springframework/security/oauth/spring-security-oauth/2.3.7.BUILD-SNAPSHOT/spring-security-oauth-2.3.7.BUILD-SNAPSHOT.pom
21-Jun-2019 00:00:23 [INFO] Installing /opt/bamboo-home/xml-data/build-dir/SECOAUTH-NIGHTLY-JOB1/spring-security-oauth/target/spring-security-oauth-2.3.7.BUILD-SNAPSHOT-sources.jar to /home/bamboo/.m2/repository/org/springframework/security/oauth/spring-security-oauth/2.3.7.BUILD-SNAPSHOT/spring-security-oauth-2.3.7.BUILD-SNAPSHOT-sources.jar
21-Jun-2019 00:00:23 [INFO] Installing /opt/bamboo-home/xml-data/build-dir/SECOAUTH-NIGHTLY-JOB1/spring-security-oauth/target/spring-security-oauth-2.3.7.BUILD-SNAPSHOT-javadoc.jar to /home/bamboo/.m2/repository/org/springframework/security/oauth/spring-security-oauth/2.3.7.BUILD-SNAPSHOT/spring-security-oauth-2.3.7.BUILD-SNAPSHOT-javadoc.jar
21-Jun-2019 00:00:23 [INFO]                                                                         
21-Jun-2019 00:00:23 [INFO] ------------------------------------------------------------------------
21-Jun-2019 00:00:23 [INFO] Building OAuth2 for Spring Security 2.3.7.BUILD-SNAPSHOT
21-Jun-2019 00:00:23 [INFO] ------------------------------------------------------------------------
21-Jun-2019 00:00:23 [INFO]
21-Jun-2019 00:00:23 [INFO] --- maven-clean-plugin:2.5:clean (default-clean) @ spring-security-oauth2 ---
21-Jun-2019 00:00:23 [INFO]
21-Jun-2019 00:00:23 [INFO] --- maven-resources-plugin:2.6:resources (default-resources) @ spring-security-oauth2 ---
21-Jun-2019 00:00:23 [INFO] Using 'UTF-8' encoding to copy filtered resources.
21-Jun-2019 00:00:23 [INFO] Copying 4 resources
21-Jun-2019 00:00:23 [INFO]
21-Jun-2019 00:00:23 [INFO] --- maven-compiler-plugin:2.3.2:compile (default-compile) @ spring-security-oauth2 ---
21-Jun-2019 00:00:23 [INFO] Compiling 249 source files to /opt/bamboo-home/xml-data/build-dir/SECOAUTH-NIGHTLY-JOB1/spring-security-oauth2/target/classes
21-Jun-2019 00:00:26 [INFO]
21-Jun-2019 00:00:26 [INFO] --- maven-resources-plugin:2.6:testResources (default-testResources) @ spring-security-oauth2 ---
21-Jun-2019 00:00:26 [INFO] Using 'UTF-8' encoding to copy filtered resources.
21-Jun-2019 00:00:26 [INFO] Copying 21 resources
21-Jun-2019 00:00:26 [INFO]
21-Jun-2019 00:00:26 [INFO] --- maven-compiler-plugin:2.3.2:testCompile (default-testCompile) @ spring-security-oauth2 ---
21-Jun-2019 00:00:26 [INFO] Compiling 120 source files to /opt/bamboo-home/xml-data/build-dir/SECOAUTH-NIGHTLY-JOB1/spring-security-oauth2/target/test-classes
21-Jun-2019 00:00:28 [INFO]
21-Jun-2019 00:00:28 [INFO] --- maven-surefire-plugin:2.12.4:test (default-test) @ spring-security-oauth2 ---
21-Jun-2019 00:00:28 [INFO] Surefire report directory: /opt/bamboo-home/xml-data/build-dir/SECOAUTH-NIGHTLY-JOB1/spring-security-oauth2/target/surefire-reports
21-Jun-2019 00:00:28
21-Jun-2019 00:00:28 -------------------------------------------------------
21-Jun-2019 00:00:28 T E S T S
21-Jun-2019 00:00:28 -------------------------------------------------------
21-Jun-2019 00:00:29 Running org.springframework.security.oauth2.config.annotation.TokenServicesMultipleBeansTests
21-Jun-2019 00:00:30 Tests run: 1, Failures: 0, Errors: 0, Skipped: 0, Time elapsed: 1.455 sec
21-Jun-2019 00:00:30 Running org.springframework.security.oauth2.config.annotation.Gh501EnableAuthorizationServerTests
21-Jun-2019 00:00:31 Tests run: 1, Failures: 0, Errors: 0, Skipped: 0, Time elapsed: 0.689 sec
21-Jun-2019 00:00:31 Running org.springframework.security.oauth2.config.annotation.ClientConfigurationTests
21-Jun-2019 00:00:31 Tests run: 1, Failures: 0, Errors: 0, Skipped: 0, Time elapsed: 0.253 sec
21-Jun-2019 00:00:31 Running org.springframework.security.oauth2.config.annotation.ResourceServerConfigurationTests
21-Jun-2019 00:00:32 [WARN] TokenEndpoint - Handling error: InvalidRequestException, Missing grant type
21-Jun-2019 00:00:32 [WARN] PageNotFound - No mapping found for HTTP request with URI [/] in DispatcherServlet with name ''
21-Jun-2019 00:00:32 [WARN] PageNotFound - No mapping found for HTTP request with URI [/] in DispatcherServlet with name ''
21-Jun-2019 00:00:32 [WARN] PageNotFound - No mapping found for HTTP request with URI [/] in DispatcherServlet with name ''
21-Jun-2019 00:00:33 [WARN] PageNotFound - No mapping found for HTTP request with URI [/] in DispatcherServlet with name ''
21-Jun-2019 00:00:33 [WARN] TokenEndpoint - Handling error: InvalidRequestException, Missing grant type
21-Jun-2019 00:00:33 Tests run: 9, Failures: 0, Errors: 0, Skipped: 0, Time elapsed: 1.654 sec
21-Jun-2019 00:00:33 Running org.springframework.security.oauth2.config.annotation.AuthorizationServerConfigurationTests
21-Jun-2019 00:00:33 [WARN] AnnotationConfigWebApplicationContext - Exception encountered during context initialization - cancelling refresh attempt: org.springframework.beans.factory.UnsatisfiedDependencyException: Error creating bean with name 'org.springframework.security.config.annotation.web.configuration.WebSecurityConfiguration': Unsatisfied dependency expressed through method 'setFilterChainProxySecurityConfigurer' parameter 1; nested exception is org.springframework.beans.factory.BeanExpressionException: Expression parsing failed; nested exception is org.springframework.beans.factory.UnsatisfiedDependencyException: Error creating bean with name 'org.springframework.security.oauth2.config.annotation.web.configuration.AuthorizationServerSecurityConfiguration': Unsatisfied dependency expressed through field 'configurers'; nested exception is org.springframework.beans.factory.NoSuchBeanDefinitionException: No qualifying bean of type 'java.util.List<org.springframework.security.oauth2.config.annotation.web.configuration.AuthorizationServerConfigurer>' available: expected at least 1 bean which qualifies as autowire candidate. Dependency annotations: {@org.springframework.beans.factory.annotation.Autowired(required=true)}
21-Jun-2019 00:00:34 [WARN] JwtAccessTokenConverter - Unable to create an RSA verifier from verifierKey (ignoreable if using MAC)
21-Jun-2019 00:00:35 [WARN] AnnotationConfigWebApplicationContext - Exception encountered during context initialization - cancelling refresh attempt: org.springframework.beans.factory.UnsatisfiedDependencyException: Error creating bean with name 'authorizationServerConfigurationTests.AuthorizationServerTypes': Unsatisfied dependency expressed through field 'tokenServices'; nested exception is org.springframework.beans.factory.BeanCreationException: Error creating bean with name 'org.springframework.security.oauth2.config.annotation.web.configuration.AuthorizationServerEndpointsConfiguration': Invocation of init method failed; nested exception is java.lang.AssertionError
21-Jun-2019 00:00:35 Tests run: 20, Failures: 0, Errors: 0, Skipped: 0, Time elapsed: 2.202 sec
21-Jun-2019 00:00:35 Running org.springframework.security.oauth2.config.annotation.Gh808EnableAuthorizationServerTests
21-Jun-2019 00:00:35 Tests run: 2, Failures: 0, Errors: 0, Skipped: 0, Time elapsed: 0.208 sec
21-Jun-2019 00:00:35 Running org.springframework.security.oauth2.config.xml.ResourceServerBeanDefinitionParserTests
21-Jun-2019 00:00:35 Tests run: 2, Failures: 0, Errors: 0, Skipped: 0, Time elapsed: 0.208 sec
21-Jun-2019 00:00:35 Running org.springframework.security.oauth2.config.xml.AuthorizationServerInvalidParserTests
21-Jun-2019 00:00:36 Tests run: 1, Failures: 0, Errors: 0, Skipped: 0, Time elapsed: 0.029 sec
21-Jun-2019 00:00:36 Running org.springframework.security.oauth2.config.xml.AuthorizationServerBeanDefinitionParserTests
21-Jun-2019 00:00:36 Tests run: 12, Failures: 0, Errors: 0, Skipped: 0, Time elapsed: 0.543 sec
21-Jun-2019 00:00:36 Running org.springframework.security.oauth2.config.xml.ClientDetailsServiceBeanDefinitionParserTests
21-Jun-2019 00:00:36 Tests run: 3, Failures: 0, Errors: 0, Skipped: 0, Time elapsed: 0.037 sec
21-Jun-2019 00:00:36 Running org.springframework.security.oauth2.config.xml.ResourceBeanDefinitionParserTests
21-Jun-2019 00:00:36 Tests run: 7, Failures: 0, Errors: 0, Skipped: 0, Time elapsed: 0.069 sec
21-Jun-2019 00:00:36 Running org.springframework.security.oauth2.config.xml.InvalidResourceBeanDefinitionParserTests
21-Jun-2019 00:00:36 Tests run: 5, Failures: 0, Errors: 0, Skipped: 0, Time elapsed: 0.057 sec
21-Jun-2019 00:00:36 Running org.springframework.security.oauth2.config.xml.AuthorizationServerCustomGrantParserTests
21-Jun-2019 00:00:36 Tests run: 1, Failures: 0, Errors: 0, Skipped: 0, Time elapsed: 0.023 sec
21-Jun-2019 00:00:36 Running org.springframework.security.oauth2.config.xml.AuthorizationServerClientCredentialsPasswordInvalidXmlTests
21-Jun-2019 00:00:37 Tests run: 2, Failures: 0, Errors: 0, Skipped: 0, Time elapsed: 0.332 sec
21-Jun-2019 00:00:37 Running org.springframework.security.oauth2.config.xml.AuthorizationServerClientCredentialsPasswordValidXmlTests
21-Jun-2019 00:00:37 Tests run: 2, Failures: 0, Errors: 0, Skipped: 0, Time elapsed: 0.213 sec
21-Jun-2019 00:00:37 Running org.springframework.security.oauth2.http.converter.jaxb.JaxbOAuth2ExceptionMessageConverterTests
21-Jun-2019 00:00:38 Tests run: 22, Failures: 0, Errors: 0, Skipped: 0, Time elapsed: 1.441 sec
21-Jun-2019 00:00:38 Running org.springframework.security.oauth2.http.converter.jaxb.JaxbOAuth2AccessTokenMessageConverterTests
21-Jun-2019 00:00:39 Tests run: 8, Failures: 0, Errors: 0, Skipped: 0, Time elapsed: 0.838 sec
21-Jun-2019 00:00:39 Running org.springframework.security.oauth2.client.http.OAuth2ErrorHandlerTests
21-Jun-2019 00:00:39 Tests run: 12, Failures: 0, Errors: 0, Skipped: 0, Time elapsed: 0.054 sec
21-Jun-2019 00:00:39 Running org.springframework.security.oauth2.client.DefaultOAuth2RequestAuthenticatorTests
21-Jun-2019 00:00:39 Tests run: 6, Failures: 0, Errors: 0, Skipped: 0, Time elapsed: 0.002 sec
21-Jun-2019 00:00:39 Running org.springframework.security.oauth2.client.token.grant.password.ResourceOwnerPasswordAccessTokenProviderTests
21-Jun-2019 00:00:39 Tests run: 3, Failures: 0, Errors: 0, Skipped: 0, Time elapsed: 0 sec
21-Jun-2019 00:00:39 Running org.springframework.security.oauth2.client.token.grant.implicit.ImplicitAccessTokenProviderTests
21-Jun-2019 00:00:39 Tests run: 2, Failures: 0, Errors: 0, Skipped: 0, Time elapsed: 0 sec
21-Jun-2019 00:00:39 Running org.springframework.security.oauth2.client.token.grant.code.AuthorizationCodeAccessTokenProviderWithConversionTests
21-Jun-2019 00:00:39 Tests run: 4, Failures: 0, Errors: 0, Skipped: 0, Time elapsed: 0.118 sec
21-Jun-2019 00:00:39 Running org.springframework.security.oauth2.client.token.grant.code.AuthorizationCodeAccessTokenProviderTests
21-Jun-2019 00:00:39 Tests run: 5, Failures: 0, Errors: 0, Skipped: 0, Time elapsed: 0.002 sec
21-Jun-2019 00:00:39 Running org.springframework.security.oauth2.client.token.grant.code.AuthorizationCodeResourceDetailsTests
21-Jun-2019 00:00:39 Tests run: 2, Failures: 0, Errors: 0, Skipped: 0, Time elapsed: 0 sec
21-Jun-2019 00:00:39 Running org.springframework.security.oauth2.client.token.JdbcClientTokenServicesTests
21-Jun-2019 00:00:40 Tests run: 3, Failures: 0, Errors: 0, Skipped: 0, Time elapsed: 0.32 sec
21-Jun-2019 00:00:40 Running org.springframework.security.oauth2.client.token.OAuth2AccessTokenSupportTests
21-Jun-2019 00:00:40 Tests run: 5, Failures: 0, Errors: 0, Skipped: 0, Time elapsed: 0.025 sec
21-Jun-2019 00:00:40 Running org.springframework.security.oauth2.client.token.AccessTokenProviderChainTests
21-Jun-2019 00:00:40 Tests run: 15, Failures: 0, Errors: 0, Skipped: 0, Time elapsed: 0.029 sec
21-Jun-2019 00:00:40 Running org.springframework.security.oauth2.client.filter.OAuth2ClientContextFilterTests
21-Jun-2019 00:00:40 Tests run: 11, Failures: 0, Errors: 0, Skipped: 0, Time elapsed: 0.006 sec
21-Jun-2019 00:00:40 Running org.springframework.security.oauth2.client.filter.OAuth2ClientAuthenticationProcessingFilterTests
21-Jun-2019 00:00:40 Tests run: 5, Failures: 0, Errors: 0, Skipped: 0, Time elapsed: 0.017 sec
21-Jun-2019 00:00:40 Running org.springframework.security.oauth2.client.OAuth2RestTemplateTests
21-Jun-2019 00:00:40 Tests run: 12, Failures: 0, Errors: 0, Skipped: 0, Time elapsed: 0.205 sec
21-Jun-2019 00:00:40 Running org.springframework.security.oauth2.provider.request.DefaultAuthorizationRequestFactoryTests
21-Jun-2019 00:00:40 Tests run: 9, Failures: 0, Errors: 0, Skipped: 0, Time elapsed: 0.002 sec
21-Jun-2019 00:00:40 Running org.springframework.security.oauth2.provider.request.DefaultOAuth2RequestValidatorTests
21-Jun-2019 00:00:40 Tests run: 3, Failures: 0, Errors: 0, Skipped: 0, Time elapsed: 0.001 sec
21-Jun-2019 00:00:40 Running org.springframework.security.oauth2.provider.password.ResourceOwnerPasswordTokenGranterTests
21-Jun-2019 00:00:40 Tests run: 7, Failures: 0, Errors: 0, Skipped: 0, Time elapsed: 0.003 sec
21-Jun-2019 00:00:40 Running org.springframework.security.oauth2.provider.client.BaseClientDetailsTests
21-Jun-2019 00:00:40 Tests run: 11, Failures: 0, Errors: 0, Skipped: 0, Time elapsed: 0.044 sec
21-Jun-2019 00:00:40 Running org.springframework.security.oauth2.provider.client.JdbcClientDetailsServiceTests
21-Jun-2019 00:00:40 Tests run: 14, Failures: 0, Errors: 0, Skipped: 0, Time elapsed: 0.277 sec
21-Jun-2019 00:00:40 Running org.springframework.security.oauth2.provider.client.ClientCredentialsTokenEndpointFilterTests
21-Jun-2019 00:00:40 Tests run: 3, Failures: 0, Errors: 0, Skipped: 0, Time elapsed: 0.02 sec
21-Jun-2019 00:00:40 Running org.springframework.security.oauth2.provider.client.ClientDetailsUserDetailsServiceTests
21-Jun-2019 00:00:40 Tests run: 2, Failures: 0, Errors: 0, Skipped: 0, Time elapsed: 0.005 sec
21-Jun-2019 00:00:40 Running org.springframework.security.oauth2.provider.approval.ApprovalStoreUserApprovalHandlerTests
21-Jun-2019 00:00:40 Tests run: 10, Failures: 0, Errors: 0, Skipped: 0, Time elapsed: 0.003 sec
21-Jun-2019 00:00:40 Running org.springframework.security.oauth2.provider.approval.DefaultUserApprovalHandlerTests
21-Jun-2019 00:00:40 Tests run: 1, Failures: 0, Errors: 0, Skipped: 0, Time elapsed: 0 sec
21-Jun-2019 00:00:40 Running org.springframework.security.oauth2.provider.approval.TokenStoreUserApprovalHandlerTests
21-Jun-2019 00:00:40 Tests run: 3, Failures: 0, Errors: 0, Skipped: 0, Time elapsed: 0.002 sec
21-Jun-2019 00:00:40 Running org.springframework.security.oauth2.provider.approval.JdbcApprovalStoreTests
21-Jun-2019 00:00:40 Tests run: 6, Failures: 0, Errors: 0, Skipped: 0, Time elapsed: 0.072 sec
21-Jun-2019 00:00:40 Running org.springframework.security.oauth2.provider.approval.InMemoryApprovalStoreTests
21-Jun-2019 00:00:40 Tests run: 5, Failures: 0, Errors: 0, Skipped: 0, Time elapsed: 0 sec
21-Jun-2019 00:00:40 Running org.springframework.security.oauth2.provider.approval.TokenApprovalStoreTests
21-Jun-2019 00:00:40 Tests run: 5, Failures: 0, Errors: 0, Skipped: 0, Time elapsed: 0.002 sec
21-Jun-2019 00:00:40 Running org.springframework.security.oauth2.provider.vote.ClientScopeVoterTests
21-Jun-2019 00:00:40 Tests run: 3, Failures: 0, Errors: 0, Skipped: 0, Time elapsed: 0.001 sec
21-Jun-2019 00:00:40 Running org.springframework.security.oauth2.provider.vote.ScopeVoterTests
21-Jun-2019 00:00:40 Tests run: 6, Failures: 0, Errors: 0, Skipped: 0, Time elapsed: 0.001 sec
21-Jun-2019 00:00:40 Running org.springframework.security.oauth2.provider.test.OAuth2RequestTests
21-Jun-2019 00:00:40 Tests run: 4, Failures: 0, Errors: 0, Skipped: 0, Time elapsed: 0 sec
21-Jun-2019 00:00:40 Running org.springframework.security.oauth2.provider.token.DefaultTokenServicesWithJdbcTests
21-Jun-2019 00:00:41 Tests run: 19, Failures: 0, Errors: 0, Skipped: 0, Time elapsed: 0.383 sec
21-Jun-2019 00:00:41 Running org.springframework.security.oauth2.provider.token.store.JwtAccessTokenConverterTests
21-Jun-2019 00:00:41 [WARN] JwtAccessTokenConverter - Unable to create an RSA verifier from verifierKey (ignoreable if using MAC)
21-Jun-2019 00:00:41 [WARN] JwtAccessTokenConverter - Unable to create an RSA verifier from verifierKey (ignoreable if using MAC)
21-Jun-2019 00:00:41 [WARN] JwtAccessTokenConverter - Unable to create an RSA verifier from verifierKey (ignoreable if using MAC)
21-Jun-2019 00:00:41 Tests run: 14, Failures: 0, Errors: 0, Skipped: 0, Time elapsed: 0.17 sec
21-Jun-2019 00:00:41 Running org.springframework.security.oauth2.provider.token.store.InMemoryTokenStoreTests
21-Jun-2019 00:00:41 Tests run: 16, Failures: 0, Errors: 0, Skipped: 0, Time elapsed: 0.01 sec
21-Jun-2019 00:00:41 Running org.springframework.security.oauth2.provider.token.store.JwtTokenStoreTests
21-Jun-2019 00:00:41 [WARN] JwtAccessTokenConverter - Unable to create an RSA verifier from verifierKey (ignoreable if using MAC)
21-Jun-2019 00:00:41 [WARN] JwtAccessTokenConverter - Unable to create an RSA verifier from verifierKey (ignoreable if using MAC)
21-Jun-2019 00:00:41 [WARN] JwtAccessTokenConverter - Unable to create an RSA verifier from verifierKey (ignoreable if using MAC)
21-Jun-2019 00:00:41 [WARN] JwtAccessTokenConverter - Unable to create an RSA verifier from verifierKey (ignoreable if using MAC)
21-Jun-2019 00:00:41 [WARN] JwtAccessTokenConverter - Unable to create an RSA verifier from verifierKey (ignoreable if using MAC)
21-Jun-2019 00:00:41 [WARN] JwtAccessTokenConverter - Unable to create an RSA verifier from verifierKey (ignoreable if using MAC)
21-Jun-2019 00:00:41 [WARN] JwtAccessTokenConverter - Unable to create an RSA verifier from verifierKey (ignoreable if using MAC)
21-Jun-2019 00:00:41 [WARN] JwtAccessTokenConverter - Unable to create an RSA verifier from verifierKey (ignoreable if using MAC)
21-Jun-2019 00:00:41 [WARN] JwtAccessTokenConverter - Unable to create an RSA verifier from verifierKey (ignoreable if using MAC)
21-Jun-2019 00:00:41 [WARN] JwtAccessTokenConverter - Unable to create an RSA verifier from verifierKey (ignoreable if using MAC)
21-Jun-2019 00:00:41 [WARN] JwtAccessTokenConverter - Unable to create an RSA verifier from verifierKey (ignoreable if using MAC)
21-Jun-2019 00:00:41 [WARN] JwtAccessTokenConverter - Unable to create an RSA verifier from verifierKey (ignoreable if using MAC)
21-Jun-2019 00:00:41 [WARN] JwtAccessTokenConverter - Unable to create an RSA verifier from verifierKey (ignoreable if using MAC)
21-Jun-2019 00:00:41 [WARN] JwtAccessTokenConverter - Unable to create an RSA verifier from verifierKey (ignoreable if using MAC)
21-Jun-2019 00:00:41 [WARN] JwtAccessTokenConverter - Unable to create an RSA verifier from verifierKey (ignoreable if using MAC)
21-Jun-2019 00:00:41 [WARN] JwtAccessTokenConverter - Unable to create an RSA verifier from verifierKey (ignoreable if using MAC)
21-Jun-2019 00:00:41 [WARN] JwtAccessTokenConverter - Unable to create an RSA verifier from verifierKey (ignoreable if using MAC)
21-Jun-2019 00:00:41 [WARN] JwtAccessTokenConverter - Unable to create an RSA verifier from verifierKey (ignoreable if using MAC)
21-Jun-2019 00:00:41 Tests run: 18, Failures: 0, Errors: 0, Skipped: 0, Time elapsed: 0.036 sec
21-Jun-2019 00:00:41 Running org.springframework.security.oauth2.provider.token.store.redis.RedisTokenStorePrefixTests
21-Jun-2019 00:00:44 Tests run: 15, Failures: 0, Errors: 0, Skipped: 0, Time elapsed: 3.119 sec
21-Jun-2019 00:00:44 Running org.springframework.security.oauth2.provider.token.store.redis.RedisTokenStoreMockTests
21-Jun-2019 00:00:44 Tests run: 2, Failures: 0, Errors: 0, Skipped: 0, Time elapsed: 0.067 sec
21-Jun-2019 00:00:44 Running org.springframework.security.oauth2.provider.token.store.redis.RedisTokenStoreTests
21-Jun-2019 00:00:47 Tests run: 16, Failures: 0, Errors: 0, Skipped: 0, Time elapsed: 3.054 sec
21-Jun-2019 00:00:47 Running org.springframework.security.oauth2.provider.token.store.JdbcTokenStoreTests
21-Jun-2019 00:00:47 Tests run: 14, Failures: 0, Errors: 0, Skipped: 0, Time elapsed: 0.154 sec
21-Jun-2019 00:00:47 Running org.springframework.security.oauth2.provider.token.DefaultTokenServicesAuthoritiesChangeTests
21-Jun-2019 00:00:47 Tests run: 1, Failures: 0, Errors: 0, Skipped: 0, Time elapsed: 0 sec
21-Jun-2019 00:00:47 Running org.springframework.security.oauth2.provider.token.DefaultUserAuthenticationConverterTests
21-Jun-2019 00:00:47 Tests run: 3, Failures: 0, Errors: 0, Skipped: 0, Time elapsed: 0.003 sec
21-Jun-2019 00:00:47 Running org.springframework.security.oauth2.provider.token.TokenServicesWithTokenEnhancerTests
21-Jun-2019 00:00:47 [WARN] JwtAccessTokenConverter - Unable to create an RSA verifier from verifierKey (ignoreable if using MAC)
21-Jun-2019 00:00:47 [WARN] JwtAccessTokenConverter - Unable to create an RSA verifier from verifierKey (ignoreable if using MAC)
21-Jun-2019 00:00:47 [WARN] JwtAccessTokenConverter - Unable to create an RSA verifier from verifierKey (ignoreable if using MAC)
21-Jun-2019 00:00:47 [WARN] JwtAccessTokenConverter - Unable to create an RSA verifier from verifierKey (ignoreable if using MAC)
21-Jun-2019 00:00:47 [WARN] JwtAccessTokenConverter - Unable to create an RSA verifier from verifierKey (ignoreable if using MAC)
21-Jun-2019 00:00:47 Tests run: 5, Failures: 0, Errors: 0, Skipped: 0, Time elapsed: 0.015 sec
21-Jun-2019 00:00:47 Running org.springframework.security.oauth2.provider.token.DefaultTokenServicesWithJwtTests
21-Jun-2019 00:00:47 [WARN] JwtAccessTokenConverter - Unable to create an RSA verifier from verifierKey (ignoreable if using MAC)
21-Jun-2019 00:00:47 [WARN] JwtAccessTokenConverter - Unable to create an RSA verifier from verifierKey (ignoreable if using MAC)
21-Jun-2019 00:00:47 [WARN] JwtAccessTokenConverter - Unable to create an RSA verifier from verifierKey (ignoreable if using MAC)
21-Jun-2019 00:00:47 [WARN] JwtAccessTokenConverter - Unable to create an RSA verifier from verifierKey (ignoreable if using MAC)
21-Jun-2019 00:00:47 [WARN] JwtAccessTokenConverter - Unable to create an RSA verifier from verifierKey (ignoreable if using MAC)
21-Jun-2019 00:00:47 [WARN] JwtAccessTokenConverter - Unable to create an RSA verifier from verifierKey (ignoreable if using MAC)
21-Jun-2019 00:00:47 [WARN] JwtAccessTokenConverter - Unable to create an RSA verifier from verifierKey (ignoreable if using MAC)
21-Jun-2019 00:00:47 [WARN] JwtAccessTokenConverter - Unable to create an RSA verifier from verifierKey (ignoreable if using MAC)
21-Jun-2019 00:00:47 [WARN] JwtAccessTokenConverter - Unable to create an RSA verifier from verifierKey (ignoreable if using MAC)
21-Jun-2019 00:00:47 [WARN] JwtAccessTokenConverter - Unable to create an RSA verifier from verifierKey (ignoreable if using MAC)
21-Jun-2019 00:00:47 [WARN] JwtAccessTokenConverter - Unable to create an RSA verifier from verifierKey (ignoreable if using MAC)
21-Jun-2019 00:00:47 [WARN] JwtAccessTokenConverter - Unable to create an RSA verifier from verifierKey (ignoreable if using MAC)
21-Jun-2019 00:00:47 [WARN] JwtAccessTokenConverter - Unable to create an RSA verifier from verifierKey (ignoreable if using MAC)
21-Jun-2019 00:00:47 [WARN] JwtAccessTokenConverter - Unable to create an RSA verifier from verifierKey (ignoreable if using MAC)
21-Jun-2019 00:00:47 [WARN] JwtAccessTokenConverter - Unable to create an RSA verifier from verifierKey (ignoreable if using MAC)
21-Jun-2019 00:00:47 Tests run: 15, Failures: 0, Errors: 0, Skipped: 0, Time elapsed: 0.038 sec
21-Jun-2019 00:00:47 Running org.springframework.security.oauth2.provider.token.DefaultTokenServicesTests
21-Jun-2019 00:00:47 Tests run: 1, Failures: 0, Errors: 0, Skipped: 0, Time elapsed: 0.003 sec
21-Jun-2019 00:00:47 Running org.springframework.security.oauth2.provider.token.DefaultTokenServicesWithInMemoryTests
21-Jun-2019 00:00:47 Tests run: 25, Failures: 0, Errors: 0, Skipped: 0, Time elapsed: 0.017 sec
21-Jun-2019 00:00:47 Running org.springframework.security.oauth2.provider.token.DefaultAccessTokenConverterTests
21-Jun-2019 00:00:47 Tests run: 15, Failures: 0, Errors: 0, Skipped: 0, Time elapsed: 0.004 sec
21-Jun-2019 00:00:47 Running org.springframework.security.oauth2.provider.implicit.InMemoryImplicitGrantServiceTests
21-Jun-2019 00:00:47 Tests run: 2, Failures: 0, Errors: 0, Skipped: 0, Time elapsed: 0.001 sec
21-Jun-2019 00:00:47 Running org.springframework.security.oauth2.provider.error.DefaultWebResponseExceptionTranslatorTests
21-Jun-2019 00:00:47 Tests run: 1, Failures: 0, Errors: 0, Skipped: 0, Time elapsed: 0 sec
21-Jun-2019 00:00:47 Running org.springframework.security.oauth2.provider.error.OAuth2AuthenticationEntryPointTests
21-Jun-2019 00:00:47 [WARN] DefaultHandlerExceptionResolver - Resolved exception caused by handler execution: org.springframework.web.HttpMediaTypeNotAcceptableException: Could not find acceptable representation
21-Jun-2019 00:00:47 Tests run: 7, Failures: 0, Errors: 0, Skipped: 0, Time elapsed: 0.036 sec
21-Jun-2019 00:00:47 Running org.springframework.security.oauth2.provider.error.OAuth2AccessDeniedHandlerTests
21-Jun-2019 00:00:47 Tests run: 1, Failures: 0, Errors: 0, Skipped: 0, Time elapsed: 0.004 sec
21-Jun-2019 00:00:47 Running org.springframework.security.oauth2.provider.authentication.OAuth2AuthenticationProcessingFilterTests
21-Jun-2019 00:00:47 Tests run: 8, Failures: 0, Errors: 0, Skipped: 0, Time elapsed: 0.042 sec
21-Jun-2019 00:00:47 Running org.springframework.security.oauth2.provider.authentication.OAuth2AuthenticationDetailsTests
21-Jun-2019 00:00:47 Tests run: 1, Failures: 0, Errors: 0, Skipped: 0, Time elapsed: 0.001 sec
21-Jun-2019 00:00:47 Running org.springframework.security.oauth2.provider.authentication.OAuth2AuthenticationManagerTests
21-Jun-2019 00:00:47 Tests run: 3, Failures: 0, Errors: 0, Skipped: 0, Time elapsed: 0.003 sec
21-Jun-2019 00:00:47 Running org.springframework.security.oauth2.provider.endpoint.FrameworkEndpointHandlerMappingTests
21-Jun-2019 00:00:47 Tests run: 4, Failures: 0, Errors: 0, Skipped: 0, Time elapsed: 0.001 sec
21-Jun-2019 00:00:47 Running org.springframework.security.oauth2.provider.endpoint.WhitelabelApprovalEndpointTests
21-Jun-2019 00:00:47 Tests run: 6, Failures: 0, Errors: 0, Skipped: 0, Time elapsed: 0.003 sec
21-Jun-2019 00:00:48 Running org.springframework.security.oauth2.provider.endpoint.ExactMatchRedirectResolverTests
21-Jun-2019 00:00:48 Tests run: 3, Failures: 0, Errors: 0, Skipped: 0, Time elapsed: 0 sec
21-Jun-2019 00:00:48 Running org.springframework.security.oauth2.provider.endpoint.AuthorizationEndpointTests
21-Jun-2019 00:00:48 Tests run: 34, Failures: 0, Errors: 0, Skipped: 0, Time elapsed: 0.024 sec
21-Jun-2019 00:00:48 Running org.springframework.security.oauth2.provider.endpoint.TokenEndpointTests
21-Jun-2019 00:00:48 Tests run: 6, Failures: 0, Errors: 0, Skipped: 0, Time elapsed: 0.009 sec
21-Jun-2019 00:00:48 Running org.springframework.security.oauth2.provider.endpoint.DefaultRedirectResolverTests
21-Jun-2019 00:00:48 Tests run: 31, Failures: 0, Errors: 0, Skipped: 0, Time elapsed: 0.009 sec
21-Jun-2019 00:00:48 Running org.springframework.security.oauth2.provider.endpoint.WhitelabelErrorEndpointTests
21-Jun-2019 00:00:48 Tests run: 3, Failures: 0, Errors: 0, Skipped: 0, Time elapsed: 0.001 sec
21-Jun-2019 00:00:48 Running org.springframework.security.oauth2.provider.endpoint.TokenEndpointAuthenticationFilterTests
21-Jun-2019 00:00:48 Tests run: 3, Failures: 0, Errors: 0, Skipped: 0, Time elapsed: 0.015 sec
21-Jun-2019 00:00:48 Running org.springframework.security.oauth2.provider.AuthorizationRequestTests
21-Jun-2019 00:00:48 Tests run: 9, Failures: 0, Errors: 0, Skipped: 0, Time elapsed: 0.003 sec
21-Jun-2019 00:00:48 Running org.springframework.security.oauth2.provider.OAuth2AuthenticationTests
21-Jun-2019 00:00:48 {"authorities":[{"authority":"ROLE_USER"}],"details":null,"authenticated":false,"userAuthentication":{"authorities":[{"authority":"ROLE_USER"}],"details":null,"authenticated":true,"principal":"foo","credentials":"bar","name":"foo"},"clientOnly":false,"oauth2Request":{"clientId":"id","scope":["read"],"requestParameters":{},"resourceIds":[],"authorities":[],"approved":false,"refresh":false,"redirectUri":null,"responseTypes":[],"extensions":{},"grantType":null,"refreshTokenRequest":null},"principal":"foo","credentials":"","name":"foo"}
21-Jun-2019 00:00:48 Tests run: 8, Failures: 0, Errors: 0, Skipped: 0, Time elapsed: 0.013 sec
21-Jun-2019 00:00:48 Running org.springframework.security.oauth2.provider.expression.OAuth2MethodSecurityExpressionHandlerTests
21-Jun-2019 00:00:48 Tests run: 9, Failures: 0, Errors: 0, Skipped: 0, Time elapsed: 0.007 sec
21-Jun-2019 00:00:48 Running org.springframework.security.oauth2.provider.expression.OAuth2SecurityExpressionMethodsTests
21-Jun-2019 00:00:48 Tests run: 10, Failures: 0, Errors: 0, Skipped: 0, Time elapsed: 0.001 sec
21-Jun-2019 00:00:48 Running org.springframework.security.oauth2.provider.expression.OAuth2WebSecurityExpressionHandlerTests
21-Jun-2019 00:00:48 Tests run: 6, Failures: 0, Errors: 0, Skipped: 0, Time elapsed: 0.002 sec
21-Jun-2019 00:00:48 Running org.springframework.security.oauth2.provider.expression.OAuth2ExpressionParserTests
21-Jun-2019 00:00:48 Tests run: 3, Failures: 0, Errors: 0, Skipped: 0, Time elapsed: 0.006 sec
21-Jun-2019 00:00:48 Running org.springframework.security.oauth2.provider.OAuth2RequestTests
21-Jun-2019 00:00:48 Tests run: 4, Failures: 0, Errors: 0, Skipped: 0, Time elapsed: 0.001 sec
21-Jun-2019 00:00:48 Running org.springframework.security.oauth2.provider.code.AuthorizationCodeTokenGranterTests
21-Jun-2019 00:00:48 Tests run: 5, Failures: 0, Errors: 0, Skipped: 0, Time elapsed: 0.002 sec
21-Jun-2019 00:00:48 Running org.springframework.security.oauth2.provider.code.InMemoryAuthorizationCodeServicesTests
21-Jun-2019 00:00:48 Tests run: 3, Failures: 0, Errors: 0, Skipped: 0, Time elapsed: 0 sec
21-Jun-2019 00:00:48 Running org.springframework.security.oauth2.provider.code.JdbcAuthorizationCodeServicesTests
21-Jun-2019 00:00:48 Tests run: 3, Failures: 0, Errors: 0, Skipped: 0, Time elapsed: 0.029 sec
21-Jun-2019 00:00:48 Running org.springframework.security.oauth2.provider.code.SubdomainRedirectResolverTests
21-Jun-2019 00:00:48 Tests run: 2, Failures: 0, Errors: 0, Skipped: 0, Time elapsed: 0 sec
21-Jun-2019 00:00:48 Running org.springframework.security.oauth2.common.OAuth2AccessTokenJackson1DeserializerTests
21-Jun-2019 00:00:49 Tests run: 8, Failures: 0, Errors: 0, Skipped: 0, Time elapsed: 1.088 sec
21-Jun-2019 00:00:49 Running org.springframework.security.oauth2.common.OAuth2AccessTokenJackson2DeserializerTests
21-Jun-2019 00:00:50 Tests run: 9, Failures: 0, Errors: 0, Skipped: 0, Time elapsed: 1.058 sec
21-Jun-2019 00:00:50 Running org.springframework.security.oauth2.common.exception.OAuth2ExceptionDeserializerTests
21-Jun-2019 00:00:50 Tests run: 13, Failures: 0, Errors: 0, Skipped: 0, Time elapsed: 0.008 sec
21-Jun-2019 00:00:50 Running org.springframework.security.oauth2.common.exception.OAuth2ExceptionSerializerTests
21-Jun-2019 00:00:50 Tests run: 11, Failures: 0, Errors: 0, Skipped: 0, Time elapsed: 0.007 sec
21-Jun-2019 00:00:50 Running org.springframework.security.oauth2.common.exception.OAuth2ExceptionJackson2DeserializerTests
21-Jun-2019 00:00:50 Tests run: 14, Failures: 0, Errors: 0, Skipped: 0, Time elapsed: 0.005 sec
21-Jun-2019 00:00:50 Running org.springframework.security.oauth2.common.OAuth2AccessTokenJackson2SerializerTests
21-Jun-2019 00:00:51 Tests run: 10, Failures: 0, Errors: 0, Skipped: 0, Time elapsed: 0.916 sec
21-Jun-2019 00:00:51 Running org.springframework.security.oauth2.common.OAuth2AccessTokenJackson1SerializerTests
21-Jun-2019 00:00:54 Tests run: 1, Failures: 0, Errors: 0, Skipped: 0, Time elapsed: 3.103 sec
21-Jun-2019 00:00:55 Exception: java.lang.OutOfMemoryError thrown from the UncaughtExceptionHandler in thread "main"
21-Jun-2019 00:00:55
21-Jun-2019 00:00:55 Results :
21-Jun-2019 00:00:55
21-Jun-2019 00:00:55 Tests run: 696, Failures: 0, Errors: 0, Skipped: 0
21-Jun-2019 00:00:55
21-Jun-2019 00:00:55 [INFO] ------------------------------------------------------------------------
21-Jun-2019 00:00:55 [INFO] Reactor Summary:
21-Jun-2019 00:00:55 [INFO]
21-Jun-2019 00:00:55 [INFO] OAuth for Spring Security .......................... SUCCESS [  1.028 s]
21-Jun-2019 00:00:55 [INFO] OAuth 1(a) for Spring Security ..................... SUCCESS [  9.075 s]
21-Jun-2019 00:00:55 [INFO] OAuth2 for Spring Security ......................... FAILURE [ 32.069 s]
21-Jun-2019 00:00:55 [INFO] spring-oauth2-tests ................................ SKIPPED
21-Jun-2019 00:00:55 [INFO] spring-oauth2-tests-common ......................... SKIPPED
21-Jun-2019 00:00:55 [INFO] spring-oauth2-tests-vanilla ........................ SKIPPED
21-Jun-2019 00:00:55 [INFO] spring-oauth2-tests-mappings ....................... SKIPPED
21-Jun-2019 00:00:55 [INFO] spring-oauth2-tests-form ........................... SKIPPED
21-Jun-2019 00:00:55 [INFO] spring-oauth2-tests-jwt ............................ SKIPPED
21-Jun-2019 00:00:55 [INFO] spring-oauth2-tests-approval ....................... SKIPPED
21-Jun-2019 00:00:55 [INFO] spring-oauth2-tests-jdbc ........................... SKIPPED
21-Jun-2019 00:00:55 [INFO] spring-oauth2-tests-jpa ............................ SKIPPED
21-Jun-2019 00:00:55 [INFO] spring-oauth2-tests-jaxb ........................... SKIPPED
21-Jun-2019 00:00:55 [INFO] spring-oauth-tests-custom-grant .................... SKIPPED
21-Jun-2019 00:00:55 [INFO] spring-oauth2-tests-multi .......................... SKIPPED
21-Jun-2019 00:00:55 [INFO] spring-oauth2-tests-client ......................... SKIPPED
21-Jun-2019 00:00:55 [INFO] spring-oauth2-tests-resource ....................... SKIPPED
21-Jun-2019 00:00:55 [INFO] spring-oauth2-tests-custom-authentication .......... SKIPPED
21-Jun-2019 00:00:55 [INFO] spring-oauth2-tests-xml ............................ SKIPPED
21-Jun-2019 00:00:55 [INFO] spring-oauth2-tests-xml-common ..................... SKIPPED
21-Jun-2019 00:00:55 [INFO] spring-oauth2-tests-xml-vanilla .................... SKIPPED
21-Jun-2019 00:00:55 [INFO] spring-oauth2-tests-xml-mappings ................... SKIPPED
21-Jun-2019 00:00:55 [INFO] spring-oauth2-tests-xml-form ....................... SKIPPED
21-Jun-2019 00:00:55 [INFO] spring-oauth2-tests-xml-jwt ........................ SKIPPED
21-Jun-2019 00:00:55 [INFO] spring-oauth2-tests-xml-approval ................... SKIPPED
21-Jun-2019 00:00:55 [INFO] spring-oauth2-tests-xml-jdbc ....................... SKIPPED
21-Jun-2019 00:00:55 [INFO] spring-oauth2-tests-xml-client ..................... SKIPPED
21-Jun-2019 00:00:55 [INFO] OAuth for Spring Security - Integration Tests ...... SKIPPED
21-Jun-2019 00:00:55 [INFO] OAuth for Spring Security - Sparklr (OAuth 1 Provider Example) SKIPPED
21-Jun-2019 00:00:55 [INFO] OAuth for Spring Security - Tonr (OAuth 1 Consumer Example) SKIPPED
21-Jun-2019 00:00:55 [INFO] OAuth for Spring Security - Sparklr2 (OAuth 2 Provider Example) SKIPPED
21-Jun-2019 00:00:55 [INFO] OAuth for Spring Security - Tonr2 (OAuth 2 Client Example) SKIPPED
21-Jun-2019 00:00:55 [INFO] OAuth for Spring Security - Samples ................ SKIPPED
21-Jun-2019 00:00:55 [INFO] ------------------------------------------------------------------------
21-Jun-2019 00:00:55 [INFO] BUILD FAILURE
21-Jun-2019 00:00:55 [INFO] ------------------------------------------------------------------------
21-Jun-2019 00:00:55 [INFO] Total time: 43.962 s
21-Jun-2019 00:00:55 [INFO] Finished at: 2019-06-21T00:00:55+00:00
21-Jun-2019 00:00:55 [INFO] Final Memory: 73M/489M
21-Jun-2019 00:00:55 [INFO] ------------------------------------------------------------------------
21-Jun-2019 00:00:55 [ERROR] Failed to execute goal org.apache.maven.plugins:maven-surefire-plugin:2.12.4:test (default-test) on project spring-security-oauth2: Execution default-test of goal org.apache.maven.plugins:maven-surefire-plugin:2.12.4:test failed: The forked VM terminated without saying properly goodbye. VM crash or System.exit called ? -> [Help 1]
21-Jun-2019 00:00:55 [ERROR]
21-Jun-2019 00:00:55 [ERROR] To see the full stack trace of the errors, re-run Maven with the -e switch.
21-Jun-2019 00:00:55 [ERROR] Re-run Maven using the -X switch to enable full debug logging.
21-Jun-2019 00:00:55 [ERROR]
21-Jun-2019 00:00:55 [ERROR] For more information about the errors and possible solutions, please read the following articles:
21-Jun-2019 00:00:55 [ERROR] [Help 1] http://cwiki.apache.org/confluence/display/MAVEN/PluginExecutionException
21-Jun-2019 00:00:55 [ERROR]
21-Jun-2019 00:00:55 [ERROR] After correcting the problems, you can resume the build with the command
21-Jun-2019 00:00:55 [ERROR]   mvn <goals> -rf :spring-security-oauth2
21-Jun-2019 00:00:55 Exception in thread "main"
21-Jun-2019 00:00:55
21-Jun-2019 00:00:55 Failing task since return code of [/opt/jdk-7/bin/java -cp /opt/maven-3.3/boot/plexus-classworlds-2.5.2.jar -Dclassworlds.conf=/tmp/artifactoryM28022751953194497373conf -DbuildInfoConfig.propertiesFile=/tmp/buildInfo46643617610358046.properties -Xmx1256m -Xms128m -Dmaven.home=/opt/maven-3.3 -Dmaven.multiModuleProjectDirectory=/opt/bamboo-home/xml-data/build-dir/SECOAUTH-NIGHTLY-JOB1 org.codehaus.plexus.classworlds.launcher.Launcher clean install -P bootstrap -Dartifactory.publish.password=********] was 1 while expected 0
21-Jun-2019 00:00:55 Finished task 'Artifactory Maven 3' with result: Failed
21-Jun-2019 00:00:55 Running post build plugin 'Docker Container Cleanup'
21-Jun-2019 00:00:55 Running post build plugin 'NCover Results Collector'
21-Jun-2019 00:00:55 Running post build plugin 'Artifactory Release Management Staging'
21-Jun-2019 00:00:55 Running post build plugin 'Artifactory Build Info Copier'
21-Jun-2019 00:00:55 Running post build plugin 'Artifactory Gradle Properties Info Copier'
21-Jun-2019 00:00:55 Running post build plugin 'Clover Results Collector'
21-Jun-2019 00:00:55 Running post build plugin 'npm Cache Cleanup'
21-Jun-2019 00:00:55 Running post build plugin 'Artifact Copier'
21-Jun-2019 00:00:55 Successfully removed working directory at '/opt/bamboo-home/xml-data/build-dir/SECOAUTH-NIGHTLY-JOB1'
21-Jun-2019 00:00:55 Finalising the build...
21-Jun-2019 00:00:55 Stopping timer.
21-Jun-2019 00:00:55 Build SECOAUTH-NIGHTLY-JOB1-1681 completed.
21-Jun-2019 00:00:58 Running on server: post build plugin 'NCover Results Collector'
21-Jun-2019 00:00:58 Running on server: post build plugin 'Build Hanging Detection Configuration'
21-Jun-2019 00:00:58 Running on server: post build plugin 'Clover Delta Calculator'
21-Jun-2019 00:00:58 Running on server: post build plugin 'Maven Dependencies Postprocessor'
21-Jun-2019 00:00:58 All post build plugins have finished
21-Jun-2019 00:00:58 Generating build results summary...
21-Jun-2019 00:00:59 Saving build results to disk...
21-Jun-2019 00:00:59 Logging substituted variables...
21-Jun-2019 00:00:59 Indexing build results...
21-Jun-2019 00:00:59 Finished building SECOAUTH-NIGHTLY-JOB1-1681.