Build: #1682 failed

Job: Default Job failed

Stages & jobs

  1. Default Stage

Build log

The build generated 637 lines of output. Download or view full build log

22-Jun-2019 00:00:04 Build Spring Security OAuth - 2.1.x - Default Job #1682 (SECOAUTH-NIGHTLY-JOB1-1682) started building on agent bamboo-22.af.pivotal.io
22-Jun-2019 00:00:04 Remote agent on host bamboo-22.af.pivotal.io
22-Jun-2019 00:00:05 Build working directory is /opt/bamboo-home/xml-data/build-dir/SECOAUTH-NIGHTLY-JOB1
22-Jun-2019 00:00:05 Executing build Spring Security OAuth - 2.1.x - Default Job #1682 (SECOAUTH-NIGHTLY-JOB1-1682)
22-Jun-2019 00:00:05 Starting task 'Checkout Default Repository' of type 'com.atlassian.bamboo.plugins.vcs:task.vcs.checkout'
22-Jun-2019 00:00:05 Build always requires a clean checkout
22-Jun-2019 00:00:05 Cleaning build directory '/opt/bamboo-home/xml-data/build-dir/SECOAUTH-NIGHTLY-JOB1'
22-Jun-2019 00:00:05 Checking out into /opt/bamboo-home/xml-data/build-dir/SECOAUTH-NIGHTLY-JOB1
22-Jun-2019 00:00:05 Updating source code to revision: 3d37444a991104dd7f23edb2812e9f57620a1395
22-Jun-2019 00:00:05 Creating local git repository in '/opt/bamboo-home/xml-data/build-dir/SECOAUTH-NIGHTLY-JOB1/.git'.
22-Jun-2019 00:00:05 Initialized empty Git repository in /opt/bamboo-home/xml-data/build-dir/SECOAUTH-NIGHTLY-JOB1/.git/
22-Jun-2019 00:00:06 Fetching 'refs/heads/master' from 'git://github.com/SpringSource/spring-security-oauth.git'. Will try to do a shallow fetch.
22-Jun-2019 00:00:07 From git://github.com/SpringSource/spring-security-oauth
22-Jun-2019 00:00:07 * [new branch]      master     -> master
22-Jun-2019 00:00:07 Checking out revision 3d37444a991104dd7f23edb2812e9f57620a1395.
22-Jun-2019 00:00:07 Already on 'master'
22-Jun-2019 00:00:07 Updated source code to revision: 3d37444a991104dd7f23edb2812e9f57620a1395
22-Jun-2019 00:00:07 Finished task 'Checkout Default Repository' with result: Success
22-Jun-2019 00:00:07 Running pre-build action: Artifactory Release Staging
22-Jun-2019 00:00:07 Running pre-build action: VCS Version Collector
22-Jun-2019 00:00:07 Skipping execution of task 'Build' as it is disabled
22-Jun-2019 00:00:07 Starting task 'Artifactory Maven 3' of type 'org.jfrog.bamboo.bamboo-artifactory-plugin:maven3Task'
22-Jun-2019 00:00:07 Bamboo Artifactory Plugin version: 2.6.3
22-Jun-2019 00:00:07
Beginning to execute external process for build 'Spring Security OAuth - 2.1.x - Default Job #1682 (SECOAUTH-NIGHTLY-JOB1-1682)'
... running command line:
/opt/jdk-7/bin/java -cp /opt/maven-3.3/boot/plexus-classworlds-2.5.2.jar -Dclassworlds.conf=/tmp/artifactoryM25062790529331945387conf -DbuildInfoConfig.propertiesFile=/tmp/buildInfo4457433451116909100.properties -Xmx1256m -Xms128m -Dmaven.home=/opt/maven-3.3 -Dmaven.multiModuleProjectDirectory=/opt/bamboo-home/xml-data/build-dir/SECOAUTH-NIGHTLY-JOB1 org.codehaus.plexus.classworlds.launcher.Launcher clean install -P bootstrap -Dartifactory.publish.password=********
... in: /opt/bamboo-home/xml-data/build-dir/SECOAUTH-NIGHTLY-JOB1
... using extra environment variables:
bamboo_planRepository_1_branch=master
bamboo_repository_94273667_previous_revision_number=3d37444a991104dd7f23edb2812e9f57620a1395
bamboo_********_username_password=********
bamboo_signing_store_password=********
bamboo_capability_system_builder_ant_Ant_1_9=/opt/ant-1.9
bamboo_capability_system_builder_ant_Ant_1_8=/opt/ant-1.8
bamboo_planRepository_1_branchDisplayName=master
bamboo_artifactory_override_resolve_repo=libs-milestone
bamboo_capability_system_builder_node_Node_js_10_16=/opt/node-10.16/bin/node
bamboo_repository_revision_number=3d37444a991104dd7f23edb2812e9f57620a1395
bamboo_RIAK_BIN=/usr/sbin/riak
bamboo_repository_94273667_revision_number=3d37444a991104dd7f23edb2812e9f57620a1395
WRAPPER_BITS=32
bamboo_buildKey=SECOAUTH-NIGHTLY-JOB1
bamboo_repository_94273667_git_branch=master
bamboo_bintray_password=********
bamboo_sonar_token_password=********
PWD=/opt/bamboo-home/bin
bamboo_shortJobName=Default Job
bamboo_artifactory_override_resolver_password=********
bamboo_sonatype_token=RSJChaox
bamboo_capability_system_builder_gradle___gradlew=./gradlew
bamboo_buildResultsUrl=https://build.spring.io/browse/SECOAUTH-NIGHTLY-JOB1-1682
bamboo_capability_system_builder_mvn3_Maven_3_3=/opt/maven-3.3
bamboo_capability_system_builder_mvn3_Maven_3_2=/opt/maven-3.2
bamboo_capability_system_builder_mvn3_Maven_3_1=/opt/maven-3.1
bamboo_planRepository_repositoryUrl=git://github.com/SpringSource/spring-security-oauth.git
bamboo_capability_system_builder_mvn3_Maven_3_6=/opt/maven-3.6
bamboo_agentId=286195714
bamboo_capability_system_builder_mvn3_Maven_3_5=/opt/maven-3.5
bamboo_capability_system_builder_mvn3_Maven_3_0=/opt/maven-3.0
bamboo_planRepository_revision=3d37444a991104dd7f23edb2812e9f57620a1395
bamboo_planRepository_previousRevision=3d37444a991104dd7f23edb2812e9f57620a1395
bamboo_capability_remote_build=true
bamboo_repository_branch_name=master
bamboo_sonatype_token_password=********
bamboo_sonatype_user=springsource
SHLVL=1
bamboo_org_jfrog_bamboo_buildInfo_serverUrl=https://repo.spring.io
bamboo_scdf_acceptance_tests_password=********
bamboo_repository_94273667_branch_name=master
WRAPPER_OS=linux
TERM=linux
XDG_SESSION_ID=c1
bamboo_planRepository_branch=master
bamboo_org_jfrog_bamboo_release_activated=false
bamboo_planRepository_1_type=gitv2
bamboo_planRepository_branchName=master
bamboo_capability_system_jdk_JDK_12=/opt/jdk-12
WRAPPER_FILE_SEPARATOR=/
_=/opt/bamboo-home/bin/bamboo-agent.sh
bamboo_capability_system_builder_ant_Ant_1_10=/opt/ant-1.10
bamboo_repository_94273667_name=Plan Repository
WRAPPER_PATH_SEPARATOR=:
bamboo_sonar_password=********
bamboo_hg_cache_directory=/opt/bamboo-home/xml-data/build-dir/_hg-repositories-cache
bamboo_planRepository_1_username=
bamboo_planRepository_type=gitv2
bamboo_git_cache_directory=/opt/bamboo-home/xml-data/build-dir/_git-repositories-cache
bamboo_artifactory_username=buildmaster
bamboo_tmp_directory=/opt/bamboo-home/temp
bamboo_planKey=SECOAUTH-NIGHTLY
bamboo_planRepository_username=
bamboo_JDK8_HOME=/opt/jdk-8
bamboo_repository_94273667_git_username=
bamboo_planRepository_1_branchName=master
bamboo_sonar_version=5.6.3
bamboo_sonar_jdbc_password=********
bamboo_bintray_api_key_password=********
XDG_DATA_DIRS=/usr/local/share:/usr/share:/var/lib/snapd/desktop
bamboo_capability_system_jdk_JDK_1_11=/opt/jdk-11
bamboo_resultsUrl=https://build.spring.io/browse/SECOAUTH-NIGHTLY-JOB1-1682
bamboo_capability_system_jdk_JDK_1_10=/opt/jdk-10
bamboo_build_working_directory=/opt/bamboo-home/xml-data/build-dir/SECOAUTH-NIGHTLY-JOB1
bamboo_planRepository_1_name=Plan Repository
bamboo_capability_system_os=ubuntu1804
bamboo_nexusPush_stagingProfile=buildmaster
bamboo_shortPlanName=2.1.x
MAIL=/var/mail/bamboo
bamboo_planRepository_name=Plan Repository
LOGNAME=bamboo
bamboo_buildNumber=1682
SHELL=/bin/bash
bamboo_planName=Spring Security OAuth - 2.1.x
bamboo_JDK7_HOME=/opt/jdk-7
bamboo_repository_94273667_git_repositoryUrl=git://github.com/SpringSource/spring-security-oauth.git
bamboo_shortPlanKey=NIGHTLY
OLDPWD=/opt/users/bamboo
bamboo_shortJobKey=JOB1
bamboo_artifactory_password=********
bamboo_buildTimeStamp=2019-06-22T00:00:07.085Z
bamboo_repository_previous_revision_number=3d37444a991104dd7f23edb2812e9f57620a1395
bamboo_sonar_username=buildmaster
bamboo_********_password=********
bamboo_repository_git_branch=master
bamboo_buildResultKey=SECOAUTH-NIGHTLY-JOB1-1682
bamboo_nexusPush_close=true
bamboo_artifactory_override_resolver_username=buildmaster
bamboo_buildPlanName=Spring Security OAuth - 2.1.x - Default Job
bamboo_planRepository_1_revision=3d37444a991104dd7f23edb2812e9f57620a1395
bamboo_repository_name=Plan Repository
bamboo_signing_key_password=********
bamboo_capability_system_builder_groovy_Groovy_2_5=/opt/groovy-2.5
LANG=en_US.UTF-8
bamboo_buildFailed=false
bamboo_capability_system_docker_executable=/usr/bin/docker
DISPLAY=localhost:1.0
bamboo_capability_system_jdk_OpenJDK_7=/opt/jdk-7
bamboo_capability_system_builder_groovy_Groovy_2_4=/opt/groovy-2.4
bamboo_artifactory_override_deployer_username=buildmaster
bamboo_capability_system_builder_command_Bash=/bin/bash
bamboo_artifactory_password_mask_a=********
bamboo_agentWorkingDirectory=/opt/bamboo-home/xml-data/build-dir
bamboo_capability_system_git_executable=/usr/bin/git
bamboo_repository_git_username=
bamboo_planRepository_1_previousRevision=3d37444a991104dd7f23edb2812e9f57620a1395
bamboo_capability_os_family=unix
bamboo_planRepository_branchDisplayName=master
bamboo_capability_system_builder_maven_Artifactory_Maven_3_6=/opt/maven-3.6
bamboo_capability_system_builder_maven_Artifactory_Maven_3_5=/opt/maven-3.5
GIT_SSL_NO_VERIFY=true
bamboo_capability_system_builder_maven_Artifactory_Maven_3_3=/opt/maven-3.3
bamboo_capability_system_builder_maven_Artifactory_Maven_3_2=/opt/maven-3.2
bamboo_s3_properties=/home/bamboo/tools/s3.properties
bamboo_capability_system_builder_maven_Artifactory_Maven_3_1=/opt/maven-3.1
bamboo_artifactory_override_deploy_repo=libs-snapshot-local
bamboo_capability_system_builder_maven_Artifactory_Maven_3_0=/opt/maven-3.0
bamboo_plan_storageTag=SECOAUTH-NIGHTLY
bamboo_bintray_username_password=********
USER=bamboo
bamboo_repository_git_repositoryUrl=git://github.com/SpringSource/spring-security-oauth.git
bamboo_working_directory=/opt/bamboo-home/xml-data/build-dir/SECOAUTH-NIGHTLY-JOB1
bamboo_org_jfrog_bamboo_buildInfo_activated=true
bamboo_planRepository_1_repositoryUrl=git://github.com/SpringSource/spring-security-oauth.git
bamboo_capability_system_jdk_JDK_1_8=/opt/jdk-8
bamboo_artifactory_override_deployer_password=********
bamboo_capability_system_jdk_JDK_1_9=/opt/jdk-9
WRAPPER_ARCH=x86
bamboo_capability_system_jdk_JDK_1_6=/opt/jdk-6
bamboo_sonatype_password=********
bamboo_capability_system_jdk_JDK_1_7=/opt/jdk-7
bamboo_sonar_ip=10.194.6.9
XDG_RUNTIME_DIR=/run/user/1002
HOME=/home/bamboo
PATH=/bin:/home/bamboo/bin:/usr/local/sbin:/usr/local/bin:/usr/sbin:/usr/bin:/sbin:/bin:/usr/games:/usr/local/games:/snap/bin:/home/bamboo/bin:/usr/local/bin:/bin:/home/bamboo/bin:/usr/local/sbin:/usr/local/bin:/usr/sbin:/usr/bin:/sbin:/bin:/usr/games:/usr/local/games:/snap/bin:/home/bamboo/bin:/usr/local/bin
22-Jun-2019 00:00:08 [INFO] Scanning for projects...
22-Jun-2019 00:00:09 Downloading: https://repo.spring.io/libs-snapshot-local/org/springframework/boot/spring-boot-starter-parent/1.5.1.RELEASE/spring-boot-starter-parent-1.5.1.RELEASE.pom
22-Jun-2019 00:00:09
22-Jun-2019 00:00:09 Downloading: https://repo.spring.io/libs-milestone-local/org/springframework/boot/spring-boot-starter-parent/1.5.1.RELEASE/spring-boot-starter-parent-1.5.1.RELEASE.pom
22-Jun-2019 00:00:09
22-Jun-2019 00:00:09 Downloading: https://repo.spring.io/release/org/springframework/boot/spring-boot-starter-parent/1.5.1.RELEASE/spring-boot-starter-parent-1.5.1.RELEASE.pom
22-Jun-2019 00:00:09 1/8 KB   
22-Jun-2019 00:00:09 3/8 KB   
22-Jun-2019 00:00:09 4/8 KB   
22-Jun-2019 00:00:09 5/8 KB   
22-Jun-2019 00:00:09 7/8 KB   
22-Jun-2019 00:00:09 8/8 KB   
22-Jun-2019 00:00:09          
22-Jun-2019 00:00:09 Downloaded: https://repo.spring.io/release/org/springframework/boot/spring-boot-starter-parent/1.5.1.RELEASE/spring-boot-starter-parent-1.5.1.RELEASE.pom (8 KB at 30.9 KB/sec)
22-Jun-2019 00:00:09 Downloading: https://repo.spring.io/libs-snapshot-local/org/springframework/boot/spring-boot-dependencies/1.5.1.RELEASE/spring-boot-dependencies-1.5.1.RELEASE.pom
22-Jun-2019 00:00:10          
22-Jun-2019 00:00:10 Downloading: https://repo.spring.io/libs-milestone-local/org/springframework/boot/spring-boot-dependencies/1.5.1.RELEASE/spring-boot-dependencies-1.5.1.RELEASE.pom
22-Jun-2019 00:00:10          
22-Jun-2019 00:00:10 Downloading: https://repo.spring.io/release/org/springframework/boot/spring-boot-dependencies/1.5.1.RELEASE/spring-boot-dependencies-1.5.1.RELEASE.pom
22-Jun-2019 00:00:10 1/88 KB   
22-Jun-2019 00:00:10 3/88 KB   
22-Jun-2019 00:00:10 4/88 KB   
22-Jun-2019 00:00:10 5/88 KB   
22-Jun-2019 00:00:10 7/88 KB   
22-Jun-2019 00:00:10 8/88 KB   
22-Jun-2019 00:00:10 9/88 KB   
22-Jun-2019 00:00:10 11/88 KB   
22-Jun-2019 00:00:10 12/88 KB   
22-Jun-2019 00:00:10 13/88 KB   
22-Jun-2019 00:00:10 14/88 KB   
22-Jun-2019 00:00:10 15/88 KB   
22-Jun-2019 00:00:10 16/88 KB   
22-Jun-2019 00:00:10 18/88 KB   
22-Jun-2019 00:00:10 19/88 KB   
22-Jun-2019 00:00:10 20/88 KB   
22-Jun-2019 00:00:10 22/88 KB   
22-Jun-2019 00:00:10 23/88 KB   
22-Jun-2019 00:00:10 24/88 KB   
22-Jun-2019 00:00:10 26/88 KB   
22-Jun-2019 00:00:10 27/88 KB   
22-Jun-2019 00:00:10 28/88 KB   
22-Jun-2019 00:00:10 30/88 KB   
22-Jun-2019 00:00:10 31/88 KB   
22-Jun-2019 00:00:10 32/88 KB   
22-Jun-2019 00:00:10 33/88 KB   
22-Jun-2019 00:00:10 35/88 KB   
22-Jun-2019 00:00:10 36/88 KB   
22-Jun-2019 00:00:10 37/88 KB   
22-Jun-2019 00:00:10 39/88 KB   
22-Jun-2019 00:00:10 40/88 KB   
22-Jun-2019 00:00:10 41/88 KB   
22-Jun-2019 00:00:10 43/88 KB   
22-Jun-2019 00:00:10 44/88 KB   
22-Jun-2019 00:00:10 45/88 KB   
22-Jun-2019 00:00:10 47/88 KB   
22-Jun-2019 00:00:10 48/88 KB   
22-Jun-2019 00:00:10 49/88 KB   
22-Jun-2019 00:00:10 51/88 KB   
22-Jun-2019 00:00:10 52/88 KB   
22-Jun-2019 00:00:10 53/88 KB   
22-Jun-2019 00:00:10 55/88 KB   
22-Jun-2019 00:00:10 56/88 KB   
22-Jun-2019 00:00:10 57/88 KB   
22-Jun-2019 00:00:10 59/88 KB   
22-Jun-2019 00:00:10 59/88 KB   
22-Jun-2019 00:00:10 61/88 KB   
22-Jun-2019 00:00:10 62/88 KB   
22-Jun-2019 00:00:10 63/88 KB   
22-Jun-2019 00:00:10 63/88 KB   
22-Jun-2019 00:00:10 65/88 KB   
22-Jun-2019 00:00:10 66/88 KB   
22-Jun-2019 00:00:10 67/88 KB   
22-Jun-2019 00:00:10 69/88 KB   
22-Jun-2019 00:00:10 70/88 KB   
22-Jun-2019 00:00:10 71/88 KB   
22-Jun-2019 00:00:10 73/88 KB   
22-Jun-2019 00:00:10 74/88 KB   
22-Jun-2019 00:00:10 75/88 KB   
22-Jun-2019 00:00:10 77/88 KB   
22-Jun-2019 00:00:10 78/88 KB   
22-Jun-2019 00:00:10 79/88 KB   
22-Jun-2019 00:00:10 81/88 KB   
22-Jun-2019 00:00:10 82/88 KB   
22-Jun-2019 00:00:10 83/88 KB   
22-Jun-2019 00:00:10 85/88 KB   
22-Jun-2019 00:00:10 86/88 KB   
22-Jun-2019 00:00:10 87/88 KB   
22-Jun-2019 00:00:10 88/88 KB   
22-Jun-2019 00:00:10            
22-Jun-2019 00:00:10 Downloaded: https://repo.spring.io/release/org/springframework/boot/spring-boot-dependencies/1.5.1.RELEASE/spring-boot-dependencies-1.5.1.RELEASE.pom (88 KB at 297.4 KB/sec)
22-Jun-2019 00:00:11 [INFO] Initializing Artifactory Build-Info Recording
22-Jun-2019 00:00:11 [INFO] ------------------------------------------------------------------------
22-Jun-2019 00:00:11 [INFO] Reactor Build Order:
22-Jun-2019 00:00:11 [INFO]
22-Jun-2019 00:00:11 [INFO] OAuth for Spring Security
22-Jun-2019 00:00:11 [INFO] OAuth 1(a) for Spring Security
22-Jun-2019 00:00:11 [INFO] OAuth2 for Spring Security
22-Jun-2019 00:00:11 [INFO] spring-oauth2-tests
22-Jun-2019 00:00:11 [INFO] spring-oauth2-tests-common
22-Jun-2019 00:00:11 [INFO] spring-oauth2-tests-vanilla
22-Jun-2019 00:00:11 [INFO] spring-oauth2-tests-mappings
22-Jun-2019 00:00:11 [INFO] spring-oauth2-tests-form
22-Jun-2019 00:00:11 [INFO] spring-oauth2-tests-jwt
22-Jun-2019 00:00:11 [INFO] spring-oauth2-tests-approval
22-Jun-2019 00:00:11 [INFO] spring-oauth2-tests-jdbc
22-Jun-2019 00:00:11 [INFO] spring-oauth2-tests-jpa
22-Jun-2019 00:00:11 [INFO] spring-oauth2-tests-jaxb
22-Jun-2019 00:00:11 [INFO] spring-oauth-tests-custom-grant
22-Jun-2019 00:00:11 [INFO] spring-oauth2-tests-multi
22-Jun-2019 00:00:11 [INFO] spring-oauth2-tests-client
22-Jun-2019 00:00:11 [INFO] spring-oauth2-tests-resource
22-Jun-2019 00:00:11 [INFO] spring-oauth2-tests-custom-authentication
22-Jun-2019 00:00:11 [INFO] spring-oauth2-tests-xml
22-Jun-2019 00:00:11 [INFO] spring-oauth2-tests-xml-common
22-Jun-2019 00:00:11 [INFO] spring-oauth2-tests-xml-vanilla
22-Jun-2019 00:00:11 [INFO] spring-oauth2-tests-xml-mappings
22-Jun-2019 00:00:11 [INFO] spring-oauth2-tests-xml-form
22-Jun-2019 00:00:11 [INFO] spring-oauth2-tests-xml-jwt
22-Jun-2019 00:00:11 [INFO] spring-oauth2-tests-xml-approval
22-Jun-2019 00:00:11 [INFO] spring-oauth2-tests-xml-jdbc
22-Jun-2019 00:00:11 [INFO] spring-oauth2-tests-xml-client
22-Jun-2019 00:00:11 [INFO] OAuth for Spring Security - Integration Tests
22-Jun-2019 00:00:11 [INFO] OAuth for Spring Security - Sparklr (OAuth 1 Provider Example)
22-Jun-2019 00:00:11 [INFO] OAuth for Spring Security - Tonr (OAuth 1 Consumer Example)
22-Jun-2019 00:00:11 [INFO] OAuth for Spring Security - Sparklr2 (OAuth 2 Provider Example)
22-Jun-2019 00:00:11 [INFO] OAuth for Spring Security - Tonr2 (OAuth 2 Client Example)
22-Jun-2019 00:00:11 [INFO] OAuth for Spring Security - Samples
22-Jun-2019 00:00:11 [INFO]                                                                         
22-Jun-2019 00:00:11 [INFO] ------------------------------------------------------------------------
22-Jun-2019 00:00:11 [INFO] Building OAuth for Spring Security 2.3.7.BUILD-SNAPSHOT
22-Jun-2019 00:00:11 [INFO] ------------------------------------------------------------------------
22-Jun-2019 00:00:12 [INFO]
22-Jun-2019 00:00:12 [INFO] --- maven-clean-plugin:2.5:clean (default-clean) @ spring-security-oauth-parent ---
22-Jun-2019 00:00:12 [INFO]
22-Jun-2019 00:00:12 [INFO] >>> maven-source-plugin:2.1.2:jar (attach-sources) > generate-sources @ spring-security-oauth-parent >>>
22-Jun-2019 00:00:12 [INFO]
22-Jun-2019 00:00:12 [INFO] <<< maven-source-plugin:2.1.2:jar (attach-sources) < generate-sources @ spring-security-oauth-parent <<<
22-Jun-2019 00:00:12 [INFO]
22-Jun-2019 00:00:12 [INFO] --- maven-source-plugin:2.1.2:jar (attach-sources) @ spring-security-oauth-parent ---
22-Jun-2019 00:00:12 [INFO]
22-Jun-2019 00:00:12 [INFO] --- maven-javadoc-plugin:2.9.1:jar (javadoc) @ spring-security-oauth-parent ---
22-Jun-2019 00:00:12 [INFO] Not executing Javadoc as the project is not a Java classpath-capable package
22-Jun-2019 00:00:12 [INFO]
22-Jun-2019 00:00:12 [INFO] --- maven-install-plugin:2.4:install (default-install) @ spring-security-oauth-parent ---
22-Jun-2019 00:00:12 [INFO] Installing /opt/bamboo-home/xml-data/build-dir/SECOAUTH-NIGHTLY-JOB1/pom.xml to /home/bamboo/.m2/repository/org/springframework/security/oauth/spring-security-oauth-parent/2.3.7.BUILD-SNAPSHOT/spring-security-oauth-parent-2.3.7.BUILD-SNAPSHOT.pom
22-Jun-2019 00:00:12 [INFO]                                                                         
22-Jun-2019 00:00:12 [INFO] ------------------------------------------------------------------------
22-Jun-2019 00:00:12 [INFO] Building OAuth 1(a) for Spring Security 2.3.7.BUILD-SNAPSHOT
22-Jun-2019 00:00:12 [INFO] ------------------------------------------------------------------------
22-Jun-2019 00:00:12 [INFO]
22-Jun-2019 00:00:12 [INFO] --- maven-clean-plugin:2.5:clean (default-clean) @ spring-security-oauth ---
22-Jun-2019 00:00:12 [INFO]
22-Jun-2019 00:00:12 [INFO] --- maven-resources-plugin:2.6:resources (default-resources) @ spring-security-oauth ---
22-Jun-2019 00:00:13 [INFO] Using 'UTF-8' encoding to copy filtered resources.
22-Jun-2019 00:00:13 [INFO] Copying 3 resources
22-Jun-2019 00:00:13 [INFO]
22-Jun-2019 00:00:13 [INFO] --- maven-compiler-plugin:2.3.2:compile (default-compile) @ spring-security-oauth ---
22-Jun-2019 00:00:13 [INFO] Compiling 108 source files to /opt/bamboo-home/xml-data/build-dir/SECOAUTH-NIGHTLY-JOB1/spring-security-oauth/target/classes
22-Jun-2019 00:00:14 [WARNING] /opt/bamboo-home/xml-data/build-dir/SECOAUTH-NIGHTLY-JOB1/spring-security-oauth/src/main/java/org/springframework/security/oauth/consumer/net/OAuthOverHttpsURLStreamHandler.java:[36,78] Handler is internal proprietary API and may be removed in a future release
22-Jun-2019 00:00:14 [WARNING] /opt/bamboo-home/xml-data/build-dir/SECOAUTH-NIGHTLY-JOB1/spring-security-oauth/src/main/java/org/springframework/security/oauth/consumer/net/OAuthOverHttpURLStreamHandler.java:[36,76] Handler is internal proprietary API and may be removed in a future release
22-Jun-2019 00:00:14 [INFO]
22-Jun-2019 00:00:14 [INFO] --- maven-resources-plugin:2.6:testResources (default-testResources) @ spring-security-oauth ---
22-Jun-2019 00:00:14 [INFO] Using 'UTF-8' encoding to copy filtered resources.
22-Jun-2019 00:00:14 [INFO] Copying 8 resources
22-Jun-2019 00:00:14 [INFO]
22-Jun-2019 00:00:14 [INFO] --- maven-compiler-plugin:2.3.2:testCompile (default-testCompile) @ spring-security-oauth ---
22-Jun-2019 00:00:14 [INFO] Compiling 22 source files to /opt/bamboo-home/xml-data/build-dir/SECOAUTH-NIGHTLY-JOB1/spring-security-oauth/target/test-classes
22-Jun-2019 00:00:15 [WARNING] /opt/bamboo-home/xml-data/build-dir/SECOAUTH-NIGHTLY-JOB1/spring-security-oauth/src/test/java/org/springframework/security/oauth/consumer/client/CoreOAuthConsumerSupportTests.java:[65,32] Handler is internal proprietary API and may be removed in a future release
22-Jun-2019 00:00:15 [WARNING] /opt/bamboo-home/xml-data/build-dir/SECOAUTH-NIGHTLY-JOB1/spring-security-oauth/src/test/java/org/springframework/security/oauth/consumer/client/CoreOAuthConsumerSupportTests.java:[483,54] Handler is internal proprietary API and may be removed in a future release
22-Jun-2019 00:00:15 [INFO]
22-Jun-2019 00:00:15 [INFO] --- maven-surefire-plugin:2.12.4:test (default-test) @ spring-security-oauth ---
22-Jun-2019 00:00:15 [INFO] Surefire report directory: /opt/bamboo-home/xml-data/build-dir/SECOAUTH-NIGHTLY-JOB1/spring-security-oauth/target/surefire-reports
22-Jun-2019 00:00:15
22-Jun-2019 00:00:15 -------------------------------------------------------
22-Jun-2019 00:00:15 T E S T S
22-Jun-2019 00:00:15 -------------------------------------------------------
22-Jun-2019 00:00:15 Running org.springframework.security.oauth.config.FilterChainInitializationTests
22-Jun-2019 00:00:16 Tests run: 1, Failures: 0, Errors: 0, Skipped: 0, Time elapsed: 1.058 sec
22-Jun-2019 00:00:16 Running org.springframework.security.oauth.config.AuthorizationServerBeanDefinitionParserTests
22-Jun-2019 00:00:16 Tests run: 2, Failures: 0, Errors: 0, Skipped: 0, Time elapsed: 0.338 sec
22-Jun-2019 00:00:16 Running org.springframework.security.oauth.config.ConsumerServiceBeanDefinitionParserTests
22-Jun-2019 00:00:17 Tests run: 2, Failures: 0, Errors: 0, Skipped: 0, Time elapsed: 0.258 sec
22-Jun-2019 00:00:17 Running org.springframework.security.oauth.provider.nonce.InMemoryNonceServicesTests
22-Jun-2019 00:00:17 Tests run: 5, Failures: 0, Errors: 0, Skipped: 0, Time elapsed: 0.004 sec
22-Jun-2019 00:00:17 Running org.springframework.security.oauth.provider.filter.ProtectedResourceProcessingFilterTests
22-Jun-2019 00:00:17 Tests run: 1, Failures: 0, Errors: 0, Skipped: 0, Time elapsed: 0.139 sec
22-Jun-2019 00:00:17 Running org.springframework.security.oauth.provider.filter.OAuthProcessingFilterTests
22-Jun-2019 00:00:17 Tests run: 3, Failures: 0, Errors: 0, Skipped: 0, Time elapsed: 0.043 sec
22-Jun-2019 00:00:17 Running org.springframework.security.oauth.provider.filter.OAuthUserAuthorizationProcessingFilterTests
22-Jun-2019 00:00:17 Tests run: 1, Failures: 0, Errors: 0, Skipped: 0, Time elapsed: 0.004 sec
22-Jun-2019 00:00:17 Running org.springframework.security.oauth.provider.filter.UserAuthorizationSuccessfulAuthenticationHandlerTests
22-Jun-2019 00:00:17 Tests run: 1, Failures: 0, Errors: 0, Skipped: 0, Time elapsed: 0.003 sec
22-Jun-2019 00:00:17 Running org.springframework.security.oauth.provider.filter.AccessTokenProcessingFilterTests
22-Jun-2019 00:00:17 Tests run: 2, Failures: 0, Errors: 0, Skipped: 0, Time elapsed: 0.002 sec
22-Jun-2019 00:00:17 Running org.springframework.security.oauth.provider.filter.UnauthenticatedRequestTokenProcessingFilterTests
22-Jun-2019 00:00:17 Tests run: 2, Failures: 0, Errors: 0, Skipped: 0, Time elapsed: 0.004 sec
22-Jun-2019 00:00:17 Running org.springframework.security.oauth.provider.CoreOAuthProviderSupportTests
22-Jun-2019 00:00:17 Tests run: 2, Failures: 0, Errors: 0, Skipped: 0, Time elapsed: 0.003 sec
22-Jun-2019 00:00:17 Running org.springframework.security.oauth.common.signature.PlainTextSignatureMethodTests
22-Jun-2019 00:00:17 Tests run: 1, Failures: 0, Errors: 0, Skipped: 0, Time elapsed: 0 sec
22-Jun-2019 00:00:17 Running org.springframework.security.oauth.common.signature.CoreOAuthSignatureMethodFactoryTests
22-Jun-2019 00:00:17 Tests run: 1, Failures: 0, Errors: 0, Skipped: 0, Time elapsed: 0.159 sec
22-Jun-2019 00:00:17 Running org.springframework.security.oauth.common.signature.RSA_SHA1SignatureMethodTests
22-Jun-2019 00:00:17 Tests run: 2, Failures: 0, Errors: 0, Skipped: 0, Time elapsed: 0.1 sec
22-Jun-2019 00:00:17 Running org.springframework.security.oauth.common.signature.HMAC_SHA1SignatureMethodTests
22-Jun-2019 00:00:17 Tests run: 3, Failures: 0, Errors: 0, Skipped: 0, Time elapsed: 0.027 sec
22-Jun-2019 00:00:17 Running org.springframework.security.oauth.common.OAuthCodecTests
22-Jun-2019 00:00:17 Tests run: 1, Failures: 0, Errors: 0, Skipped: 0, Time elapsed: 0 sec
22-Jun-2019 00:00:17 Running org.springframework.security.oauth.consumer.client.CoreOAuthConsumerSupportTests
22-Jun-2019 00:00:17 Tests run: 10, Failures: 0, Errors: 0, Skipped: 0, Time elapsed: 0.02 sec
22-Jun-2019 00:00:17 Running org.springframework.security.oauth.consumer.client.OAuthRestTemplateTests
22-Jun-2019 00:00:17 Tests run: 2, Failures: 0, Errors: 0, Skipped: 0, Time elapsed: 0.117 sec
22-Jun-2019 00:00:17 Running org.springframework.security.oauth.consumer.GoogleOAuthTests
22-Jun-2019 00:00:17 Tests run: 1, Failures: 0, Errors: 0, Skipped: 0, Time elapsed: 0 sec
22-Jun-2019 00:00:17 Running org.springframework.security.oauth.consumer.filter.OAuthConsumerContextFilterTests
22-Jun-2019 00:00:17 Tests run: 2, Failures: 0, Errors: 0, Skipped: 0, Time elapsed: 0.018 sec
22-Jun-2019 00:00:17 Running org.springframework.security.oauth.consumer.rememberme.HttpSessionOAuthRememberMeServicesTests
22-Jun-2019 00:00:17 Tests run: 4, Failures: 0, Errors: 0, Skipped: 0, Time elapsed: 0.008 sec
22-Jun-2019 00:00:17 Running net.oauth.signature.GoogleCodeCompatibilityTests
22-Jun-2019 00:00:17 Tests run: 2, Failures: 0, Errors: 0, Skipped: 0, Time elapsed: 0.013 sec
22-Jun-2019 00:00:17
22-Jun-2019 00:00:17 Results :
22-Jun-2019 00:00:17
22-Jun-2019 00:00:17 Tests run: 51, Failures: 0, Errors: 0, Skipped: 0
22-Jun-2019 00:00:17
22-Jun-2019 00:00:18 [INFO]
22-Jun-2019 00:00:18 [INFO] --- maven-jar-plugin:2.4:jar (default-jar) @ spring-security-oauth ---
22-Jun-2019 00:00:18 [INFO] Building jar: /opt/bamboo-home/xml-data/build-dir/SECOAUTH-NIGHTLY-JOB1/spring-security-oauth/target/spring-security-oauth-2.3.7.BUILD-SNAPSHOT.jar
22-Jun-2019 00:00:18 [INFO]
22-Jun-2019 00:00:18 [INFO] >>> maven-source-plugin:2.1.2:jar (attach-sources) > generate-sources @ spring-security-oauth >>>
22-Jun-2019 00:00:18 [INFO]
22-Jun-2019 00:00:18 [INFO] <<< maven-source-plugin:2.1.2:jar (attach-sources) < generate-sources @ spring-security-oauth <<<
22-Jun-2019 00:00:18 [INFO]
22-Jun-2019 00:00:18 [INFO] --- maven-source-plugin:2.1.2:jar (attach-sources) @ spring-security-oauth ---
22-Jun-2019 00:00:18 [INFO] org already added, skipping
22-Jun-2019 00:00:18 [INFO] org/springframework already added, skipping
22-Jun-2019 00:00:18 [INFO] org/springframework/security already added, skipping
22-Jun-2019 00:00:18 [INFO] org/springframework/security/oauth already added, skipping
22-Jun-2019 00:00:18 [INFO] Building jar: /opt/bamboo-home/xml-data/build-dir/SECOAUTH-NIGHTLY-JOB1/spring-security-oauth/target/spring-security-oauth-2.3.7.BUILD-SNAPSHOT-sources.jar
22-Jun-2019 00:00:18 [INFO] org already added, skipping
22-Jun-2019 00:00:18 [INFO] org/springframework already added, skipping
22-Jun-2019 00:00:18 [INFO] org/springframework/security already added, skipping
22-Jun-2019 00:00:18 [INFO] org/springframework/security/oauth already added, skipping
22-Jun-2019 00:00:18 [INFO]
22-Jun-2019 00:00:18 [INFO] --- maven-javadoc-plugin:2.9.1:jar (javadoc) @ spring-security-oauth ---
22-Jun-2019 00:00:21 [INFO]
22-Jun-2019 00:00:21 2 warnings
22-Jun-2019 00:00:21 [WARNING] Javadoc Warnings
22-Jun-2019 00:00:21 [WARNING] /opt/bamboo-home/xml-data/build-dir/SECOAUTH-NIGHTLY-JOB1/spring-security-oauth/src/main/java/org/springframework/security/oauth/consumer/net/OAuthOverHttpURLStreamHandler.java:36: warning: Handler is internal proprietary API and may be removed in a future release
22-Jun-2019 00:00:21 [WARNING] public class OAuthOverHttpURLStreamHandler extends sun.net.www.protocol.http.Handler {
22-Jun-2019 00:00:21 [WARNING] ^
22-Jun-2019 00:00:21 [WARNING] /opt/bamboo-home/xml-data/build-dir/SECOAUTH-NIGHTLY-JOB1/spring-security-oauth/src/main/java/org/springframework/security/oauth/consumer/net/OAuthOverHttpsURLStreamHandler.java:36: warning: Handler is internal proprietary API and may be removed in a future release
22-Jun-2019 00:00:21 [WARNING] public class OAuthOverHttpsURLStreamHandler extends sun.net.www.protocol.https.Handler {
22-Jun-2019 00:00:21 [WARNING] ^
22-Jun-2019 00:00:21 [INFO] Building jar: /opt/bamboo-home/xml-data/build-dir/SECOAUTH-NIGHTLY-JOB1/spring-security-oauth/target/spring-security-oauth-2.3.7.BUILD-SNAPSHOT-javadoc.jar
22-Jun-2019 00:00:21 [INFO]
22-Jun-2019 00:00:21 [INFO] --- maven-install-plugin:2.4:install (default-install) @ spring-security-oauth ---
22-Jun-2019 00:00:21 [INFO] Installing /opt/bamboo-home/xml-data/build-dir/SECOAUTH-NIGHTLY-JOB1/spring-security-oauth/target/spring-security-oauth-2.3.7.BUILD-SNAPSHOT.jar to /home/bamboo/.m2/repository/org/springframework/security/oauth/spring-security-oauth/2.3.7.BUILD-SNAPSHOT/spring-security-oauth-2.3.7.BUILD-SNAPSHOT.jar
22-Jun-2019 00:00:21 [INFO] Installing /opt/bamboo-home/xml-data/build-dir/SECOAUTH-NIGHTLY-JOB1/spring-security-oauth/pom.xml to /home/bamboo/.m2/repository/org/springframework/security/oauth/spring-security-oauth/2.3.7.BUILD-SNAPSHOT/spring-security-oauth-2.3.7.BUILD-SNAPSHOT.pom
22-Jun-2019 00:00:21 [INFO] Installing /opt/bamboo-home/xml-data/build-dir/SECOAUTH-NIGHTLY-JOB1/spring-security-oauth/target/spring-security-oauth-2.3.7.BUILD-SNAPSHOT-sources.jar to /home/bamboo/.m2/repository/org/springframework/security/oauth/spring-security-oauth/2.3.7.BUILD-SNAPSHOT/spring-security-oauth-2.3.7.BUILD-SNAPSHOT-sources.jar
22-Jun-2019 00:00:21 [INFO] Installing /opt/bamboo-home/xml-data/build-dir/SECOAUTH-NIGHTLY-JOB1/spring-security-oauth/target/spring-security-oauth-2.3.7.BUILD-SNAPSHOT-javadoc.jar to /home/bamboo/.m2/repository/org/springframework/security/oauth/spring-security-oauth/2.3.7.BUILD-SNAPSHOT/spring-security-oauth-2.3.7.BUILD-SNAPSHOT-javadoc.jar
22-Jun-2019 00:00:21 [INFO]                                                                         
22-Jun-2019 00:00:21 [INFO] ------------------------------------------------------------------------
22-Jun-2019 00:00:21 [INFO] Building OAuth2 for Spring Security 2.3.7.BUILD-SNAPSHOT
22-Jun-2019 00:00:21 [INFO] ------------------------------------------------------------------------
22-Jun-2019 00:00:21 [INFO]
22-Jun-2019 00:00:21 [INFO] --- maven-clean-plugin:2.5:clean (default-clean) @ spring-security-oauth2 ---
22-Jun-2019 00:00:21 [INFO]
22-Jun-2019 00:00:21 [INFO] --- maven-resources-plugin:2.6:resources (default-resources) @ spring-security-oauth2 ---
22-Jun-2019 00:00:21 [INFO] Using 'UTF-8' encoding to copy filtered resources.
22-Jun-2019 00:00:21 [INFO] Copying 4 resources
22-Jun-2019 00:00:21 [INFO]
22-Jun-2019 00:00:21 [INFO] --- maven-compiler-plugin:2.3.2:compile (default-compile) @ spring-security-oauth2 ---
22-Jun-2019 00:00:21 [INFO] Compiling 249 source files to /opt/bamboo-home/xml-data/build-dir/SECOAUTH-NIGHTLY-JOB1/spring-security-oauth2/target/classes
22-Jun-2019 00:00:24 [INFO]
22-Jun-2019 00:00:24 [INFO] --- maven-resources-plugin:2.6:testResources (default-testResources) @ spring-security-oauth2 ---
22-Jun-2019 00:00:24 [INFO] Using 'UTF-8' encoding to copy filtered resources.
22-Jun-2019 00:00:24 [INFO] Copying 21 resources
22-Jun-2019 00:00:24 [INFO]
22-Jun-2019 00:00:24 [INFO] --- maven-compiler-plugin:2.3.2:testCompile (default-testCompile) @ spring-security-oauth2 ---
22-Jun-2019 00:00:24 [INFO] Compiling 120 source files to /opt/bamboo-home/xml-data/build-dir/SECOAUTH-NIGHTLY-JOB1/spring-security-oauth2/target/test-classes
22-Jun-2019 00:00:26 [INFO]
22-Jun-2019 00:00:26 [INFO] --- maven-surefire-plugin:2.12.4:test (default-test) @ spring-security-oauth2 ---
22-Jun-2019 00:00:26 [INFO] Surefire report directory: /opt/bamboo-home/xml-data/build-dir/SECOAUTH-NIGHTLY-JOB1/spring-security-oauth2/target/surefire-reports
22-Jun-2019 00:00:26
22-Jun-2019 00:00:26 -------------------------------------------------------
22-Jun-2019 00:00:26 T E S T S
22-Jun-2019 00:00:26 -------------------------------------------------------
22-Jun-2019 00:00:27 Running org.springframework.security.oauth2.config.annotation.TokenServicesMultipleBeansTests
22-Jun-2019 00:00:28 Tests run: 1, Failures: 0, Errors: 0, Skipped: 0, Time elapsed: 1.474 sec
22-Jun-2019 00:00:28 Running org.springframework.security.oauth2.config.annotation.Gh501EnableAuthorizationServerTests
22-Jun-2019 00:00:29 Tests run: 1, Failures: 0, Errors: 0, Skipped: 0, Time elapsed: 0.667 sec
22-Jun-2019 00:00:29 Running org.springframework.security.oauth2.config.annotation.ClientConfigurationTests
22-Jun-2019 00:00:29 Tests run: 1, Failures: 0, Errors: 0, Skipped: 0, Time elapsed: 0.231 sec
22-Jun-2019 00:00:29 Running org.springframework.security.oauth2.config.annotation.ResourceServerConfigurationTests
22-Jun-2019 00:00:30 [WARN] TokenEndpoint - Handling error: InvalidRequestException, Missing grant type
22-Jun-2019 00:00:30 [WARN] PageNotFound - No mapping found for HTTP request with URI [/] in DispatcherServlet with name ''
22-Jun-2019 00:00:30 [WARN] PageNotFound - No mapping found for HTTP request with URI [/] in DispatcherServlet with name ''
22-Jun-2019 00:00:30 [WARN] PageNotFound - No mapping found for HTTP request with URI [/] in DispatcherServlet with name ''
22-Jun-2019 00:00:30 [WARN] PageNotFound - No mapping found for HTTP request with URI [/] in DispatcherServlet with name ''
22-Jun-2019 00:00:31 [WARN] TokenEndpoint - Handling error: InvalidRequestException, Missing grant type
22-Jun-2019 00:00:31 Tests run: 9, Failures: 0, Errors: 0, Skipped: 0, Time elapsed: 1.574 sec
22-Jun-2019 00:00:31 Running org.springframework.security.oauth2.config.annotation.AuthorizationServerConfigurationTests
22-Jun-2019 00:00:31 [WARN] AnnotationConfigWebApplicationContext - Exception encountered during context initialization - cancelling refresh attempt: org.springframework.beans.factory.UnsatisfiedDependencyException: Error creating bean with name 'org.springframework.security.config.annotation.web.configuration.WebSecurityConfiguration': Unsatisfied dependency expressed through method 'setFilterChainProxySecurityConfigurer' parameter 1; nested exception is org.springframework.beans.factory.BeanExpressionException: Expression parsing failed; nested exception is org.springframework.beans.factory.UnsatisfiedDependencyException: Error creating bean with name 'org.springframework.security.oauth2.config.annotation.web.configuration.AuthorizationServerSecurityConfiguration': Unsatisfied dependency expressed through field 'configurers'; nested exception is org.springframework.beans.factory.NoSuchBeanDefinitionException: No qualifying bean of type 'java.util.List<org.springframework.security.oauth2.config.annotation.web.configuration.AuthorizationServerConfigurer>' available: expected at least 1 bean which qualifies as autowire candidate. Dependency annotations: {@org.springframework.beans.factory.annotation.Autowired(required=true)}
22-Jun-2019 00:00:32 [WARN] JwtAccessTokenConverter - Unable to create an RSA verifier from verifierKey (ignoreable if using MAC)
22-Jun-2019 00:00:32 [WARN] AnnotationConfigWebApplicationContext - Exception encountered during context initialization - cancelling refresh attempt: org.springframework.beans.factory.UnsatisfiedDependencyException: Error creating bean with name 'authorizationServerConfigurationTests.AuthorizationServerTypes': Unsatisfied dependency expressed through field 'tokenServices'; nested exception is org.springframework.beans.factory.BeanCreationException: Error creating bean with name 'org.springframework.security.oauth2.config.annotation.web.configuration.AuthorizationServerEndpointsConfiguration': Invocation of init method failed; nested exception is java.lang.AssertionError
22-Jun-2019 00:00:33 Tests run: 20, Failures: 0, Errors: 0, Skipped: 0, Time elapsed: 2.159 sec
22-Jun-2019 00:00:33 Running org.springframework.security.oauth2.config.annotation.Gh808EnableAuthorizationServerTests
22-Jun-2019 00:00:33 Tests run: 2, Failures: 0, Errors: 0, Skipped: 0, Time elapsed: 0.144 sec
22-Jun-2019 00:00:33 Running org.springframework.security.oauth2.config.xml.ResourceServerBeanDefinitionParserTests
22-Jun-2019 00:00:33 Tests run: 2, Failures: 0, Errors: 0, Skipped: 0, Time elapsed: 0.179 sec
22-Jun-2019 00:00:33 Running org.springframework.security.oauth2.config.xml.AuthorizationServerInvalidParserTests
22-Jun-2019 00:00:33 Tests run: 1, Failures: 0, Errors: 0, Skipped: 0, Time elapsed: 0.028 sec
22-Jun-2019 00:00:33 Running org.springframework.security.oauth2.config.xml.AuthorizationServerBeanDefinitionParserTests
22-Jun-2019 00:00:34 Tests run: 12, Failures: 0, Errors: 0, Skipped: 0, Time elapsed: 0.472 sec
22-Jun-2019 00:00:34 Running org.springframework.security.oauth2.config.xml.ClientDetailsServiceBeanDefinitionParserTests
22-Jun-2019 00:00:34 Tests run: 3, Failures: 0, Errors: 0, Skipped: 0, Time elapsed: 0.035 sec
22-Jun-2019 00:00:34 Running org.springframework.security.oauth2.config.xml.ResourceBeanDefinitionParserTests
22-Jun-2019 00:00:34 Tests run: 7, Failures: 0, Errors: 0, Skipped: 0, Time elapsed: 0.063 sec
22-Jun-2019 00:00:34 Running org.springframework.security.oauth2.config.xml.InvalidResourceBeanDefinitionParserTests
22-Jun-2019 00:00:34 Tests run: 5, Failures: 0, Errors: 0, Skipped: 0, Time elapsed: 0.055 sec
22-Jun-2019 00:00:34 Running org.springframework.security.oauth2.config.xml.AuthorizationServerCustomGrantParserTests
22-Jun-2019 00:00:34 Tests run: 1, Failures: 0, Errors: 0, Skipped: 0, Time elapsed: 0.022 sec
22-Jun-2019 00:00:34 Running org.springframework.security.oauth2.config.xml.AuthorizationServerClientCredentialsPasswordInvalidXmlTests
22-Jun-2019 00:00:34 Tests run: 2, Failures: 0, Errors: 0, Skipped: 0, Time elapsed: 0.324 sec
22-Jun-2019 00:00:34 Running org.springframework.security.oauth2.config.xml.AuthorizationServerClientCredentialsPasswordValidXmlTests
22-Jun-2019 00:00:34 Tests run: 2, Failures: 0, Errors: 0, Skipped: 0, Time elapsed: 0.211 sec
22-Jun-2019 00:00:34 Running org.springframework.security.oauth2.http.converter.jaxb.JaxbOAuth2ExceptionMessageConverterTests
22-Jun-2019 00:00:36 Tests run: 22, Failures: 0, Errors: 0, Skipped: 0, Time elapsed: 1.497 sec
22-Jun-2019 00:00:36 Running org.springframework.security.oauth2.http.converter.jaxb.JaxbOAuth2AccessTokenMessageConverterTests
22-Jun-2019 00:00:37 Tests run: 8, Failures: 0, Errors: 0, Skipped: 0, Time elapsed: 0.874 sec
22-Jun-2019 00:00:37 Running org.springframework.security.oauth2.client.http.OAuth2ErrorHandlerTests
22-Jun-2019 00:00:37 Tests run: 12, Failures: 0, Errors: 0, Skipped: 0, Time elapsed: 0.057 sec
22-Jun-2019 00:00:37 Running org.springframework.security.oauth2.client.DefaultOAuth2RequestAuthenticatorTests
22-Jun-2019 00:00:37 Tests run: 6, Failures: 0, Errors: 0, Skipped: 0, Time elapsed: 0.002 sec
22-Jun-2019 00:00:37 Running org.springframework.security.oauth2.client.token.grant.password.ResourceOwnerPasswordAccessTokenProviderTests
22-Jun-2019 00:00:37 Tests run: 3, Failures: 0, Errors: 0, Skipped: 0, Time elapsed: 0 sec
22-Jun-2019 00:00:37 Running org.springframework.security.oauth2.client.token.grant.implicit.ImplicitAccessTokenProviderTests
22-Jun-2019 00:00:37 Tests run: 2, Failures: 0, Errors: 0, Skipped: 0, Time elapsed: 0 sec
22-Jun-2019 00:00:37 Running org.springframework.security.oauth2.client.token.grant.code.AuthorizationCodeAccessTokenProviderWithConversionTests
22-Jun-2019 00:00:37 Tests run: 4, Failures: 0, Errors: 0, Skipped: 0, Time elapsed: 0.123 sec
22-Jun-2019 00:00:37 Running org.springframework.security.oauth2.client.token.grant.code.AuthorizationCodeAccessTokenProviderTests
22-Jun-2019 00:00:37 Tests run: 5, Failures: 0, Errors: 0, Skipped: 0, Time elapsed: 0.001 sec
22-Jun-2019 00:00:37 Running org.springframework.security.oauth2.client.token.grant.code.AuthorizationCodeResourceDetailsTests
22-Jun-2019 00:00:37 Tests run: 2, Failures: 0, Errors: 0, Skipped: 0, Time elapsed: 0 sec
22-Jun-2019 00:00:37 Running org.springframework.security.oauth2.client.token.JdbcClientTokenServicesTests
22-Jun-2019 00:00:37 Tests run: 3, Failures: 0, Errors: 0, Skipped: 0, Time elapsed: 0.314 sec
22-Jun-2019 00:00:37 Running org.springframework.security.oauth2.client.token.OAuth2AccessTokenSupportTests
22-Jun-2019 00:00:37 Tests run: 5, Failures: 0, Errors: 0, Skipped: 0, Time elapsed: 0.025 sec
22-Jun-2019 00:00:37 Running org.springframework.security.oauth2.client.token.AccessTokenProviderChainTests
22-Jun-2019 00:00:37 Tests run: 15, Failures: 0, Errors: 0, Skipped: 0, Time elapsed: 0.028 sec
22-Jun-2019 00:00:37 Running org.springframework.security.oauth2.client.filter.OAuth2ClientContextFilterTests
22-Jun-2019 00:00:37 Tests run: 11, Failures: 0, Errors: 0, Skipped: 0, Time elapsed: 0.007 sec
22-Jun-2019 00:00:37 Running org.springframework.security.oauth2.client.filter.OAuth2ClientAuthenticationProcessingFilterTests
22-Jun-2019 00:00:37 Tests run: 5, Failures: 0, Errors: 0, Skipped: 0, Time elapsed: 0.017 sec
22-Jun-2019 00:00:37 Running org.springframework.security.oauth2.client.OAuth2RestTemplateTests
22-Jun-2019 00:00:37 Tests run: 12, Failures: 0, Errors: 0, Skipped: 0, Time elapsed: 0.195 sec
22-Jun-2019 00:00:37 Running org.springframework.security.oauth2.provider.request.DefaultAuthorizationRequestFactoryTests
22-Jun-2019 00:00:37 Tests run: 9, Failures: 0, Errors: 0, Skipped: 0, Time elapsed: 0.003 sec
22-Jun-2019 00:00:37 Running org.springframework.security.oauth2.provider.request.DefaultOAuth2RequestValidatorTests
22-Jun-2019 00:00:37 Tests run: 3, Failures: 0, Errors: 0, Skipped: 0, Time elapsed: 0.001 sec
22-Jun-2019 00:00:37 Running org.springframework.security.oauth2.provider.password.ResourceOwnerPasswordTokenGranterTests
22-Jun-2019 00:00:37 Tests run: 7, Failures: 0, Errors: 0, Skipped: 0, Time elapsed: 0.004 sec
22-Jun-2019 00:00:37 Running org.springframework.security.oauth2.provider.client.BaseClientDetailsTests
22-Jun-2019 00:00:37 Tests run: 11, Failures: 0, Errors: 0, Skipped: 0, Time elapsed: 0.045 sec
22-Jun-2019 00:00:37 Running org.springframework.security.oauth2.provider.client.JdbcClientDetailsServiceTests
22-Jun-2019 00:00:38 Tests run: 14, Failures: 0, Errors: 0, Skipped: 0, Time elapsed: 0.272 sec
22-Jun-2019 00:00:38 Running org.springframework.security.oauth2.provider.client.ClientCredentialsTokenEndpointFilterTests
22-Jun-2019 00:00:38 Tests run: 3, Failures: 0, Errors: 0, Skipped: 0, Time elapsed: 0.021 sec
22-Jun-2019 00:00:38 Running org.springframework.security.oauth2.provider.client.ClientDetailsUserDetailsServiceTests
22-Jun-2019 00:00:38 Tests run: 2, Failures: 0, Errors: 0, Skipped: 0, Time elapsed: 0.005 sec
22-Jun-2019 00:00:38 Running org.springframework.security.oauth2.provider.approval.ApprovalStoreUserApprovalHandlerTests
22-Jun-2019 00:00:38 Tests run: 10, Failures: 0, Errors: 0, Skipped: 0, Time elapsed: 0.004 sec
22-Jun-2019 00:00:38 Running org.springframework.security.oauth2.provider.approval.DefaultUserApprovalHandlerTests
22-Jun-2019 00:00:38 Tests run: 1, Failures: 0, Errors: 0, Skipped: 0, Time elapsed: 0.001 sec
22-Jun-2019 00:00:38 Running org.springframework.security.oauth2.provider.approval.TokenStoreUserApprovalHandlerTests
22-Jun-2019 00:00:38 Tests run: 3, Failures: 0, Errors: 0, Skipped: 0, Time elapsed: 0.001 sec
22-Jun-2019 00:00:38 Running org.springframework.security.oauth2.provider.approval.JdbcApprovalStoreTests
22-Jun-2019 00:00:38 Tests run: 6, Failures: 0, Errors: 0, Skipped: 0, Time elapsed: 0.074 sec
22-Jun-2019 00:00:38 Running org.springframework.security.oauth2.provider.approval.InMemoryApprovalStoreTests
22-Jun-2019 00:00:38 Tests run: 5, Failures: 0, Errors: 0, Skipped: 0, Time elapsed: 0.001 sec
22-Jun-2019 00:00:38 Running org.springframework.security.oauth2.provider.approval.TokenApprovalStoreTests
22-Jun-2019 00:00:38 Tests run: 5, Failures: 0, Errors: 0, Skipped: 0, Time elapsed: 0.004 sec
22-Jun-2019 00:00:38 Running org.springframework.security.oauth2.provider.vote.ClientScopeVoterTests
22-Jun-2019 00:00:38 Tests run: 3, Failures: 0, Errors: 0, Skipped: 0, Time elapsed: 0.002 sec
22-Jun-2019 00:00:38 Running org.springframework.security.oauth2.provider.vote.ScopeVoterTests
22-Jun-2019 00:00:38 Tests run: 6, Failures: 0, Errors: 0, Skipped: 0, Time elapsed: 0.009 sec
22-Jun-2019 00:00:38 Running org.springframework.security.oauth2.provider.test.OAuth2RequestTests
22-Jun-2019 00:00:38 Tests run: 4, Failures: 0, Errors: 0, Skipped: 0, Time elapsed: 0 sec
22-Jun-2019 00:00:38 Running org.springframework.security.oauth2.provider.token.DefaultTokenServicesWithJdbcTests
22-Jun-2019 00:00:38 Tests run: 19, Failures: 0, Errors: 0, Skipped: 0, Time elapsed: 0.38 sec
22-Jun-2019 00:00:38 Running org.springframework.security.oauth2.provider.token.store.JwtAccessTokenConverterTests
22-Jun-2019 00:00:38 [WARN] JwtAccessTokenConverter - Unable to create an RSA verifier from verifierKey (ignoreable if using MAC)
22-Jun-2019 00:00:38 [WARN] JwtAccessTokenConverter - Unable to create an RSA verifier from verifierKey (ignoreable if using MAC)
22-Jun-2019 00:00:38 [WARN] JwtAccessTokenConverter - Unable to create an RSA verifier from verifierKey (ignoreable if using MAC)
22-Jun-2019 00:00:38 Tests run: 14, Failures: 0, Errors: 0, Skipped: 0, Time elapsed: 0.19 sec
22-Jun-2019 00:00:38 Running org.springframework.security.oauth2.provider.token.store.InMemoryTokenStoreTests
22-Jun-2019 00:00:38 Tests run: 16, Failures: 0, Errors: 0, Skipped: 0, Time elapsed: 0.011 sec
22-Jun-2019 00:00:38 Running org.springframework.security.oauth2.provider.token.store.JwtTokenStoreTests
22-Jun-2019 00:00:38 [WARN] JwtAccessTokenConverter - Unable to create an RSA verifier from verifierKey (ignoreable if using MAC)
22-Jun-2019 00:00:38 [WARN] JwtAccessTokenConverter - Unable to create an RSA verifier from verifierKey (ignoreable if using MAC)
22-Jun-2019 00:00:38 [WARN] JwtAccessTokenConverter - Unable to create an RSA verifier from verifierKey (ignoreable if using MAC)
22-Jun-2019 00:00:38 [WARN] JwtAccessTokenConverter - Unable to create an RSA verifier from verifierKey (ignoreable if using MAC)
22-Jun-2019 00:00:38 [WARN] JwtAccessTokenConverter - Unable to create an RSA verifier from verifierKey (ignoreable if using MAC)
22-Jun-2019 00:00:38 [WARN] JwtAccessTokenConverter - Unable to create an RSA verifier from verifierKey (ignoreable if using MAC)
22-Jun-2019 00:00:38 [WARN] JwtAccessTokenConverter - Unable to create an RSA verifier from verifierKey (ignoreable if using MAC)
22-Jun-2019 00:00:38 [WARN] JwtAccessTokenConverter - Unable to create an RSA verifier from verifierKey (ignoreable if using MAC)
22-Jun-2019 00:00:38 [WARN] JwtAccessTokenConverter - Unable to create an RSA verifier from verifierKey (ignoreable if using MAC)
22-Jun-2019 00:00:38 [WARN] JwtAccessTokenConverter - Unable to create an RSA verifier from verifierKey (ignoreable if using MAC)
22-Jun-2019 00:00:38 [WARN] JwtAccessTokenConverter - Unable to create an RSA verifier from verifierKey (ignoreable if using MAC)
22-Jun-2019 00:00:38 [WARN] JwtAccessTokenConverter - Unable to create an RSA verifier from verifierKey (ignoreable if using MAC)
22-Jun-2019 00:00:38 [WARN] JwtAccessTokenConverter - Unable to create an RSA verifier from verifierKey (ignoreable if using MAC)
22-Jun-2019 00:00:38 [WARN] JwtAccessTokenConverter - Unable to create an RSA verifier from verifierKey (ignoreable if using MAC)
22-Jun-2019 00:00:38 [WARN] JwtAccessTokenConverter - Unable to create an RSA verifier from verifierKey (ignoreable if using MAC)
22-Jun-2019 00:00:38 [WARN] JwtAccessTokenConverter - Unable to create an RSA verifier from verifierKey (ignoreable if using MAC)
22-Jun-2019 00:00:38 [WARN] JwtAccessTokenConverter - Unable to create an RSA verifier from verifierKey (ignoreable if using MAC)
22-Jun-2019 00:00:38 [WARN] JwtAccessTokenConverter - Unable to create an RSA verifier from verifierKey (ignoreable if using MAC)
22-Jun-2019 00:00:38 Tests run: 18, Failures: 0, Errors: 0, Skipped: 0, Time elapsed: 0.037 sec
22-Jun-2019 00:00:38 Running org.springframework.security.oauth2.provider.token.store.redis.RedisTokenStorePrefixTests
22-Jun-2019 00:00:42 Tests run: 15, Failures: 0, Errors: 0, Skipped: 0, Time elapsed: 3.118 sec
22-Jun-2019 00:00:42 Running org.springframework.security.oauth2.provider.token.store.redis.RedisTokenStoreMockTests
22-Jun-2019 00:00:42 Tests run: 2, Failures: 0, Errors: 0, Skipped: 0, Time elapsed: 0.066 sec
22-Jun-2019 00:00:42 Running org.springframework.security.oauth2.provider.token.store.redis.RedisTokenStoreTests
22-Jun-2019 00:00:45 Tests run: 16, Failures: 0, Errors: 0, Skipped: 0, Time elapsed: 3.054 sec
22-Jun-2019 00:00:45 Running org.springframework.security.oauth2.provider.token.store.JdbcTokenStoreTests
22-Jun-2019 00:00:45 Tests run: 14, Failures: 0, Errors: 0, Skipped: 0, Time elapsed: 0.17 sec
22-Jun-2019 00:00:45 Running org.springframework.security.oauth2.provider.token.DefaultTokenServicesAuthoritiesChangeTests
22-Jun-2019 00:00:45 Tests run: 1, Failures: 0, Errors: 0, Skipped: 0, Time elapsed: 0.002 sec
22-Jun-2019 00:00:45 Running org.springframework.security.oauth2.provider.token.DefaultUserAuthenticationConverterTests
22-Jun-2019 00:00:45 Tests run: 3, Failures: 0, Errors: 0, Skipped: 0, Time elapsed: 0.003 sec
22-Jun-2019 00:00:45 Running org.springframework.security.oauth2.provider.token.TokenServicesWithTokenEnhancerTests
22-Jun-2019 00:00:45 [WARN] JwtAccessTokenConverter - Unable to create an RSA verifier from verifierKey (ignoreable if using MAC)
22-Jun-2019 00:00:45 [WARN] JwtAccessTokenConverter - Unable to create an RSA verifier from verifierKey (ignoreable if using MAC)
22-Jun-2019 00:00:45 [WARN] JwtAccessTokenConverter - Unable to create an RSA verifier from verifierKey (ignoreable if using MAC)
22-Jun-2019 00:00:45 [WARN] JwtAccessTokenConverter - Unable to create an RSA verifier from verifierKey (ignoreable if using MAC)
22-Jun-2019 00:00:45 [WARN] JwtAccessTokenConverter - Unable to create an RSA verifier from verifierKey (ignoreable if using MAC)
22-Jun-2019 00:00:45 Tests run: 5, Failures: 0, Errors: 0, Skipped: 0, Time elapsed: 0.016 sec
22-Jun-2019 00:00:45 Running org.springframework.security.oauth2.provider.token.DefaultTokenServicesWithJwtTests
22-Jun-2019 00:00:45 [WARN] JwtAccessTokenConverter - Unable to create an RSA verifier from verifierKey (ignoreable if using MAC)
22-Jun-2019 00:00:45 [WARN] JwtAccessTokenConverter - Unable to create an RSA verifier from verifierKey (ignoreable if using MAC)
22-Jun-2019 00:00:45 [WARN] JwtAccessTokenConverter - Unable to create an RSA verifier from verifierKey (ignoreable if using MAC)
22-Jun-2019 00:00:45 [WARN] JwtAccessTokenConverter - Unable to create an RSA verifier from verifierKey (ignoreable if using MAC)
22-Jun-2019 00:00:45 [WARN] JwtAccessTokenConverter - Unable to create an RSA verifier from verifierKey (ignoreable if using MAC)
22-Jun-2019 00:00:45 [WARN] JwtAccessTokenConverter - Unable to create an RSA verifier from verifierKey (ignoreable if using MAC)
22-Jun-2019 00:00:45 [WARN] JwtAccessTokenConverter - Unable to create an RSA verifier from verifierKey (ignoreable if using MAC)
22-Jun-2019 00:00:45 [WARN] JwtAccessTokenConverter - Unable to create an RSA verifier from verifierKey (ignoreable if using MAC)
22-Jun-2019 00:00:45 [WARN] JwtAccessTokenConverter - Unable to create an RSA verifier from verifierKey (ignoreable if using MAC)
22-Jun-2019 00:00:45 [WARN] JwtAccessTokenConverter - Unable to create an RSA verifier from verifierKey (ignoreable if using MAC)
22-Jun-2019 00:00:45 [WARN] JwtAccessTokenConverter - Unable to create an RSA verifier from verifierKey (ignoreable if using MAC)
22-Jun-2019 00:00:45 [WARN] JwtAccessTokenConverter - Unable to create an RSA verifier from verifierKey (ignoreable if using MAC)
22-Jun-2019 00:00:45 [WARN] JwtAccessTokenConverter - Unable to create an RSA verifier from verifierKey (ignoreable if using MAC)
22-Jun-2019 00:00:45 [WARN] JwtAccessTokenConverter - Unable to create an RSA verifier from verifierKey (ignoreable if using MAC)
22-Jun-2019 00:00:45 [WARN] JwtAccessTokenConverter - Unable to create an RSA verifier from verifierKey (ignoreable if using MAC)
22-Jun-2019 00:00:45 Tests run: 15, Failures: 0, Errors: 0, Skipped: 0, Time elapsed: 0.038 sec
22-Jun-2019 00:00:45 Running org.springframework.security.oauth2.provider.token.DefaultTokenServicesTests
22-Jun-2019 00:00:45 Tests run: 1, Failures: 0, Errors: 0, Skipped: 0, Time elapsed: 0.004 sec
22-Jun-2019 00:00:45 Running org.springframework.security.oauth2.provider.token.DefaultTokenServicesWithInMemoryTests
22-Jun-2019 00:00:45 Tests run: 25, Failures: 0, Errors: 0, Skipped: 0, Time elapsed: 0.015 sec
22-Jun-2019 00:00:45 Running org.springframework.security.oauth2.provider.token.DefaultAccessTokenConverterTests
22-Jun-2019 00:00:45 Tests run: 15, Failures: 0, Errors: 0, Skipped: 0, Time elapsed: 0.002 sec
22-Jun-2019 00:00:45 Running org.springframework.security.oauth2.provider.implicit.InMemoryImplicitGrantServiceTests
22-Jun-2019 00:00:45 Tests run: 2, Failures: 0, Errors: 0, Skipped: 0, Time elapsed: 0 sec
22-Jun-2019 00:00:45 Running org.springframework.security.oauth2.provider.error.DefaultWebResponseExceptionTranslatorTests
22-Jun-2019 00:00:45 Tests run: 1, Failures: 0, Errors: 0, Skipped: 0, Time elapsed: 0 sec
22-Jun-2019 00:00:45 Running org.springframework.security.oauth2.provider.error.OAuth2AuthenticationEntryPointTests
22-Jun-2019 00:00:45 [WARN] DefaultHandlerExceptionResolver - Resolved exception caused by handler execution: org.springframework.web.HttpMediaTypeNotAcceptableException: Could not find acceptable representation
22-Jun-2019 00:00:45 Tests run: 7, Failures: 0, Errors: 0, Skipped: 0, Time elapsed: 0.033 sec
22-Jun-2019 00:00:45 Running org.springframework.security.oauth2.provider.error.OAuth2AccessDeniedHandlerTests
22-Jun-2019 00:00:45 Tests run: 1, Failures: 0, Errors: 0, Skipped: 0, Time elapsed: 0.004 sec
22-Jun-2019 00:00:45 Running org.springframework.security.oauth2.provider.authentication.OAuth2AuthenticationProcessingFilterTests
22-Jun-2019 00:00:45 Tests run: 8, Failures: 0, Errors: 0, Skipped: 0, Time elapsed: 0.039 sec
22-Jun-2019 00:00:45 Running org.springframework.security.oauth2.provider.authentication.OAuth2AuthenticationDetailsTests
22-Jun-2019 00:00:45 Tests run: 1, Failures: 0, Errors: 0, Skipped: 0, Time elapsed: 0.001 sec
22-Jun-2019 00:00:45 Running org.springframework.security.oauth2.provider.authentication.OAuth2AuthenticationManagerTests
22-Jun-2019 00:00:45 Tests run: 3, Failures: 0, Errors: 0, Skipped: 0, Time elapsed: 0.001 sec
22-Jun-2019 00:00:45 Running org.springframework.security.oauth2.provider.endpoint.FrameworkEndpointHandlerMappingTests
22-Jun-2019 00:00:45 Tests run: 4, Failures: 0, Errors: 0, Skipped: 0, Time elapsed: 0 sec
22-Jun-2019 00:00:45 Running org.springframework.security.oauth2.provider.endpoint.WhitelabelApprovalEndpointTests
22-Jun-2019 00:00:45 Tests run: 6, Failures: 0, Errors: 0, Skipped: 0, Time elapsed: 0.003 sec
22-Jun-2019 00:00:45 Running org.springframework.security.oauth2.provider.endpoint.ExactMatchRedirectResolverTests
22-Jun-2019 00:00:45 Tests run: 3, Failures: 0, Errors: 0, Skipped: 0, Time elapsed: 0.001 sec
22-Jun-2019 00:00:45 Running org.springframework.security.oauth2.provider.endpoint.AuthorizationEndpointTests
22-Jun-2019 00:00:45 Tests run: 34, Failures: 0, Errors: 0, Skipped: 0, Time elapsed: 0.02 sec
22-Jun-2019 00:00:45 Running org.springframework.security.oauth2.provider.endpoint.TokenEndpointTests
22-Jun-2019 00:00:45 Tests run: 6, Failures: 0, Errors: 0, Skipped: 0, Time elapsed: 0.009 sec
22-Jun-2019 00:00:45 Running org.springframework.security.oauth2.provider.endpoint.DefaultRedirectResolverTests
22-Jun-2019 00:00:45 Tests run: 31, Failures: 0, Errors: 0, Skipped: 0, Time elapsed: 0.007 sec
22-Jun-2019 00:00:45 Running org.springframework.security.oauth2.provider.endpoint.WhitelabelErrorEndpointTests
22-Jun-2019 00:00:45 Tests run: 3, Failures: 0, Errors: 0, Skipped: 0, Time elapsed: 0.001 sec
22-Jun-2019 00:00:45 Running org.springframework.security.oauth2.provider.endpoint.TokenEndpointAuthenticationFilterTests
22-Jun-2019 00:00:45 Tests run: 3, Failures: 0, Errors: 0, Skipped: 0, Time elapsed: 0.015 sec
22-Jun-2019 00:00:45 Running org.springframework.security.oauth2.provider.AuthorizationRequestTests
22-Jun-2019 00:00:45 Tests run: 9, Failures: 0, Errors: 0, Skipped: 0, Time elapsed: 0.004 sec
22-Jun-2019 00:00:45 Running org.springframework.security.oauth2.provider.OAuth2AuthenticationTests
22-Jun-2019 00:00:45 {"authorities":[{"authority":"ROLE_USER"}],"details":null,"authenticated":false,"userAuthentication":{"authorities":[{"authority":"ROLE_USER"}],"details":null,"authenticated":true,"principal":"foo","credentials":"bar","name":"foo"},"clientOnly":false,"oauth2Request":{"clientId":"id","scope":["read"],"requestParameters":{},"resourceIds":[],"authorities":[],"approved":false,"refresh":false,"redirectUri":null,"responseTypes":[],"extensions":{},"grantType":null,"refreshTokenRequest":null},"principal":"foo","credentials":"","name":"foo"}
22-Jun-2019 00:00:45 Tests run: 8, Failures: 0, Errors: 0, Skipped: 0, Time elapsed: 0.015 sec
22-Jun-2019 00:00:45 Running org.springframework.security.oauth2.provider.expression.OAuth2MethodSecurityExpressionHandlerTests
22-Jun-2019 00:00:45 Tests run: 9, Failures: 0, Errors: 0, Skipped: 0, Time elapsed: 0.007 sec
22-Jun-2019 00:00:45 Running org.springframework.security.oauth2.provider.expression.OAuth2SecurityExpressionMethodsTests
22-Jun-2019 00:00:45 Tests run: 10, Failures: 0, Errors: 0, Skipped: 0, Time elapsed: 0.001 sec
22-Jun-2019 00:00:45 Running org.springframework.security.oauth2.provider.expression.OAuth2WebSecurityExpressionHandlerTests
22-Jun-2019 00:00:45 Tests run: 6, Failures: 0, Errors: 0, Skipped: 0, Time elapsed: 0.002 sec
22-Jun-2019 00:00:45 Running org.springframework.security.oauth2.provider.expression.OAuth2ExpressionParserTests
22-Jun-2019 00:00:45 Tests run: 3, Failures: 0, Errors: 0, Skipped: 0, Time elapsed: 0.007 sec
22-Jun-2019 00:00:45 Running org.springframework.security.oauth2.provider.OAuth2RequestTests
22-Jun-2019 00:00:45 Tests run: 4, Failures: 0, Errors: 0, Skipped: 0, Time elapsed: 0.001 sec
22-Jun-2019 00:00:45 Running org.springframework.security.oauth2.provider.code.AuthorizationCodeTokenGranterTests
22-Jun-2019 00:00:45 Tests run: 5, Failures: 0, Errors: 0, Skipped: 0, Time elapsed: 0.003 sec
22-Jun-2019 00:00:45 Running org.springframework.security.oauth2.provider.code.InMemoryAuthorizationCodeServicesTests
22-Jun-2019 00:00:45 Tests run: 3, Failures: 0, Errors: 0, Skipped: 0, Time elapsed: 0.004 sec
22-Jun-2019 00:00:45 Running org.springframework.security.oauth2.provider.code.JdbcAuthorizationCodeServicesTests
22-Jun-2019 00:00:45 Tests run: 3, Failures: 0, Errors: 0, Skipped: 0, Time elapsed: 0.029 sec
22-Jun-2019 00:00:45 Running org.springframework.security.oauth2.provider.code.SubdomainRedirectResolverTests
22-Jun-2019 00:00:45 Tests run: 2, Failures: 0, Errors: 0, Skipped: 0, Time elapsed: 0 sec
22-Jun-2019 00:00:45 Running org.springframework.security.oauth2.common.OAuth2AccessTokenJackson1DeserializerTests
22-Jun-2019 00:00:46 Tests run: 8, Failures: 0, Errors: 0, Skipped: 0, Time elapsed: 1.083 sec
22-Jun-2019 00:00:46 Running org.springframework.security.oauth2.common.OAuth2AccessTokenJackson2DeserializerTests
22-Jun-2019 00:00:47 Tests run: 9, Failures: 0, Errors: 0, Skipped: 0, Time elapsed: 1.054 sec
22-Jun-2019 00:00:47 Running org.springframework.security.oauth2.common.exception.OAuth2ExceptionDeserializerTests
22-Jun-2019 00:00:47 Tests run: 13, Failures: 0, Errors: 0, Skipped: 0, Time elapsed: 0.008 sec
22-Jun-2019 00:00:47 Running org.springframework.security.oauth2.common.exception.OAuth2ExceptionSerializerTests
22-Jun-2019 00:00:47 Tests run: 11, Failures: 0, Errors: 0, Skipped: 0, Time elapsed: 0.007 sec
22-Jun-2019 00:00:47 Running org.springframework.security.oauth2.common.exception.OAuth2ExceptionJackson2DeserializerTests
22-Jun-2019 00:00:47 Tests run: 14, Failures: 0, Errors: 0, Skipped: 0, Time elapsed: 0.005 sec
22-Jun-2019 00:00:47 Running org.springframework.security.oauth2.common.OAuth2AccessTokenJackson2SerializerTests
22-Jun-2019 00:00:48 Tests run: 10, Failures: 0, Errors: 0, Skipped: 0, Time elapsed: 0.914 sec
22-Jun-2019 00:00:48 Running org.springframework.security.oauth2.common.OAuth2AccessTokenJackson1SerializerTests
22-Jun-2019 00:00:52 Tests run: 1, Failures: 0, Errors: 0, Skipped: 0, Time elapsed: 3.277 sec
22-Jun-2019 00:00:53 Exception: java.lang.OutOfMemoryError thrown from the UncaughtExceptionHandler in thread "main"
22-Jun-2019 00:00:53
22-Jun-2019 00:00:53 Results :
22-Jun-2019 00:00:53
22-Jun-2019 00:00:53 Tests run: 696, Failures: 0, Errors: 0, Skipped: 0
22-Jun-2019 00:00:53
22-Jun-2019 00:00:53 [INFO] ------------------------------------------------------------------------
22-Jun-2019 00:00:53 [INFO] Reactor Summary:
22-Jun-2019 00:00:53 [INFO]
22-Jun-2019 00:00:53 [INFO] OAuth for Spring Security .......................... SUCCESS [  0.964 s]
22-Jun-2019 00:00:53 [INFO] OAuth 1(a) for Spring Security ..................... SUCCESS [  8.809 s]
22-Jun-2019 00:00:53 [INFO] OAuth2 for Spring Security ......................... FAILURE [ 31.691 s]
22-Jun-2019 00:00:53 [INFO] spring-oauth2-tests ................................ SKIPPED
22-Jun-2019 00:00:53 [INFO] spring-oauth2-tests-common ......................... SKIPPED
22-Jun-2019 00:00:53 [INFO] spring-oauth2-tests-vanilla ........................ SKIPPED
22-Jun-2019 00:00:53 [INFO] spring-oauth2-tests-mappings ....................... SKIPPED
22-Jun-2019 00:00:53 [INFO] spring-oauth2-tests-form ........................... SKIPPED
22-Jun-2019 00:00:53 [INFO] spring-oauth2-tests-jwt ............................ SKIPPED
22-Jun-2019 00:00:53 [INFO] spring-oauth2-tests-approval ....................... SKIPPED
22-Jun-2019 00:00:53 [INFO] spring-oauth2-tests-jdbc ........................... SKIPPED
22-Jun-2019 00:00:53 [INFO] spring-oauth2-tests-jpa ............................ SKIPPED
22-Jun-2019 00:00:53 [INFO] spring-oauth2-tests-jaxb ........................... SKIPPED
22-Jun-2019 00:00:53 [INFO] spring-oauth-tests-custom-grant .................... SKIPPED
22-Jun-2019 00:00:53 [INFO] spring-oauth2-tests-multi .......................... SKIPPED
22-Jun-2019 00:00:53 [INFO] spring-oauth2-tests-client ......................... SKIPPED
22-Jun-2019 00:00:53 [INFO] spring-oauth2-tests-resource ....................... SKIPPED
22-Jun-2019 00:00:53 [INFO] spring-oauth2-tests-custom-authentication .......... SKIPPED
22-Jun-2019 00:00:53 [INFO] spring-oauth2-tests-xml ............................ SKIPPED
22-Jun-2019 00:00:53 [INFO] spring-oauth2-tests-xml-common ..................... SKIPPED
22-Jun-2019 00:00:53 [INFO] spring-oauth2-tests-xml-vanilla .................... SKIPPED
22-Jun-2019 00:00:53 [INFO] spring-oauth2-tests-xml-mappings ................... SKIPPED
22-Jun-2019 00:00:53 [INFO] spring-oauth2-tests-xml-form ....................... SKIPPED
22-Jun-2019 00:00:53 [INFO] spring-oauth2-tests-xml-jwt ........................ SKIPPED
22-Jun-2019 00:00:53 [INFO] spring-oauth2-tests-xml-approval ................... SKIPPED
22-Jun-2019 00:00:53 [INFO] spring-oauth2-tests-xml-jdbc ....................... SKIPPED
22-Jun-2019 00:00:53 [INFO] spring-oauth2-tests-xml-client ..................... SKIPPED
22-Jun-2019 00:00:53 [INFO] OAuth for Spring Security - Integration Tests ...... SKIPPED
22-Jun-2019 00:00:53 [INFO] OAuth for Spring Security - Sparklr (OAuth 1 Provider Example) SKIPPED
22-Jun-2019 00:00:53 [INFO] OAuth for Spring Security - Tonr (OAuth 1 Consumer Example) SKIPPED
22-Jun-2019 00:00:53 [INFO] OAuth for Spring Security - Sparklr2 (OAuth 2 Provider Example) SKIPPED
22-Jun-2019 00:00:53 [INFO] OAuth for Spring Security - Tonr2 (OAuth 2 Client Example) SKIPPED
22-Jun-2019 00:00:53 [INFO] OAuth for Spring Security - Samples ................ SKIPPED
22-Jun-2019 00:00:53 [INFO] ------------------------------------------------------------------------
22-Jun-2019 00:00:53 [INFO] BUILD FAILURE
22-Jun-2019 00:00:53 [INFO] ------------------------------------------------------------------------
22-Jun-2019 00:00:53 [INFO] Total time: 44.542 s
22-Jun-2019 00:00:53 [INFO] Finished at: 2019-06-22T00:00:53+00:00
22-Jun-2019 00:00:53 [INFO] Final Memory: 75M/528M
22-Jun-2019 00:00:53 [INFO] ------------------------------------------------------------------------
22-Jun-2019 00:00:53 [ERROR] Failed to execute goal org.apache.maven.plugins:maven-surefire-plugin:2.12.4:test (default-test) on project spring-security-oauth2: Execution default-test of goal org.apache.maven.plugins:maven-surefire-plugin:2.12.4:test failed: The forked VM terminated without saying properly goodbye. VM crash or System.exit called ? -> [Help 1]
22-Jun-2019 00:00:53 [ERROR]
22-Jun-2019 00:00:53 [ERROR] To see the full stack trace of the errors, re-run Maven with the -e switch.
22-Jun-2019 00:00:53 [ERROR] Re-run Maven using the -X switch to enable full debug logging.
22-Jun-2019 00:00:53 [ERROR]
22-Jun-2019 00:00:53 [ERROR] For more information about the errors and possible solutions, please read the following articles:
22-Jun-2019 00:00:53 [ERROR] [Help 1] http://cwiki.apache.org/confluence/display/MAVEN/PluginExecutionException
22-Jun-2019 00:00:53 [ERROR]
22-Jun-2019 00:00:53 [ERROR] After correcting the problems, you can resume the build with the command
22-Jun-2019 00:00:53 [ERROR]   mvn <goals> -rf :spring-security-oauth2
22-Jun-2019 00:00:53 Exception in thread "main"
22-Jun-2019 00:00:53
22-Jun-2019 00:00:53 Failing task since return code of [/opt/jdk-7/bin/java -cp /opt/maven-3.3/boot/plexus-classworlds-2.5.2.jar -Dclassworlds.conf=/tmp/artifactoryM25062790529331945387conf -DbuildInfoConfig.propertiesFile=/tmp/buildInfo4457433451116909100.properties -Xmx1256m -Xms128m -Dmaven.home=/opt/maven-3.3 -Dmaven.multiModuleProjectDirectory=/opt/bamboo-home/xml-data/build-dir/SECOAUTH-NIGHTLY-JOB1 org.codehaus.plexus.classworlds.launcher.Launcher clean install -P bootstrap -Dartifactory.publish.password=********] was 1 while expected 0
22-Jun-2019 00:00:53 Finished task 'Artifactory Maven 3' with result: Failed
22-Jun-2019 00:00:53 Running post build plugin 'Docker Container Cleanup'
22-Jun-2019 00:00:53 Running post build plugin 'NCover Results Collector'
22-Jun-2019 00:00:53 Running post build plugin 'Artifactory Release Management Staging'
22-Jun-2019 00:00:53 Running post build plugin 'Artifactory Build Info Copier'
22-Jun-2019 00:00:53 Running post build plugin 'Artifactory Gradle Properties Info Copier'
22-Jun-2019 00:00:53 Running post build plugin 'Clover Results Collector'
22-Jun-2019 00:00:53 Running post build plugin 'npm Cache Cleanup'
22-Jun-2019 00:00:53 Running post build plugin 'Artifact Copier'
22-Jun-2019 00:00:53 Successfully removed working directory at '/opt/bamboo-home/xml-data/build-dir/SECOAUTH-NIGHTLY-JOB1'
22-Jun-2019 00:00:53 Finalising the build...
22-Jun-2019 00:00:53 Stopping timer.
22-Jun-2019 00:00:53 Build SECOAUTH-NIGHTLY-JOB1-1682 completed.
22-Jun-2019 00:00:59 Running on server: post build plugin 'NCover Results Collector'
22-Jun-2019 00:00:59 Running on server: post build plugin 'Build Hanging Detection Configuration'
22-Jun-2019 00:00:59 Running on server: post build plugin 'Clover Delta Calculator'
22-Jun-2019 00:00:59 Running on server: post build plugin 'Maven Dependencies Postprocessor'
22-Jun-2019 00:00:59 All post build plugins have finished
22-Jun-2019 00:00:59 Generating build results summary...
22-Jun-2019 00:00:59 Saving build results to disk...
22-Jun-2019 00:00:59 Logging substituted variables...
22-Jun-2019 00:00:59 Indexing build results...
22-Jun-2019 00:00:59 Finished building SECOAUTH-NIGHTLY-JOB1-1682.