Build: #1683 failed

Job: Default Job failed

Stages & jobs

  1. Default Stage

Build log

The build generated 636 lines of output. Download or view full build log

22-Jun-2019 23:59:55 Build Spring Security OAuth - 2.1.x - Default Job #1683 (SECOAUTH-NIGHTLY-JOB1-1683) started building on agent bamboo-17.af.pivotal.io
22-Jun-2019 23:59:55 Remote agent on host bamboo-17.af.pivotal.io
22-Jun-2019 23:59:56 Build working directory is /opt/bamboo-home/xml-data/build-dir/SECOAUTH-NIGHTLY-JOB1
22-Jun-2019 23:59:56 Executing build Spring Security OAuth - 2.1.x - Default Job #1683 (SECOAUTH-NIGHTLY-JOB1-1683)
22-Jun-2019 23:59:56 Starting task 'Checkout Default Repository' of type 'com.atlassian.bamboo.plugins.vcs:task.vcs.checkout'
22-Jun-2019 23:59:56 Build always requires a clean checkout
22-Jun-2019 23:59:56 Cleaning build directory '/opt/bamboo-home/xml-data/build-dir/SECOAUTH-NIGHTLY-JOB1'
22-Jun-2019 23:59:56 Checking out into /opt/bamboo-home/xml-data/build-dir/SECOAUTH-NIGHTLY-JOB1
22-Jun-2019 23:59:56 Updating source code to revision: 3d37444a991104dd7f23edb2812e9f57620a1395
22-Jun-2019 23:59:56 Creating local git repository in '/opt/bamboo-home/xml-data/build-dir/SECOAUTH-NIGHTLY-JOB1/.git'.
22-Jun-2019 23:59:56 Initialized empty Git repository in /opt/bamboo-home/xml-data/build-dir/SECOAUTH-NIGHTLY-JOB1/.git/
22-Jun-2019 23:59:57 Fetching 'refs/heads/master' from 'git://github.com/SpringSource/spring-security-oauth.git'. Will try to do a shallow fetch.
23-Jun-2019 00:00:01 From git://github.com/SpringSource/spring-security-oauth
23-Jun-2019 00:00:01 * [new branch]      master     -> master
23-Jun-2019 00:00:01 Checking out revision 3d37444a991104dd7f23edb2812e9f57620a1395.
23-Jun-2019 00:00:01 Already on 'master'
23-Jun-2019 00:00:01 Updated source code to revision: 3d37444a991104dd7f23edb2812e9f57620a1395
23-Jun-2019 00:00:01 Finished task 'Checkout Default Repository' with result: Success
23-Jun-2019 00:00:01 Running pre-build action: Artifactory Release Staging
23-Jun-2019 00:00:01 Running pre-build action: VCS Version Collector
23-Jun-2019 00:00:01 Skipping execution of task 'Build' as it is disabled
23-Jun-2019 00:00:01 Starting task 'Artifactory Maven 3' of type 'org.jfrog.bamboo.bamboo-artifactory-plugin:maven3Task'
23-Jun-2019 00:00:01 Bamboo Artifactory Plugin version: 2.6.3
23-Jun-2019 00:00:02
Beginning to execute external process for build 'Spring Security OAuth - 2.1.x - Default Job #1683 (SECOAUTH-NIGHTLY-JOB1-1683)'
... running command line:
/opt/jdk-7/bin/java -cp /opt/maven-3.3/boot/plexus-classworlds-2.5.2.jar -Dclassworlds.conf=/tmp/artifactoryM23076221074346312205conf -DbuildInfoConfig.propertiesFile=/tmp/buildInfo1348572814623999989.properties -Xmx1256m -Xms128m -Dmaven.home=/opt/maven-3.3 -Dmaven.multiModuleProjectDirectory=/opt/bamboo-home/xml-data/build-dir/SECOAUTH-NIGHTLY-JOB1 org.codehaus.plexus.classworlds.launcher.Launcher clean install -P bootstrap -Dartifactory.publish.password=********
... in: /opt/bamboo-home/xml-data/build-dir/SECOAUTH-NIGHTLY-JOB1
... using extra environment variables:
bamboo_planRepository_1_branch=master
bamboo_repository_94273667_previous_revision_number=3d37444a991104dd7f23edb2812e9f57620a1395
bamboo_********_username_password=********
bamboo_signing_store_password=********
bamboo_capability_system_builder_ant_Ant_1_9=/opt/ant-1.9
bamboo_capability_system_builder_ant_Ant_1_8=/opt/ant-1.8
bamboo_planRepository_1_branchDisplayName=master
bamboo_artifactory_override_resolve_repo=libs-milestone
bamboo_capability_system_builder_node_Node_js_10_16=/opt/node-10.16/bin/node
bamboo_repository_revision_number=3d37444a991104dd7f23edb2812e9f57620a1395
bamboo_RIAK_BIN=/usr/sbin/riak
bamboo_repository_94273667_revision_number=3d37444a991104dd7f23edb2812e9f57620a1395
WRAPPER_BITS=32
bamboo_buildKey=SECOAUTH-NIGHTLY-JOB1
bamboo_repository_94273667_git_branch=master
bamboo_bintray_password=********
bamboo_sonar_token_password=********
PWD=/opt/bamboo-home/bin
bamboo_shortJobName=Default Job
bamboo_artifactory_override_resolver_password=********
bamboo_sonatype_token=RSJChaox
bamboo_capability_system_builder_gradle___gradlew=./gradlew
bamboo_buildResultsUrl=https://build.spring.io/browse/SECOAUTH-NIGHTLY-JOB1-1683
bamboo_capability_system_builder_mvn3_Maven_3_3=/opt/maven-3.3
bamboo_capability_system_builder_mvn3_Maven_3_2=/opt/maven-3.2
bamboo_capability_system_builder_mvn3_Maven_3_1=/opt/maven-3.1
bamboo_planRepository_repositoryUrl=git://github.com/SpringSource/spring-security-oauth.git
bamboo_capability_system_builder_mvn3_Maven_3_6=/opt/maven-3.6
bamboo_agentId=286195718
bamboo_capability_system_builder_mvn3_Maven_3_5=/opt/maven-3.5
bamboo_capability_system_builder_mvn3_Maven_3_0=/opt/maven-3.0
bamboo_planRepository_revision=3d37444a991104dd7f23edb2812e9f57620a1395
bamboo_planRepository_previousRevision=3d37444a991104dd7f23edb2812e9f57620a1395
bamboo_capability_remote_build=true
bamboo_repository_branch_name=master
bamboo_sonatype_token_password=********
bamboo_sonatype_user=springsource
SHLVL=1
bamboo_org_jfrog_bamboo_buildInfo_serverUrl=https://repo.spring.io
bamboo_scdf_acceptance_tests_password=********
bamboo_repository_94273667_branch_name=master
WRAPPER_OS=linux
TERM=linux
XDG_SESSION_ID=c1
bamboo_planRepository_branch=master
bamboo_org_jfrog_bamboo_release_activated=false
bamboo_planRepository_1_type=gitv2
bamboo_planRepository_branchName=master
bamboo_capability_system_jdk_JDK_12=/opt/jdk-12
WRAPPER_FILE_SEPARATOR=/
_=/opt/bamboo-home/bin/bamboo-agent.sh
bamboo_capability_system_builder_ant_Ant_1_10=/opt/ant-1.10
bamboo_repository_94273667_name=Plan Repository
WRAPPER_PATH_SEPARATOR=:
bamboo_sonar_password=********
bamboo_hg_cache_directory=/opt/bamboo-home/xml-data/build-dir/_hg-repositories-cache
bamboo_planRepository_1_username=
bamboo_planRepository_type=gitv2
bamboo_git_cache_directory=/opt/bamboo-home/xml-data/build-dir/_git-repositories-cache
bamboo_artifactory_username=buildmaster
bamboo_tmp_directory=/opt/bamboo-home/temp
bamboo_planKey=SECOAUTH-NIGHTLY
bamboo_planRepository_username=
bamboo_JDK8_HOME=/opt/jdk-8
bamboo_repository_94273667_git_username=
bamboo_planRepository_1_branchName=master
bamboo_sonar_version=5.6.3
bamboo_sonar_jdbc_password=********
bamboo_bintray_api_key_password=********
XDG_DATA_DIRS=/usr/local/share:/usr/share:/var/lib/snapd/desktop
bamboo_capability_system_jdk_JDK_1_11=/opt/jdk-11
bamboo_resultsUrl=https://build.spring.io/browse/SECOAUTH-NIGHTLY-JOB1-1683
bamboo_capability_system_jdk_JDK_1_10=/opt/jdk-10
bamboo_build_working_directory=/opt/bamboo-home/xml-data/build-dir/SECOAUTH-NIGHTLY-JOB1
bamboo_planRepository_1_name=Plan Repository
bamboo_capability_system_os=ubuntu1804
bamboo_nexusPush_stagingProfile=buildmaster
bamboo_shortPlanName=2.1.x
MAIL=/var/mail/bamboo
bamboo_planRepository_name=Plan Repository
LOGNAME=bamboo
bamboo_buildNumber=1683
SHELL=/bin/bash
bamboo_planName=Spring Security OAuth - 2.1.x
bamboo_JDK7_HOME=/opt/jdk-7
bamboo_repository_94273667_git_repositoryUrl=git://github.com/SpringSource/spring-security-oauth.git
bamboo_shortPlanKey=NIGHTLY
OLDPWD=/opt/users/bamboo
bamboo_shortJobKey=JOB1
bamboo_artifactory_password=********
bamboo_buildTimeStamp=2019-06-23T00:00:04.348Z
bamboo_repository_previous_revision_number=3d37444a991104dd7f23edb2812e9f57620a1395
bamboo_sonar_username=buildmaster
bamboo_********_password=********
bamboo_repository_git_branch=master
bamboo_buildResultKey=SECOAUTH-NIGHTLY-JOB1-1683
bamboo_nexusPush_close=true
bamboo_artifactory_override_resolver_username=buildmaster
bamboo_buildPlanName=Spring Security OAuth - 2.1.x - Default Job
bamboo_planRepository_1_revision=3d37444a991104dd7f23edb2812e9f57620a1395
bamboo_repository_name=Plan Repository
bamboo_signing_key_password=********
bamboo_capability_system_builder_groovy_Groovy_2_5=/opt/groovy-2.5
LANG=en_US.UTF-8
bamboo_buildFailed=false
bamboo_capability_system_docker_executable=/usr/bin/docker
DISPLAY=localhost:1.0
bamboo_capability_system_jdk_OpenJDK_7=/opt/jdk-7
bamboo_capability_system_builder_groovy_Groovy_2_4=/opt/groovy-2.4
bamboo_artifactory_override_deployer_username=buildmaster
bamboo_capability_system_builder_command_Bash=/bin/bash
bamboo_artifactory_password_mask_a=********
bamboo_agentWorkingDirectory=/opt/bamboo-home/xml-data/build-dir
bamboo_capability_system_git_executable=/usr/bin/git
bamboo_repository_git_username=
bamboo_planRepository_1_previousRevision=3d37444a991104dd7f23edb2812e9f57620a1395
bamboo_capability_os_family=unix
bamboo_planRepository_branchDisplayName=master
bamboo_capability_system_builder_maven_Artifactory_Maven_3_6=/opt/maven-3.6
bamboo_capability_system_builder_maven_Artifactory_Maven_3_5=/opt/maven-3.5
GIT_SSL_NO_VERIFY=true
bamboo_capability_system_builder_maven_Artifactory_Maven_3_3=/opt/maven-3.3
bamboo_capability_system_builder_maven_Artifactory_Maven_3_2=/opt/maven-3.2
bamboo_s3_properties=/home/bamboo/tools/s3.properties
bamboo_capability_system_builder_maven_Artifactory_Maven_3_1=/opt/maven-3.1
bamboo_artifactory_override_deploy_repo=libs-snapshot-local
bamboo_capability_system_builder_maven_Artifactory_Maven_3_0=/opt/maven-3.0
bamboo_plan_storageTag=SECOAUTH-NIGHTLY
bamboo_bintray_username_password=********
USER=bamboo
bamboo_repository_git_repositoryUrl=git://github.com/SpringSource/spring-security-oauth.git
bamboo_working_directory=/opt/bamboo-home/xml-data/build-dir/SECOAUTH-NIGHTLY-JOB1
bamboo_org_jfrog_bamboo_buildInfo_activated=true
bamboo_planRepository_1_repositoryUrl=git://github.com/SpringSource/spring-security-oauth.git
bamboo_capability_system_jdk_JDK_1_8=/opt/jdk-8
bamboo_artifactory_override_deployer_password=********
bamboo_capability_system_jdk_JDK_1_9=/opt/jdk-9
WRAPPER_ARCH=x86
bamboo_capability_system_jdk_JDK_1_6=/opt/jdk-6
bamboo_sonatype_password=********
bamboo_capability_system_jdk_JDK_1_7=/opt/jdk-7
bamboo_sonar_ip=10.194.6.9
XDG_RUNTIME_DIR=/run/user/1002
HOME=/home/bamboo
PATH=/bin:/home/bamboo/bin:/usr/local/sbin:/usr/local/bin:/usr/sbin:/usr/bin:/sbin:/bin:/usr/games:/usr/local/games:/snap/bin:/home/bamboo/bin:/usr/local/bin:/bin:/home/bamboo/bin:/usr/local/sbin:/usr/local/bin:/usr/sbin:/usr/bin:/sbin:/bin:/usr/games:/usr/local/games:/snap/bin:/home/bamboo/bin:/usr/local/bin
23-Jun-2019 00:00:03 [INFO] Scanning for projects...
23-Jun-2019 00:00:03 Downloading: https://repo.spring.io/libs-snapshot-local/org/springframework/boot/spring-boot-starter-parent/1.5.1.RELEASE/spring-boot-starter-parent-1.5.1.RELEASE.pom
23-Jun-2019 00:00:03
23-Jun-2019 00:00:03 Downloading: https://repo.spring.io/libs-milestone-local/org/springframework/boot/spring-boot-starter-parent/1.5.1.RELEASE/spring-boot-starter-parent-1.5.1.RELEASE.pom
23-Jun-2019 00:00:04
23-Jun-2019 00:00:04 Downloading: https://repo.spring.io/release/org/springframework/boot/spring-boot-starter-parent/1.5.1.RELEASE/spring-boot-starter-parent-1.5.1.RELEASE.pom
23-Jun-2019 00:00:04 1/8 KB   
23-Jun-2019 00:00:04 3/8 KB   
23-Jun-2019 00:00:04 4/8 KB   
23-Jun-2019 00:00:04 5/8 KB   
23-Jun-2019 00:00:04 7/8 KB   
23-Jun-2019 00:00:04 8/8 KB   
23-Jun-2019 00:00:04          
23-Jun-2019 00:00:04 Downloaded: https://repo.spring.io/release/org/springframework/boot/spring-boot-starter-parent/1.5.1.RELEASE/spring-boot-starter-parent-1.5.1.RELEASE.pom (8 KB at 33.3 KB/sec)
23-Jun-2019 00:00:04 Downloading: https://repo.spring.io/libs-snapshot-local/org/springframework/boot/spring-boot-dependencies/1.5.1.RELEASE/spring-boot-dependencies-1.5.1.RELEASE.pom
23-Jun-2019 00:00:04          
23-Jun-2019 00:00:04 Downloading: https://repo.spring.io/libs-milestone-local/org/springframework/boot/spring-boot-dependencies/1.5.1.RELEASE/spring-boot-dependencies-1.5.1.RELEASE.pom
23-Jun-2019 00:00:04          
23-Jun-2019 00:00:04 Downloading: https://repo.spring.io/release/org/springframework/boot/spring-boot-dependencies/1.5.1.RELEASE/spring-boot-dependencies-1.5.1.RELEASE.pom
23-Jun-2019 00:00:04 1/88 KB   
23-Jun-2019 00:00:04 3/88 KB   
23-Jun-2019 00:00:04 4/88 KB   
23-Jun-2019 00:00:04 5/88 KB   
23-Jun-2019 00:00:04 7/88 KB   
23-Jun-2019 00:00:04 8/88 KB   
23-Jun-2019 00:00:04 9/88 KB   
23-Jun-2019 00:00:04 11/88 KB   
23-Jun-2019 00:00:04 12/88 KB   
23-Jun-2019 00:00:04 13/88 KB   
23-Jun-2019 00:00:04 14/88 KB   
23-Jun-2019 00:00:04 15/88 KB   
23-Jun-2019 00:00:04 16/88 KB   
23-Jun-2019 00:00:04 18/88 KB   
23-Jun-2019 00:00:04 19/88 KB   
23-Jun-2019 00:00:04 20/88 KB   
23-Jun-2019 00:00:04 22/88 KB   
23-Jun-2019 00:00:04 23/88 KB   
23-Jun-2019 00:00:04 24/88 KB   
23-Jun-2019 00:00:04 26/88 KB   
23-Jun-2019 00:00:04 27/88 KB   
23-Jun-2019 00:00:04 28/88 KB   
23-Jun-2019 00:00:04 30/88 KB   
23-Jun-2019 00:00:04 31/88 KB   
23-Jun-2019 00:00:04 32/88 KB   
23-Jun-2019 00:00:04 34/88 KB   
23-Jun-2019 00:00:04 35/88 KB   
23-Jun-2019 00:00:04 36/88 KB   
23-Jun-2019 00:00:04 38/88 KB   
23-Jun-2019 00:00:04 39/88 KB   
23-Jun-2019 00:00:04 40/88 KB   
23-Jun-2019 00:00:04 42/88 KB   
23-Jun-2019 00:00:04 43/88 KB   
23-Jun-2019 00:00:04 44/88 KB   
23-Jun-2019 00:00:04 46/88 KB   
23-Jun-2019 00:00:04 47/88 KB   
23-Jun-2019 00:00:04 48/88 KB   
23-Jun-2019 00:00:04 50/88 KB   
23-Jun-2019 00:00:04 51/88 KB   
23-Jun-2019 00:00:04 52/88 KB   
23-Jun-2019 00:00:04 54/88 KB   
23-Jun-2019 00:00:04 55/88 KB   
23-Jun-2019 00:00:04 56/88 KB   
23-Jun-2019 00:00:04 58/88 KB   
23-Jun-2019 00:00:04 59/88 KB   
23-Jun-2019 00:00:04 60/88 KB   
23-Jun-2019 00:00:04 62/88 KB   
23-Jun-2019 00:00:04 63/88 KB   
23-Jun-2019 00:00:04 63/88 KB   
23-Jun-2019 00:00:04 64/88 KB   
23-Jun-2019 00:00:04 66/88 KB   
23-Jun-2019 00:00:04 67/88 KB   
23-Jun-2019 00:00:04 68/88 KB   
23-Jun-2019 00:00:04 70/88 KB   
23-Jun-2019 00:00:04 71/88 KB   
23-Jun-2019 00:00:04 72/88 KB   
23-Jun-2019 00:00:04 74/88 KB   
23-Jun-2019 00:00:04 75/88 KB   
23-Jun-2019 00:00:04 76/88 KB   
23-Jun-2019 00:00:04 78/88 KB   
23-Jun-2019 00:00:04 79/88 KB   
23-Jun-2019 00:00:04 81/88 KB   
23-Jun-2019 00:00:04 82/88 KB   
23-Jun-2019 00:00:04 83/88 KB   
23-Jun-2019 00:00:04 85/88 KB   
23-Jun-2019 00:00:04 86/88 KB   
23-Jun-2019 00:00:04 87/88 KB   
23-Jun-2019 00:00:04 88/88 KB   
23-Jun-2019 00:00:05            
23-Jun-2019 00:00:05 Downloaded: https://repo.spring.io/release/org/springframework/boot/spring-boot-dependencies/1.5.1.RELEASE/spring-boot-dependencies-1.5.1.RELEASE.pom (88 KB at 268.1 KB/sec)
23-Jun-2019 00:00:06 [INFO] Initializing Artifactory Build-Info Recording
23-Jun-2019 00:00:06 [INFO] ------------------------------------------------------------------------
23-Jun-2019 00:00:06 [INFO] Reactor Build Order:
23-Jun-2019 00:00:06 [INFO]
23-Jun-2019 00:00:06 [INFO] OAuth for Spring Security
23-Jun-2019 00:00:06 [INFO] OAuth 1(a) for Spring Security
23-Jun-2019 00:00:06 [INFO] OAuth2 for Spring Security
23-Jun-2019 00:00:06 [INFO] spring-oauth2-tests
23-Jun-2019 00:00:06 [INFO] spring-oauth2-tests-common
23-Jun-2019 00:00:06 [INFO] spring-oauth2-tests-vanilla
23-Jun-2019 00:00:06 [INFO] spring-oauth2-tests-mappings
23-Jun-2019 00:00:06 [INFO] spring-oauth2-tests-form
23-Jun-2019 00:00:06 [INFO] spring-oauth2-tests-jwt
23-Jun-2019 00:00:06 [INFO] spring-oauth2-tests-approval
23-Jun-2019 00:00:06 [INFO] spring-oauth2-tests-jdbc
23-Jun-2019 00:00:06 [INFO] spring-oauth2-tests-jpa
23-Jun-2019 00:00:06 [INFO] spring-oauth2-tests-jaxb
23-Jun-2019 00:00:06 [INFO] spring-oauth-tests-custom-grant
23-Jun-2019 00:00:06 [INFO] spring-oauth2-tests-multi
23-Jun-2019 00:00:06 [INFO] spring-oauth2-tests-client
23-Jun-2019 00:00:06 [INFO] spring-oauth2-tests-resource
23-Jun-2019 00:00:06 [INFO] spring-oauth2-tests-custom-authentication
23-Jun-2019 00:00:06 [INFO] spring-oauth2-tests-xml
23-Jun-2019 00:00:06 [INFO] spring-oauth2-tests-xml-common
23-Jun-2019 00:00:06 [INFO] spring-oauth2-tests-xml-vanilla
23-Jun-2019 00:00:06 [INFO] spring-oauth2-tests-xml-mappings
23-Jun-2019 00:00:06 [INFO] spring-oauth2-tests-xml-form
23-Jun-2019 00:00:06 [INFO] spring-oauth2-tests-xml-jwt
23-Jun-2019 00:00:06 [INFO] spring-oauth2-tests-xml-approval
23-Jun-2019 00:00:06 [INFO] spring-oauth2-tests-xml-jdbc
23-Jun-2019 00:00:06 [INFO] spring-oauth2-tests-xml-client
23-Jun-2019 00:00:06 [INFO] OAuth for Spring Security - Integration Tests
23-Jun-2019 00:00:06 [INFO] OAuth for Spring Security - Sparklr (OAuth 1 Provider Example)
23-Jun-2019 00:00:06 [INFO] OAuth for Spring Security - Tonr (OAuth 1 Consumer Example)
23-Jun-2019 00:00:06 [INFO] OAuth for Spring Security - Sparklr2 (OAuth 2 Provider Example)
23-Jun-2019 00:00:06 [INFO] OAuth for Spring Security - Tonr2 (OAuth 2 Client Example)
23-Jun-2019 00:00:06 [INFO] OAuth for Spring Security - Samples
23-Jun-2019 00:00:06 [INFO]                                                                         
23-Jun-2019 00:00:06 [INFO] ------------------------------------------------------------------------
23-Jun-2019 00:00:06 [INFO] Building OAuth for Spring Security 2.3.7.BUILD-SNAPSHOT
23-Jun-2019 00:00:06 [INFO] ------------------------------------------------------------------------
23-Jun-2019 00:00:06 [INFO]
23-Jun-2019 00:00:06 [INFO] --- maven-clean-plugin:2.5:clean (default-clean) @ spring-security-oauth-parent ---
23-Jun-2019 00:00:06 [INFO]
23-Jun-2019 00:00:06 [INFO] >>> maven-source-plugin:2.1.2:jar (attach-sources) > generate-sources @ spring-security-oauth-parent >>>
23-Jun-2019 00:00:06 [INFO]
23-Jun-2019 00:00:06 [INFO] <<< maven-source-plugin:2.1.2:jar (attach-sources) < generate-sources @ spring-security-oauth-parent <<<
23-Jun-2019 00:00:06 [INFO]
23-Jun-2019 00:00:06 [INFO] --- maven-source-plugin:2.1.2:jar (attach-sources) @ spring-security-oauth-parent ---
23-Jun-2019 00:00:06 [INFO]
23-Jun-2019 00:00:06 [INFO] --- maven-javadoc-plugin:2.9.1:jar (javadoc) @ spring-security-oauth-parent ---
23-Jun-2019 00:00:07 [INFO] Not executing Javadoc as the project is not a Java classpath-capable package
23-Jun-2019 00:00:07 [INFO]
23-Jun-2019 00:00:07 [INFO] --- maven-install-plugin:2.4:install (default-install) @ spring-security-oauth-parent ---
23-Jun-2019 00:00:07 [INFO] Installing /opt/bamboo-home/xml-data/build-dir/SECOAUTH-NIGHTLY-JOB1/pom.xml to /home/bamboo/.m2/repository/org/springframework/security/oauth/spring-security-oauth-parent/2.3.7.BUILD-SNAPSHOT/spring-security-oauth-parent-2.3.7.BUILD-SNAPSHOT.pom
23-Jun-2019 00:00:07 [INFO]                                                                         
23-Jun-2019 00:00:07 [INFO] ------------------------------------------------------------------------
23-Jun-2019 00:00:07 [INFO] Building OAuth 1(a) for Spring Security 2.3.7.BUILD-SNAPSHOT
23-Jun-2019 00:00:07 [INFO] ------------------------------------------------------------------------
23-Jun-2019 00:00:07 [INFO]
23-Jun-2019 00:00:07 [INFO] --- maven-clean-plugin:2.5:clean (default-clean) @ spring-security-oauth ---
23-Jun-2019 00:00:07 [INFO]
23-Jun-2019 00:00:07 [INFO] --- maven-resources-plugin:2.6:resources (default-resources) @ spring-security-oauth ---
23-Jun-2019 00:00:07 [INFO] Using 'UTF-8' encoding to copy filtered resources.
23-Jun-2019 00:00:07 [INFO] Copying 3 resources
23-Jun-2019 00:00:07 [INFO]
23-Jun-2019 00:00:07 [INFO] --- maven-compiler-plugin:2.3.2:compile (default-compile) @ spring-security-oauth ---
23-Jun-2019 00:00:07 [INFO] Compiling 108 source files to /opt/bamboo-home/xml-data/build-dir/SECOAUTH-NIGHTLY-JOB1/spring-security-oauth/target/classes
23-Jun-2019 00:00:08 [WARNING] /opt/bamboo-home/xml-data/build-dir/SECOAUTH-NIGHTLY-JOB1/spring-security-oauth/src/main/java/org/springframework/security/oauth/consumer/net/OAuthOverHttpsURLStreamHandler.java:[36,78] Handler is internal proprietary API and may be removed in a future release
23-Jun-2019 00:00:08 [WARNING] /opt/bamboo-home/xml-data/build-dir/SECOAUTH-NIGHTLY-JOB1/spring-security-oauth/src/main/java/org/springframework/security/oauth/consumer/net/OAuthOverHttpURLStreamHandler.java:[36,76] Handler is internal proprietary API and may be removed in a future release
23-Jun-2019 00:00:08 [INFO]
23-Jun-2019 00:00:08 [INFO] --- maven-resources-plugin:2.6:testResources (default-testResources) @ spring-security-oauth ---
23-Jun-2019 00:00:08 [INFO] Using 'UTF-8' encoding to copy filtered resources.
23-Jun-2019 00:00:08 [INFO] Copying 8 resources
23-Jun-2019 00:00:08 [INFO]
23-Jun-2019 00:00:08 [INFO] --- maven-compiler-plugin:2.3.2:testCompile (default-testCompile) @ spring-security-oauth ---
23-Jun-2019 00:00:08 [INFO] Compiling 22 source files to /opt/bamboo-home/xml-data/build-dir/SECOAUTH-NIGHTLY-JOB1/spring-security-oauth/target/test-classes
23-Jun-2019 00:00:09 [WARNING] /opt/bamboo-home/xml-data/build-dir/SECOAUTH-NIGHTLY-JOB1/spring-security-oauth/src/test/java/org/springframework/security/oauth/consumer/client/CoreOAuthConsumerSupportTests.java:[65,32] Handler is internal proprietary API and may be removed in a future release
23-Jun-2019 00:00:09 [WARNING] /opt/bamboo-home/xml-data/build-dir/SECOAUTH-NIGHTLY-JOB1/spring-security-oauth/src/test/java/org/springframework/security/oauth/consumer/client/CoreOAuthConsumerSupportTests.java:[483,54] Handler is internal proprietary API and may be removed in a future release
23-Jun-2019 00:00:09 [INFO]
23-Jun-2019 00:00:09 [INFO] --- maven-surefire-plugin:2.12.4:test (default-test) @ spring-security-oauth ---
23-Jun-2019 00:00:09 [INFO] Surefire report directory: /opt/bamboo-home/xml-data/build-dir/SECOAUTH-NIGHTLY-JOB1/spring-security-oauth/target/surefire-reports
23-Jun-2019 00:00:09
23-Jun-2019 00:00:09 -------------------------------------------------------
23-Jun-2019 00:00:09 T E S T S
23-Jun-2019 00:00:09 -------------------------------------------------------
23-Jun-2019 00:00:10 Running org.springframework.security.oauth.config.FilterChainInitializationTests
23-Jun-2019 00:00:11 Tests run: 1, Failures: 0, Errors: 0, Skipped: 0, Time elapsed: 0.999 sec
23-Jun-2019 00:00:11 Running org.springframework.security.oauth.config.AuthorizationServerBeanDefinitionParserTests
23-Jun-2019 00:00:11 Tests run: 2, Failures: 0, Errors: 0, Skipped: 0, Time elapsed: 0.335 sec
23-Jun-2019 00:00:11 Running org.springframework.security.oauth.config.ConsumerServiceBeanDefinitionParserTests
23-Jun-2019 00:00:11 Tests run: 2, Failures: 0, Errors: 0, Skipped: 0, Time elapsed: 0.258 sec
23-Jun-2019 00:00:11 Running org.springframework.security.oauth.provider.nonce.InMemoryNonceServicesTests
23-Jun-2019 00:00:11 Tests run: 5, Failures: 0, Errors: 0, Skipped: 0, Time elapsed: 0.006 sec
23-Jun-2019 00:00:11 Running org.springframework.security.oauth.provider.filter.ProtectedResourceProcessingFilterTests
23-Jun-2019 00:00:11 Tests run: 1, Failures: 0, Errors: 0, Skipped: 0, Time elapsed: 0.137 sec
23-Jun-2019 00:00:11 Running org.springframework.security.oauth.provider.filter.OAuthProcessingFilterTests
23-Jun-2019 00:00:11 Tests run: 3, Failures: 0, Errors: 0, Skipped: 0, Time elapsed: 0.043 sec
23-Jun-2019 00:00:11 Running org.springframework.security.oauth.provider.filter.OAuthUserAuthorizationProcessingFilterTests
23-Jun-2019 00:00:11 Tests run: 1, Failures: 0, Errors: 0, Skipped: 0, Time elapsed: 0.003 sec
23-Jun-2019 00:00:11 Running org.springframework.security.oauth.provider.filter.UserAuthorizationSuccessfulAuthenticationHandlerTests
23-Jun-2019 00:00:11 Tests run: 1, Failures: 0, Errors: 0, Skipped: 0, Time elapsed: 0.003 sec
23-Jun-2019 00:00:11 Running org.springframework.security.oauth.provider.filter.AccessTokenProcessingFilterTests
23-Jun-2019 00:00:11 Tests run: 2, Failures: 0, Errors: 0, Skipped: 0, Time elapsed: 0.003 sec
23-Jun-2019 00:00:11 Running org.springframework.security.oauth.provider.filter.UnauthenticatedRequestTokenProcessingFilterTests
23-Jun-2019 00:00:11 Tests run: 2, Failures: 0, Errors: 0, Skipped: 0, Time elapsed: 0.003 sec
23-Jun-2019 00:00:11 Running org.springframework.security.oauth.provider.CoreOAuthProviderSupportTests
23-Jun-2019 00:00:11 Tests run: 2, Failures: 0, Errors: 0, Skipped: 0, Time elapsed: 0.003 sec
23-Jun-2019 00:00:11 Running org.springframework.security.oauth.common.signature.PlainTextSignatureMethodTests
23-Jun-2019 00:00:11 Tests run: 1, Failures: 0, Errors: 0, Skipped: 0, Time elapsed: 0 sec
23-Jun-2019 00:00:11 Running org.springframework.security.oauth.common.signature.CoreOAuthSignatureMethodFactoryTests
23-Jun-2019 00:00:12 Tests run: 1, Failures: 0, Errors: 0, Skipped: 0, Time elapsed: 0.248 sec
23-Jun-2019 00:00:12 Running org.springframework.security.oauth.common.signature.RSA_SHA1SignatureMethodTests
23-Jun-2019 00:00:12 Tests run: 2, Failures: 0, Errors: 0, Skipped: 0, Time elapsed: 0.09 sec
23-Jun-2019 00:00:12 Running org.springframework.security.oauth.common.signature.HMAC_SHA1SignatureMethodTests
23-Jun-2019 00:00:12 Tests run: 3, Failures: 0, Errors: 0, Skipped: 0, Time elapsed: 0.027 sec
23-Jun-2019 00:00:12 Running org.springframework.security.oauth.common.OAuthCodecTests
23-Jun-2019 00:00:12 Tests run: 1, Failures: 0, Errors: 0, Skipped: 0, Time elapsed: 0 sec
23-Jun-2019 00:00:12 Running org.springframework.security.oauth.consumer.client.CoreOAuthConsumerSupportTests
23-Jun-2019 00:00:12 Tests run: 10, Failures: 0, Errors: 0, Skipped: 0, Time elapsed: 0.019 sec
23-Jun-2019 00:00:12 Running org.springframework.security.oauth.consumer.client.OAuthRestTemplateTests
23-Jun-2019 00:00:12 Tests run: 2, Failures: 0, Errors: 0, Skipped: 0, Time elapsed: 0.129 sec
23-Jun-2019 00:00:12 Running org.springframework.security.oauth.consumer.GoogleOAuthTests
23-Jun-2019 00:00:12 Tests run: 1, Failures: 0, Errors: 0, Skipped: 0, Time elapsed: 0.001 sec
23-Jun-2019 00:00:12 Running org.springframework.security.oauth.consumer.filter.OAuthConsumerContextFilterTests
23-Jun-2019 00:00:12 Tests run: 2, Failures: 0, Errors: 0, Skipped: 0, Time elapsed: 0.019 sec
23-Jun-2019 00:00:12 Running org.springframework.security.oauth.consumer.rememberme.HttpSessionOAuthRememberMeServicesTests
23-Jun-2019 00:00:12 Tests run: 4, Failures: 0, Errors: 0, Skipped: 0, Time elapsed: 0.009 sec
23-Jun-2019 00:00:12 Running net.oauth.signature.GoogleCodeCompatibilityTests
23-Jun-2019 00:00:12 Tests run: 2, Failures: 0, Errors: 0, Skipped: 0, Time elapsed: 0.016 sec
23-Jun-2019 00:00:12
23-Jun-2019 00:00:12 Results :
23-Jun-2019 00:00:12
23-Jun-2019 00:00:12 Tests run: 51, Failures: 0, Errors: 0, Skipped: 0
23-Jun-2019 00:00:12
23-Jun-2019 00:00:12 [INFO]
23-Jun-2019 00:00:12 [INFO] --- maven-jar-plugin:2.4:jar (default-jar) @ spring-security-oauth ---
23-Jun-2019 00:00:12 [INFO] Building jar: /opt/bamboo-home/xml-data/build-dir/SECOAUTH-NIGHTLY-JOB1/spring-security-oauth/target/spring-security-oauth-2.3.7.BUILD-SNAPSHOT.jar
23-Jun-2019 00:00:12 [INFO]
23-Jun-2019 00:00:12 [INFO] >>> maven-source-plugin:2.1.2:jar (attach-sources) > generate-sources @ spring-security-oauth >>>
23-Jun-2019 00:00:12 [INFO]
23-Jun-2019 00:00:12 [INFO] <<< maven-source-plugin:2.1.2:jar (attach-sources) < generate-sources @ spring-security-oauth <<<
23-Jun-2019 00:00:12 [INFO]
23-Jun-2019 00:00:12 [INFO] --- maven-source-plugin:2.1.2:jar (attach-sources) @ spring-security-oauth ---
23-Jun-2019 00:00:13 [INFO] org already added, skipping
23-Jun-2019 00:00:13 [INFO] org/springframework already added, skipping
23-Jun-2019 00:00:13 [INFO] org/springframework/security already added, skipping
23-Jun-2019 00:00:13 [INFO] org/springframework/security/oauth already added, skipping
23-Jun-2019 00:00:13 [INFO] Building jar: /opt/bamboo-home/xml-data/build-dir/SECOAUTH-NIGHTLY-JOB1/spring-security-oauth/target/spring-security-oauth-2.3.7.BUILD-SNAPSHOT-sources.jar
23-Jun-2019 00:00:13 [INFO] org already added, skipping
23-Jun-2019 00:00:13 [INFO] org/springframework already added, skipping
23-Jun-2019 00:00:13 [INFO] org/springframework/security already added, skipping
23-Jun-2019 00:00:13 [INFO] org/springframework/security/oauth already added, skipping
23-Jun-2019 00:00:13 [INFO]
23-Jun-2019 00:00:13 [INFO] --- maven-javadoc-plugin:2.9.1:jar (javadoc) @ spring-security-oauth ---
23-Jun-2019 00:00:16 [INFO]
23-Jun-2019 00:00:16 2 warnings
23-Jun-2019 00:00:16 [WARNING] Javadoc Warnings
23-Jun-2019 00:00:16 [WARNING] /opt/bamboo-home/xml-data/build-dir/SECOAUTH-NIGHTLY-JOB1/spring-security-oauth/src/main/java/org/springframework/security/oauth/consumer/net/OAuthOverHttpURLStreamHandler.java:36: warning: Handler is internal proprietary API and may be removed in a future release
23-Jun-2019 00:00:16 [WARNING] public class OAuthOverHttpURLStreamHandler extends sun.net.www.protocol.http.Handler {
23-Jun-2019 00:00:16 [WARNING] ^
23-Jun-2019 00:00:16 [WARNING] /opt/bamboo-home/xml-data/build-dir/SECOAUTH-NIGHTLY-JOB1/spring-security-oauth/src/main/java/org/springframework/security/oauth/consumer/net/OAuthOverHttpsURLStreamHandler.java:36: warning: Handler is internal proprietary API and may be removed in a future release
23-Jun-2019 00:00:16 [WARNING] public class OAuthOverHttpsURLStreamHandler extends sun.net.www.protocol.https.Handler {
23-Jun-2019 00:00:16 [WARNING] ^
23-Jun-2019 00:00:16 [INFO] Building jar: /opt/bamboo-home/xml-data/build-dir/SECOAUTH-NIGHTLY-JOB1/spring-security-oauth/target/spring-security-oauth-2.3.7.BUILD-SNAPSHOT-javadoc.jar
23-Jun-2019 00:00:16 [INFO]
23-Jun-2019 00:00:16 [INFO] --- maven-install-plugin:2.4:install (default-install) @ spring-security-oauth ---
23-Jun-2019 00:00:16 [INFO] Installing /opt/bamboo-home/xml-data/build-dir/SECOAUTH-NIGHTLY-JOB1/spring-security-oauth/target/spring-security-oauth-2.3.7.BUILD-SNAPSHOT.jar to /home/bamboo/.m2/repository/org/springframework/security/oauth/spring-security-oauth/2.3.7.BUILD-SNAPSHOT/spring-security-oauth-2.3.7.BUILD-SNAPSHOT.jar
23-Jun-2019 00:00:16 [INFO] Installing /opt/bamboo-home/xml-data/build-dir/SECOAUTH-NIGHTLY-JOB1/spring-security-oauth/pom.xml to /home/bamboo/.m2/repository/org/springframework/security/oauth/spring-security-oauth/2.3.7.BUILD-SNAPSHOT/spring-security-oauth-2.3.7.BUILD-SNAPSHOT.pom
23-Jun-2019 00:00:16 [INFO] Installing /opt/bamboo-home/xml-data/build-dir/SECOAUTH-NIGHTLY-JOB1/spring-security-oauth/target/spring-security-oauth-2.3.7.BUILD-SNAPSHOT-sources.jar to /home/bamboo/.m2/repository/org/springframework/security/oauth/spring-security-oauth/2.3.7.BUILD-SNAPSHOT/spring-security-oauth-2.3.7.BUILD-SNAPSHOT-sources.jar
23-Jun-2019 00:00:16 [INFO] Installing /opt/bamboo-home/xml-data/build-dir/SECOAUTH-NIGHTLY-JOB1/spring-security-oauth/target/spring-security-oauth-2.3.7.BUILD-SNAPSHOT-javadoc.jar to /home/bamboo/.m2/repository/org/springframework/security/oauth/spring-security-oauth/2.3.7.BUILD-SNAPSHOT/spring-security-oauth-2.3.7.BUILD-SNAPSHOT-javadoc.jar
23-Jun-2019 00:00:16 [INFO]                                                                         
23-Jun-2019 00:00:16 [INFO] ------------------------------------------------------------------------
23-Jun-2019 00:00:16 [INFO] Building OAuth2 for Spring Security 2.3.7.BUILD-SNAPSHOT
23-Jun-2019 00:00:16 [INFO] ------------------------------------------------------------------------
23-Jun-2019 00:00:16 [INFO]
23-Jun-2019 00:00:16 [INFO] --- maven-clean-plugin:2.5:clean (default-clean) @ spring-security-oauth2 ---
23-Jun-2019 00:00:16 [INFO]
23-Jun-2019 00:00:16 [INFO] --- maven-resources-plugin:2.6:resources (default-resources) @ spring-security-oauth2 ---
23-Jun-2019 00:00:16 [INFO] Using 'UTF-8' encoding to copy filtered resources.
23-Jun-2019 00:00:16 [INFO] Copying 4 resources
23-Jun-2019 00:00:16 [INFO]
23-Jun-2019 00:00:16 [INFO] --- maven-compiler-plugin:2.3.2:compile (default-compile) @ spring-security-oauth2 ---
23-Jun-2019 00:00:16 [INFO] Compiling 249 source files to /opt/bamboo-home/xml-data/build-dir/SECOAUTH-NIGHTLY-JOB1/spring-security-oauth2/target/classes
23-Jun-2019 00:00:19 [INFO]
23-Jun-2019 00:00:19 [INFO] --- maven-resources-plugin:2.6:testResources (default-testResources) @ spring-security-oauth2 ---
23-Jun-2019 00:00:19 [INFO] Using 'UTF-8' encoding to copy filtered resources.
23-Jun-2019 00:00:19 [INFO] Copying 21 resources
23-Jun-2019 00:00:19 [INFO]
23-Jun-2019 00:00:19 [INFO] --- maven-compiler-plugin:2.3.2:testCompile (default-testCompile) @ spring-security-oauth2 ---
23-Jun-2019 00:00:19 [INFO] Compiling 120 source files to /opt/bamboo-home/xml-data/build-dir/SECOAUTH-NIGHTLY-JOB1/spring-security-oauth2/target/test-classes
23-Jun-2019 00:00:21 [INFO]
23-Jun-2019 00:00:21 [INFO] --- maven-surefire-plugin:2.12.4:test (default-test) @ spring-security-oauth2 ---
23-Jun-2019 00:00:21 [INFO] Surefire report directory: /opt/bamboo-home/xml-data/build-dir/SECOAUTH-NIGHTLY-JOB1/spring-security-oauth2/target/surefire-reports
23-Jun-2019 00:00:21
23-Jun-2019 00:00:21 -------------------------------------------------------
23-Jun-2019 00:00:21 T E S T S
23-Jun-2019 00:00:21 -------------------------------------------------------
23-Jun-2019 00:00:21 Running org.springframework.security.oauth2.config.annotation.TokenServicesMultipleBeansTests
23-Jun-2019 00:00:23 Tests run: 1, Failures: 0, Errors: 0, Skipped: 0, Time elapsed: 1.411 sec
23-Jun-2019 00:00:23 Running org.springframework.security.oauth2.config.annotation.Gh501EnableAuthorizationServerTests
23-Jun-2019 00:00:23 Tests run: 1, Failures: 0, Errors: 0, Skipped: 0, Time elapsed: 0.678 sec
23-Jun-2019 00:00:23 Running org.springframework.security.oauth2.config.annotation.ClientConfigurationTests
23-Jun-2019 00:00:24 Tests run: 1, Failures: 0, Errors: 0, Skipped: 0, Time elapsed: 0.252 sec
23-Jun-2019 00:00:24 Running org.springframework.security.oauth2.config.annotation.ResourceServerConfigurationTests
23-Jun-2019 00:00:24 [WARN] TokenEndpoint - Handling error: InvalidRequestException, Missing grant type
23-Jun-2019 00:00:25 [WARN] PageNotFound - No mapping found for HTTP request with URI [/] in DispatcherServlet with name ''
23-Jun-2019 00:00:25 [WARN] PageNotFound - No mapping found for HTTP request with URI [/] in DispatcherServlet with name ''
23-Jun-2019 00:00:25 [WARN] PageNotFound - No mapping found for HTTP request with URI [/] in DispatcherServlet with name ''
23-Jun-2019 00:00:25 [WARN] PageNotFound - No mapping found for HTTP request with URI [/] in DispatcherServlet with name ''
23-Jun-2019 00:00:25 [WARN] TokenEndpoint - Handling error: InvalidRequestException, Missing grant type
23-Jun-2019 00:00:25 Tests run: 9, Failures: 0, Errors: 0, Skipped: 0, Time elapsed: 1.556 sec
23-Jun-2019 00:00:25 Running org.springframework.security.oauth2.config.annotation.AuthorizationServerConfigurationTests
23-Jun-2019 00:00:25 [WARN] AnnotationConfigWebApplicationContext - Exception encountered during context initialization - cancelling refresh attempt: org.springframework.beans.factory.UnsatisfiedDependencyException: Error creating bean with name 'org.springframework.security.config.annotation.web.configuration.WebSecurityConfiguration': Unsatisfied dependency expressed through method 'setFilterChainProxySecurityConfigurer' parameter 1; nested exception is org.springframework.beans.factory.BeanExpressionException: Expression parsing failed; nested exception is org.springframework.beans.factory.UnsatisfiedDependencyException: Error creating bean with name 'org.springframework.security.oauth2.config.annotation.web.configuration.AuthorizationServerSecurityConfiguration': Unsatisfied dependency expressed through field 'configurers'; nested exception is org.springframework.beans.factory.NoSuchBeanDefinitionException: No qualifying bean of type 'java.util.List<org.springframework.security.oauth2.config.annotation.web.configuration.AuthorizationServerConfigurer>' available: expected at least 1 bean which qualifies as autowire candidate. Dependency annotations: {@org.springframework.beans.factory.annotation.Autowired(required=true)}
23-Jun-2019 00:00:26 [WARN] JwtAccessTokenConverter - Unable to create an RSA verifier from verifierKey (ignoreable if using MAC)
23-Jun-2019 00:00:27 [WARN] AnnotationConfigWebApplicationContext - Exception encountered during context initialization - cancelling refresh attempt: org.springframework.beans.factory.UnsatisfiedDependencyException: Error creating bean with name 'authorizationServerConfigurationTests.AuthorizationServerTypes': Unsatisfied dependency expressed through field 'tokenServices'; nested exception is org.springframework.beans.factory.BeanCreationException: Error creating bean with name 'org.springframework.security.oauth2.config.annotation.web.configuration.AuthorizationServerEndpointsConfiguration': Invocation of init method failed; nested exception is java.lang.AssertionError
23-Jun-2019 00:00:27 Tests run: 20, Failures: 0, Errors: 0, Skipped: 0, Time elapsed: 2.175 sec
23-Jun-2019 00:00:27 Running org.springframework.security.oauth2.config.annotation.Gh808EnableAuthorizationServerTests
23-Jun-2019 00:00:28 Tests run: 2, Failures: 0, Errors: 0, Skipped: 0, Time elapsed: 0.141 sec
23-Jun-2019 00:00:28 Running org.springframework.security.oauth2.config.xml.ResourceServerBeanDefinitionParserTests
23-Jun-2019 00:00:28 Tests run: 2, Failures: 0, Errors: 0, Skipped: 0, Time elapsed: 0.182 sec
23-Jun-2019 00:00:28 Running org.springframework.security.oauth2.config.xml.AuthorizationServerInvalidParserTests
23-Jun-2019 00:00:28 Tests run: 1, Failures: 0, Errors: 0, Skipped: 0, Time elapsed: 0.029 sec
23-Jun-2019 00:00:28 Running org.springframework.security.oauth2.config.xml.AuthorizationServerBeanDefinitionParserTests
23-Jun-2019 00:00:28 Tests run: 12, Failures: 0, Errors: 0, Skipped: 0, Time elapsed: 0.481 sec
23-Jun-2019 00:00:28 Running org.springframework.security.oauth2.config.xml.ClientDetailsServiceBeanDefinitionParserTests
23-Jun-2019 00:00:28 Tests run: 3, Failures: 0, Errors: 0, Skipped: 0, Time elapsed: 0.036 sec
23-Jun-2019 00:00:28 Running org.springframework.security.oauth2.config.xml.ResourceBeanDefinitionParserTests
23-Jun-2019 00:00:28 Tests run: 7, Failures: 0, Errors: 0, Skipped: 0, Time elapsed: 0.066 sec
23-Jun-2019 00:00:28 Running org.springframework.security.oauth2.config.xml.InvalidResourceBeanDefinitionParserTests
23-Jun-2019 00:00:28 Tests run: 5, Failures: 0, Errors: 0, Skipped: 0, Time elapsed: 0.063 sec
23-Jun-2019 00:00:28 Running org.springframework.security.oauth2.config.xml.AuthorizationServerCustomGrantParserTests
23-Jun-2019 00:00:28 Tests run: 1, Failures: 0, Errors: 0, Skipped: 0, Time elapsed: 0.021 sec
23-Jun-2019 00:00:28 Running org.springframework.security.oauth2.config.xml.AuthorizationServerClientCredentialsPasswordInvalidXmlTests
23-Jun-2019 00:00:29 Tests run: 2, Failures: 0, Errors: 0, Skipped: 0, Time elapsed: 0.323 sec
23-Jun-2019 00:00:29 Running org.springframework.security.oauth2.config.xml.AuthorizationServerClientCredentialsPasswordValidXmlTests
23-Jun-2019 00:00:29 Tests run: 2, Failures: 0, Errors: 0, Skipped: 0, Time elapsed: 0.219 sec
23-Jun-2019 00:00:29 Running org.springframework.security.oauth2.http.converter.jaxb.JaxbOAuth2ExceptionMessageConverterTests
23-Jun-2019 00:00:30 Tests run: 22, Failures: 0, Errors: 0, Skipped: 0, Time elapsed: 1.472 sec
23-Jun-2019 00:00:30 Running org.springframework.security.oauth2.http.converter.jaxb.JaxbOAuth2AccessTokenMessageConverterTests
23-Jun-2019 00:00:31 Tests run: 8, Failures: 0, Errors: 0, Skipped: 0, Time elapsed: 0.842 sec
23-Jun-2019 00:00:31 Running org.springframework.security.oauth2.client.http.OAuth2ErrorHandlerTests
23-Jun-2019 00:00:31 Tests run: 12, Failures: 0, Errors: 0, Skipped: 0, Time elapsed: 0.057 sec
23-Jun-2019 00:00:31 Running org.springframework.security.oauth2.client.DefaultOAuth2RequestAuthenticatorTests
23-Jun-2019 00:00:31 Tests run: 6, Failures: 0, Errors: 0, Skipped: 0, Time elapsed: 0.002 sec
23-Jun-2019 00:00:31 Running org.springframework.security.oauth2.client.token.grant.password.ResourceOwnerPasswordAccessTokenProviderTests
23-Jun-2019 00:00:31 Tests run: 3, Failures: 0, Errors: 0, Skipped: 0, Time elapsed: 0 sec
23-Jun-2019 00:00:31 Running org.springframework.security.oauth2.client.token.grant.implicit.ImplicitAccessTokenProviderTests
23-Jun-2019 00:00:31 Tests run: 2, Failures: 0, Errors: 0, Skipped: 0, Time elapsed: 0.001 sec
23-Jun-2019 00:00:31 Running org.springframework.security.oauth2.client.token.grant.code.AuthorizationCodeAccessTokenProviderWithConversionTests
23-Jun-2019 00:00:32 Tests run: 4, Failures: 0, Errors: 0, Skipped: 0, Time elapsed: 0.125 sec
23-Jun-2019 00:00:32 Running org.springframework.security.oauth2.client.token.grant.code.AuthorizationCodeAccessTokenProviderTests
23-Jun-2019 00:00:32 Tests run: 5, Failures: 0, Errors: 0, Skipped: 0, Time elapsed: 0.002 sec
23-Jun-2019 00:00:32 Running org.springframework.security.oauth2.client.token.grant.code.AuthorizationCodeResourceDetailsTests
23-Jun-2019 00:00:32 Tests run: 2, Failures: 0, Errors: 0, Skipped: 0, Time elapsed: 0.001 sec
23-Jun-2019 00:00:32 Running org.springframework.security.oauth2.client.token.JdbcClientTokenServicesTests
23-Jun-2019 00:00:32 Tests run: 3, Failures: 0, Errors: 0, Skipped: 0, Time elapsed: 0.339 sec
23-Jun-2019 00:00:32 Running org.springframework.security.oauth2.client.token.OAuth2AccessTokenSupportTests
23-Jun-2019 00:00:32 Tests run: 5, Failures: 0, Errors: 0, Skipped: 0, Time elapsed: 0.026 sec
23-Jun-2019 00:00:32 Running org.springframework.security.oauth2.client.token.AccessTokenProviderChainTests
23-Jun-2019 00:00:32 Tests run: 15, Failures: 0, Errors: 0, Skipped: 0, Time elapsed: 0.028 sec
23-Jun-2019 00:00:32 Running org.springframework.security.oauth2.client.filter.OAuth2ClientContextFilterTests
23-Jun-2019 00:00:32 Tests run: 11, Failures: 0, Errors: 0, Skipped: 0, Time elapsed: 0.008 sec
23-Jun-2019 00:00:32 Running org.springframework.security.oauth2.client.filter.OAuth2ClientAuthenticationProcessingFilterTests
23-Jun-2019 00:00:32 Tests run: 5, Failures: 0, Errors: 0, Skipped: 0, Time elapsed: 0.018 sec
23-Jun-2019 00:00:32 Running org.springframework.security.oauth2.client.OAuth2RestTemplateTests
23-Jun-2019 00:00:32 Tests run: 12, Failures: 0, Errors: 0, Skipped: 0, Time elapsed: 0.209 sec
23-Jun-2019 00:00:32 Running org.springframework.security.oauth2.provider.request.DefaultAuthorizationRequestFactoryTests
23-Jun-2019 00:00:32 Tests run: 9, Failures: 0, Errors: 0, Skipped: 0, Time elapsed: 0.003 sec
23-Jun-2019 00:00:32 Running org.springframework.security.oauth2.provider.request.DefaultOAuth2RequestValidatorTests
23-Jun-2019 00:00:32 Tests run: 3, Failures: 0, Errors: 0, Skipped: 0, Time elapsed: 0.001 sec
23-Jun-2019 00:00:32 Running org.springframework.security.oauth2.provider.password.ResourceOwnerPasswordTokenGranterTests
23-Jun-2019 00:00:32 Tests run: 7, Failures: 0, Errors: 0, Skipped: 0, Time elapsed: 0.004 sec
23-Jun-2019 00:00:32 Running org.springframework.security.oauth2.provider.client.BaseClientDetailsTests
23-Jun-2019 00:00:32 Tests run: 11, Failures: 0, Errors: 0, Skipped: 0, Time elapsed: 0.047 sec
23-Jun-2019 00:00:32 Running org.springframework.security.oauth2.provider.client.JdbcClientDetailsServiceTests
23-Jun-2019 00:00:32 Tests run: 14, Failures: 0, Errors: 0, Skipped: 0, Time elapsed: 0.274 sec
23-Jun-2019 00:00:32 Running org.springframework.security.oauth2.provider.client.ClientCredentialsTokenEndpointFilterTests
23-Jun-2019 00:00:33 Tests run: 3, Failures: 0, Errors: 0, Skipped: 0, Time elapsed: 0.022 sec
23-Jun-2019 00:00:33 Running org.springframework.security.oauth2.provider.client.ClientDetailsUserDetailsServiceTests
23-Jun-2019 00:00:33 Tests run: 2, Failures: 0, Errors: 0, Skipped: 0, Time elapsed: 0.005 sec
23-Jun-2019 00:00:33 Running org.springframework.security.oauth2.provider.approval.ApprovalStoreUserApprovalHandlerTests
23-Jun-2019 00:00:33 Tests run: 10, Failures: 0, Errors: 0, Skipped: 0, Time elapsed: 0.005 sec
23-Jun-2019 00:00:33 Running org.springframework.security.oauth2.provider.approval.DefaultUserApprovalHandlerTests
23-Jun-2019 00:00:33 Tests run: 1, Failures: 0, Errors: 0, Skipped: 0, Time elapsed: 0.001 sec
23-Jun-2019 00:00:33 Running org.springframework.security.oauth2.provider.approval.TokenStoreUserApprovalHandlerTests
23-Jun-2019 00:00:33 Tests run: 3, Failures: 0, Errors: 0, Skipped: 0, Time elapsed: 0.001 sec
23-Jun-2019 00:00:33 Running org.springframework.security.oauth2.provider.approval.JdbcApprovalStoreTests
23-Jun-2019 00:00:33 Tests run: 6, Failures: 0, Errors: 0, Skipped: 0, Time elapsed: 0.074 sec
23-Jun-2019 00:00:33 Running org.springframework.security.oauth2.provider.approval.InMemoryApprovalStoreTests
23-Jun-2019 00:00:33 Tests run: 5, Failures: 0, Errors: 0, Skipped: 0, Time elapsed: 0.001 sec
23-Jun-2019 00:00:33 Running org.springframework.security.oauth2.provider.approval.TokenApprovalStoreTests
23-Jun-2019 00:00:33 Tests run: 5, Failures: 0, Errors: 0, Skipped: 0, Time elapsed: 0.004 sec
23-Jun-2019 00:00:33 Running org.springframework.security.oauth2.provider.vote.ClientScopeVoterTests
23-Jun-2019 00:00:33 Tests run: 3, Failures: 0, Errors: 0, Skipped: 0, Time elapsed: 0.002 sec
23-Jun-2019 00:00:33 Running org.springframework.security.oauth2.provider.vote.ScopeVoterTests
23-Jun-2019 00:00:33 Tests run: 6, Failures: 0, Errors: 0, Skipped: 0, Time elapsed: 0.002 sec
23-Jun-2019 00:00:33 Running org.springframework.security.oauth2.provider.test.OAuth2RequestTests
23-Jun-2019 00:00:33 Tests run: 4, Failures: 0, Errors: 0, Skipped: 0, Time elapsed: 0.001 sec
23-Jun-2019 00:00:33 Running org.springframework.security.oauth2.provider.token.DefaultTokenServicesWithJdbcTests
23-Jun-2019 00:00:33 Tests run: 19, Failures: 0, Errors: 0, Skipped: 0, Time elapsed: 0.388 sec
23-Jun-2019 00:00:33 Running org.springframework.security.oauth2.provider.token.store.JwtAccessTokenConverterTests
23-Jun-2019 00:00:33 [WARN] JwtAccessTokenConverter - Unable to create an RSA verifier from verifierKey (ignoreable if using MAC)
23-Jun-2019 00:00:33 [WARN] JwtAccessTokenConverter - Unable to create an RSA verifier from verifierKey (ignoreable if using MAC)
23-Jun-2019 00:00:33 [WARN] JwtAccessTokenConverter - Unable to create an RSA verifier from verifierKey (ignoreable if using MAC)
23-Jun-2019 00:00:33 Tests run: 14, Failures: 0, Errors: 0, Skipped: 0, Time elapsed: 0.17 sec
23-Jun-2019 00:00:33 Running org.springframework.security.oauth2.provider.token.store.InMemoryTokenStoreTests
23-Jun-2019 00:00:33 Tests run: 16, Failures: 0, Errors: 0, Skipped: 0, Time elapsed: 0.011 sec
23-Jun-2019 00:00:33 Running org.springframework.security.oauth2.provider.token.store.JwtTokenStoreTests
23-Jun-2019 00:00:33 [WARN] JwtAccessTokenConverter - Unable to create an RSA verifier from verifierKey (ignoreable if using MAC)
23-Jun-2019 00:00:33 [WARN] JwtAccessTokenConverter - Unable to create an RSA verifier from verifierKey (ignoreable if using MAC)
23-Jun-2019 00:00:33 [WARN] JwtAccessTokenConverter - Unable to create an RSA verifier from verifierKey (ignoreable if using MAC)
23-Jun-2019 00:00:33 [WARN] JwtAccessTokenConverter - Unable to create an RSA verifier from verifierKey (ignoreable if using MAC)
23-Jun-2019 00:00:33 [WARN] JwtAccessTokenConverter - Unable to create an RSA verifier from verifierKey (ignoreable if using MAC)
23-Jun-2019 00:00:33 [WARN] JwtAccessTokenConverter - Unable to create an RSA verifier from verifierKey (ignoreable if using MAC)
23-Jun-2019 00:00:33 [WARN] JwtAccessTokenConverter - Unable to create an RSA verifier from verifierKey (ignoreable if using MAC)
23-Jun-2019 00:00:33 [WARN] JwtAccessTokenConverter - Unable to create an RSA verifier from verifierKey (ignoreable if using MAC)
23-Jun-2019 00:00:33 [WARN] JwtAccessTokenConverter - Unable to create an RSA verifier from verifierKey (ignoreable if using MAC)
23-Jun-2019 00:00:33 [WARN] JwtAccessTokenConverter - Unable to create an RSA verifier from verifierKey (ignoreable if using MAC)
23-Jun-2019 00:00:33 [WARN] JwtAccessTokenConverter - Unable to create an RSA verifier from verifierKey (ignoreable if using MAC)
23-Jun-2019 00:00:33 [WARN] JwtAccessTokenConverter - Unable to create an RSA verifier from verifierKey (ignoreable if using MAC)
23-Jun-2019 00:00:33 [WARN] JwtAccessTokenConverter - Unable to create an RSA verifier from verifierKey (ignoreable if using MAC)
23-Jun-2019 00:00:33 [WARN] JwtAccessTokenConverter - Unable to create an RSA verifier from verifierKey (ignoreable if using MAC)
23-Jun-2019 00:00:33 [WARN] JwtAccessTokenConverter - Unable to create an RSA verifier from verifierKey (ignoreable if using MAC)
23-Jun-2019 00:00:33 [WARN] JwtAccessTokenConverter - Unable to create an RSA verifier from verifierKey (ignoreable if using MAC)
23-Jun-2019 00:00:33 [WARN] JwtAccessTokenConverter - Unable to create an RSA verifier from verifierKey (ignoreable if using MAC)
23-Jun-2019 00:00:33 [WARN] JwtAccessTokenConverter - Unable to create an RSA verifier from verifierKey (ignoreable if using MAC)
23-Jun-2019 00:00:33 Tests run: 18, Failures: 0, Errors: 0, Skipped: 0, Time elapsed: 0.039 sec
23-Jun-2019 00:00:33 Running org.springframework.security.oauth2.provider.token.store.redis.RedisTokenStorePrefixTests
23-Jun-2019 00:00:36 Tests run: 15, Failures: 0, Errors: 0, Skipped: 0, Time elapsed: 3.114 sec
23-Jun-2019 00:00:36 Running org.springframework.security.oauth2.provider.token.store.redis.RedisTokenStoreMockTests
23-Jun-2019 00:00:36 Tests run: 2, Failures: 0, Errors: 0, Skipped: 0, Time elapsed: 0.065 sec
23-Jun-2019 00:00:36 Running org.springframework.security.oauth2.provider.token.store.redis.RedisTokenStoreTests
23-Jun-2019 00:00:39 Tests run: 16, Failures: 0, Errors: 0, Skipped: 0, Time elapsed: 3.053 sec
23-Jun-2019 00:00:39 Running org.springframework.security.oauth2.provider.token.store.JdbcTokenStoreTests
23-Jun-2019 00:00:40 Tests run: 14, Failures: 0, Errors: 0, Skipped: 0, Time elapsed: 0.154 sec
23-Jun-2019 00:00:40 Running org.springframework.security.oauth2.provider.token.DefaultTokenServicesAuthoritiesChangeTests
23-Jun-2019 00:00:40 Tests run: 1, Failures: 0, Errors: 0, Skipped: 0, Time elapsed: 0.001 sec
23-Jun-2019 00:00:40 Running org.springframework.security.oauth2.provider.token.DefaultUserAuthenticationConverterTests
23-Jun-2019 00:00:40 Tests run: 3, Failures: 0, Errors: 0, Skipped: 0, Time elapsed: 0.003 sec
23-Jun-2019 00:00:40 Running org.springframework.security.oauth2.provider.token.TokenServicesWithTokenEnhancerTests
23-Jun-2019 00:00:40 [WARN] JwtAccessTokenConverter - Unable to create an RSA verifier from verifierKey (ignoreable if using MAC)
23-Jun-2019 00:00:40 [WARN] JwtAccessTokenConverter - Unable to create an RSA verifier from verifierKey (ignoreable if using MAC)
23-Jun-2019 00:00:40 [WARN] JwtAccessTokenConverter - Unable to create an RSA verifier from verifierKey (ignoreable if using MAC)
23-Jun-2019 00:00:40 [WARN] JwtAccessTokenConverter - Unable to create an RSA verifier from verifierKey (ignoreable if using MAC)
23-Jun-2019 00:00:40 [WARN] JwtAccessTokenConverter - Unable to create an RSA verifier from verifierKey (ignoreable if using MAC)
23-Jun-2019 00:00:40 Tests run: 5, Failures: 0, Errors: 0, Skipped: 0, Time elapsed: 0.015 sec
23-Jun-2019 00:00:40 Running org.springframework.security.oauth2.provider.token.DefaultTokenServicesWithJwtTests
23-Jun-2019 00:00:40 [WARN] JwtAccessTokenConverter - Unable to create an RSA verifier from verifierKey (ignoreable if using MAC)
23-Jun-2019 00:00:40 [WARN] JwtAccessTokenConverter - Unable to create an RSA verifier from verifierKey (ignoreable if using MAC)
23-Jun-2019 00:00:40 [WARN] JwtAccessTokenConverter - Unable to create an RSA verifier from verifierKey (ignoreable if using MAC)
23-Jun-2019 00:00:40 [WARN] JwtAccessTokenConverter - Unable to create an RSA verifier from verifierKey (ignoreable if using MAC)
23-Jun-2019 00:00:40 [WARN] JwtAccessTokenConverter - Unable to create an RSA verifier from verifierKey (ignoreable if using MAC)
23-Jun-2019 00:00:40 [WARN] JwtAccessTokenConverter - Unable to create an RSA verifier from verifierKey (ignoreable if using MAC)
23-Jun-2019 00:00:40 [WARN] JwtAccessTokenConverter - Unable to create an RSA verifier from verifierKey (ignoreable if using MAC)
23-Jun-2019 00:00:40 [WARN] JwtAccessTokenConverter - Unable to create an RSA verifier from verifierKey (ignoreable if using MAC)
23-Jun-2019 00:00:40 [WARN] JwtAccessTokenConverter - Unable to create an RSA verifier from verifierKey (ignoreable if using MAC)
23-Jun-2019 00:00:40 [WARN] JwtAccessTokenConverter - Unable to create an RSA verifier from verifierKey (ignoreable if using MAC)
23-Jun-2019 00:00:40 [WARN] JwtAccessTokenConverter - Unable to create an RSA verifier from verifierKey (ignoreable if using MAC)
23-Jun-2019 00:00:40 [WARN] JwtAccessTokenConverter - Unable to create an RSA verifier from verifierKey (ignoreable if using MAC)
23-Jun-2019 00:00:40 [WARN] JwtAccessTokenConverter - Unable to create an RSA verifier from verifierKey (ignoreable if using MAC)
23-Jun-2019 00:00:40 [WARN] JwtAccessTokenConverter - Unable to create an RSA verifier from verifierKey (ignoreable if using MAC)
23-Jun-2019 00:00:40 [WARN] JwtAccessTokenConverter - Unable to create an RSA verifier from verifierKey (ignoreable if using MAC)
23-Jun-2019 00:00:40 Tests run: 15, Failures: 0, Errors: 0, Skipped: 0, Time elapsed: 0.036 sec
23-Jun-2019 00:00:40 Running org.springframework.security.oauth2.provider.token.DefaultTokenServicesTests
23-Jun-2019 00:00:40 Tests run: 1, Failures: 0, Errors: 0, Skipped: 0, Time elapsed: 0.004 sec
23-Jun-2019 00:00:40 Running org.springframework.security.oauth2.provider.token.DefaultTokenServicesWithInMemoryTests
23-Jun-2019 00:00:40 Tests run: 25, Failures: 0, Errors: 0, Skipped: 0, Time elapsed: 0.017 sec
23-Jun-2019 00:00:40 Running org.springframework.security.oauth2.provider.token.DefaultAccessTokenConverterTests
23-Jun-2019 00:00:40 Tests run: 15, Failures: 0, Errors: 0, Skipped: 0, Time elapsed: 0.004 sec
23-Jun-2019 00:00:40 Running org.springframework.security.oauth2.provider.implicit.InMemoryImplicitGrantServiceTests
23-Jun-2019 00:00:40 Tests run: 2, Failures: 0, Errors: 0, Skipped: 0, Time elapsed: 0 sec
23-Jun-2019 00:00:40 Running org.springframework.security.oauth2.provider.error.DefaultWebResponseExceptionTranslatorTests
23-Jun-2019 00:00:40 Tests run: 1, Failures: 0, Errors: 0, Skipped: 0, Time elapsed: 0.001 sec
23-Jun-2019 00:00:40 Running org.springframework.security.oauth2.provider.error.OAuth2AuthenticationEntryPointTests
23-Jun-2019 00:00:40 [WARN] DefaultHandlerExceptionResolver - Resolved exception caused by handler execution: org.springframework.web.HttpMediaTypeNotAcceptableException: Could not find acceptable representation
23-Jun-2019 00:00:40 Tests run: 7, Failures: 0, Errors: 0, Skipped: 0, Time elapsed: 0.035 sec
23-Jun-2019 00:00:40 Running org.springframework.security.oauth2.provider.error.OAuth2AccessDeniedHandlerTests
23-Jun-2019 00:00:40 Tests run: 1, Failures: 0, Errors: 0, Skipped: 0, Time elapsed: 0.007 sec
23-Jun-2019 00:00:40 Running org.springframework.security.oauth2.provider.authentication.OAuth2AuthenticationProcessingFilterTests
23-Jun-2019 00:00:40 Tests run: 8, Failures: 0, Errors: 0, Skipped: 0, Time elapsed: 0.04 sec
23-Jun-2019 00:00:40 Running org.springframework.security.oauth2.provider.authentication.OAuth2AuthenticationDetailsTests
23-Jun-2019 00:00:40 Tests run: 1, Failures: 0, Errors: 0, Skipped: 0, Time elapsed: 0.002 sec
23-Jun-2019 00:00:40 Running org.springframework.security.oauth2.provider.authentication.OAuth2AuthenticationManagerTests
23-Jun-2019 00:00:40 Tests run: 3, Failures: 0, Errors: 0, Skipped: 0, Time elapsed: 0.002 sec
23-Jun-2019 00:00:40 Running org.springframework.security.oauth2.provider.endpoint.FrameworkEndpointHandlerMappingTests
23-Jun-2019 00:00:40 Tests run: 4, Failures: 0, Errors: 0, Skipped: 0, Time elapsed: 0.001 sec
23-Jun-2019 00:00:40 Running org.springframework.security.oauth2.provider.endpoint.WhitelabelApprovalEndpointTests
23-Jun-2019 00:00:40 Tests run: 6, Failures: 0, Errors: 0, Skipped: 0, Time elapsed: 0.003 sec
23-Jun-2019 00:00:40 Running org.springframework.security.oauth2.provider.endpoint.ExactMatchRedirectResolverTests
23-Jun-2019 00:00:40 Tests run: 3, Failures: 0, Errors: 0, Skipped: 0, Time elapsed: 0.002 sec
23-Jun-2019 00:00:40 Running org.springframework.security.oauth2.provider.endpoint.AuthorizationEndpointTests
23-Jun-2019 00:00:40 Tests run: 34, Failures: 0, Errors: 0, Skipped: 0, Time elapsed: 0.025 sec
23-Jun-2019 00:00:40 Running org.springframework.security.oauth2.provider.endpoint.TokenEndpointTests
23-Jun-2019 00:00:40 Tests run: 6, Failures: 0, Errors: 0, Skipped: 0, Time elapsed: 0.009 sec
23-Jun-2019 00:00:40 Running org.springframework.security.oauth2.provider.endpoint.DefaultRedirectResolverTests
23-Jun-2019 00:00:40 Tests run: 31, Failures: 0, Errors: 0, Skipped: 0, Time elapsed: 0.009 sec
23-Jun-2019 00:00:40 Running org.springframework.security.oauth2.provider.endpoint.WhitelabelErrorEndpointTests
23-Jun-2019 00:00:40 Tests run: 3, Failures: 0, Errors: 0, Skipped: 0, Time elapsed: 0.001 sec
23-Jun-2019 00:00:40 Running org.springframework.security.oauth2.provider.endpoint.TokenEndpointAuthenticationFilterTests
23-Jun-2019 00:00:40 Tests run: 3, Failures: 0, Errors: 0, Skipped: 0, Time elapsed: 0.015 sec
23-Jun-2019 00:00:40 Running org.springframework.security.oauth2.provider.AuthorizationRequestTests
23-Jun-2019 00:00:40 Tests run: 9, Failures: 0, Errors: 0, Skipped: 0, Time elapsed: 0.004 sec
23-Jun-2019 00:00:40 Running org.springframework.security.oauth2.provider.OAuth2AuthenticationTests
23-Jun-2019 00:00:40 {"authorities":[{"authority":"ROLE_USER"}],"details":null,"authenticated":false,"userAuthentication":{"authorities":[{"authority":"ROLE_USER"}],"details":null,"authenticated":true,"principal":"foo","credentials":"bar","name":"foo"},"clientOnly":false,"oauth2Request":{"clientId":"id","scope":["read"],"requestParameters":{},"resourceIds":[],"authorities":[],"approved":false,"refresh":false,"redirectUri":null,"responseTypes":[],"extensions":{},"grantType":null,"refreshTokenRequest":null},"principal":"foo","credentials":"","name":"foo"}
23-Jun-2019 00:00:40 Tests run: 8, Failures: 0, Errors: 0, Skipped: 0, Time elapsed: 0.016 sec
23-Jun-2019 00:00:40 Running org.springframework.security.oauth2.provider.expression.OAuth2MethodSecurityExpressionHandlerTests
23-Jun-2019 00:00:40 Tests run: 9, Failures: 0, Errors: 0, Skipped: 0, Time elapsed: 0.008 sec
23-Jun-2019 00:00:40 Running org.springframework.security.oauth2.provider.expression.OAuth2SecurityExpressionMethodsTests
23-Jun-2019 00:00:40 Tests run: 10, Failures: 0, Errors: 0, Skipped: 0, Time elapsed: 0.001 sec
23-Jun-2019 00:00:40 Running org.springframework.security.oauth2.provider.expression.OAuth2WebSecurityExpressionHandlerTests
23-Jun-2019 00:00:40 Tests run: 6, Failures: 0, Errors: 0, Skipped: 0, Time elapsed: 0.002 sec
23-Jun-2019 00:00:40 Running org.springframework.security.oauth2.provider.expression.OAuth2ExpressionParserTests
23-Jun-2019 00:00:40 Tests run: 3, Failures: 0, Errors: 0, Skipped: 0, Time elapsed: 0.007 sec
23-Jun-2019 00:00:40 Running org.springframework.security.oauth2.provider.OAuth2RequestTests
23-Jun-2019 00:00:40 Tests run: 4, Failures: 0, Errors: 0, Skipped: 0, Time elapsed: 0.001 sec
23-Jun-2019 00:00:40 Running org.springframework.security.oauth2.provider.code.AuthorizationCodeTokenGranterTests
23-Jun-2019 00:00:40 Tests run: 5, Failures: 0, Errors: 0, Skipped: 0, Time elapsed: 0.002 sec
23-Jun-2019 00:00:40 Running org.springframework.security.oauth2.provider.code.InMemoryAuthorizationCodeServicesTests
23-Jun-2019 00:00:40 Tests run: 3, Failures: 0, Errors: 0, Skipped: 0, Time elapsed: 0.001 sec
23-Jun-2019 00:00:40 Running org.springframework.security.oauth2.provider.code.JdbcAuthorizationCodeServicesTests
23-Jun-2019 00:00:40 Tests run: 3, Failures: 0, Errors: 0, Skipped: 0, Time elapsed: 0.032 sec
23-Jun-2019 00:00:40 Running org.springframework.security.oauth2.provider.code.SubdomainRedirectResolverTests
23-Jun-2019 00:00:40 Tests run: 2, Failures: 0, Errors: 0, Skipped: 0, Time elapsed: 0 sec
23-Jun-2019 00:00:40 Running org.springframework.security.oauth2.common.OAuth2AccessTokenJackson1DeserializerTests
23-Jun-2019 00:00:41 Tests run: 8, Failures: 0, Errors: 0, Skipped: 0, Time elapsed: 1.08 sec
23-Jun-2019 00:00:41 Running org.springframework.security.oauth2.common.OAuth2AccessTokenJackson2DeserializerTests
23-Jun-2019 00:00:42 Tests run: 9, Failures: 0, Errors: 0, Skipped: 0, Time elapsed: 1.045 sec
23-Jun-2019 00:00:42 Running org.springframework.security.oauth2.common.exception.OAuth2ExceptionDeserializerTests
23-Jun-2019 00:00:42 Tests run: 13, Failures: 0, Errors: 0, Skipped: 0, Time elapsed: 0.009 sec
23-Jun-2019 00:00:42 Running org.springframework.security.oauth2.common.exception.OAuth2ExceptionSerializerTests
23-Jun-2019 00:00:42 Tests run: 11, Failures: 0, Errors: 0, Skipped: 0, Time elapsed: 0.009 sec
23-Jun-2019 00:00:42 Running org.springframework.security.oauth2.common.exception.OAuth2ExceptionJackson2DeserializerTests
23-Jun-2019 00:00:42 Tests run: 14, Failures: 0, Errors: 0, Skipped: 0, Time elapsed: 0.006 sec
23-Jun-2019 00:00:42 Running org.springframework.security.oauth2.common.OAuth2AccessTokenJackson2SerializerTests
23-Jun-2019 00:00:43 Tests run: 10, Failures: 0, Errors: 0, Skipped: 0, Time elapsed: 0.923 sec
23-Jun-2019 00:00:43 Running org.springframework.security.oauth2.common.OAuth2AccessTokenJackson1SerializerTests
23-Jun-2019 00:00:46 Tests run: 1, Failures: 0, Errors: 0, Skipped: 0, Time elapsed: 3.401 sec
23-Jun-2019 00:00:47 Exception: java.lang.OutOfMemoryError thrown from the UncaughtExceptionHandler in thread "main"
23-Jun-2019 00:00:48
23-Jun-2019 00:00:48 Results :
23-Jun-2019 00:00:48
23-Jun-2019 00:00:48 Tests run: 696, Failures: 0, Errors: 0, Skipped: 0
23-Jun-2019 00:00:48
23-Jun-2019 00:00:48 [INFO] ------------------------------------------------------------------------
23-Jun-2019 00:00:48 [INFO] Reactor Summary:
23-Jun-2019 00:00:48 [INFO]
23-Jun-2019 00:00:48 [INFO] OAuth for Spring Security .......................... SUCCESS [  0.959 s]
23-Jun-2019 00:00:48 [INFO] OAuth 1(a) for Spring Security ..................... SUCCESS [  8.969 s]
23-Jun-2019 00:00:48 [INFO] OAuth2 for Spring Security ......................... FAILURE [ 31.790 s]
23-Jun-2019 00:00:48 [INFO] spring-oauth2-tests ................................ SKIPPED
23-Jun-2019 00:00:48 [INFO] spring-oauth2-tests-common ......................... SKIPPED
23-Jun-2019 00:00:48 [INFO] spring-oauth2-tests-vanilla ........................ SKIPPED
23-Jun-2019 00:00:48 [INFO] spring-oauth2-tests-mappings ....................... SKIPPED
23-Jun-2019 00:00:48 [INFO] spring-oauth2-tests-form ........................... SKIPPED
23-Jun-2019 00:00:48 [INFO] spring-oauth2-tests-jwt ............................ SKIPPED
23-Jun-2019 00:00:48 [INFO] spring-oauth2-tests-approval ....................... SKIPPED
23-Jun-2019 00:00:48 [INFO] spring-oauth2-tests-jdbc ........................... SKIPPED
23-Jun-2019 00:00:48 [INFO] spring-oauth2-tests-jpa ............................ SKIPPED
23-Jun-2019 00:00:48 [INFO] spring-oauth2-tests-jaxb ........................... SKIPPED
23-Jun-2019 00:00:48 [INFO] spring-oauth-tests-custom-grant .................... SKIPPED
23-Jun-2019 00:00:48 [INFO] spring-oauth2-tests-multi .......................... SKIPPED
23-Jun-2019 00:00:48 [INFO] spring-oauth2-tests-client ......................... SKIPPED
23-Jun-2019 00:00:48 [INFO] spring-oauth2-tests-resource ....................... SKIPPED
23-Jun-2019 00:00:48 [INFO] spring-oauth2-tests-custom-authentication .......... SKIPPED
23-Jun-2019 00:00:48 [INFO] spring-oauth2-tests-xml ............................ SKIPPED
23-Jun-2019 00:00:48 [INFO] spring-oauth2-tests-xml-common ..................... SKIPPED
23-Jun-2019 00:00:48 [INFO] spring-oauth2-tests-xml-vanilla .................... SKIPPED
23-Jun-2019 00:00:48 [INFO] spring-oauth2-tests-xml-mappings ................... SKIPPED
23-Jun-2019 00:00:48 [INFO] spring-oauth2-tests-xml-form ....................... SKIPPED
23-Jun-2019 00:00:48 [INFO] spring-oauth2-tests-xml-jwt ........................ SKIPPED
23-Jun-2019 00:00:48 [INFO] spring-oauth2-tests-xml-approval ................... SKIPPED
23-Jun-2019 00:00:48 [INFO] spring-oauth2-tests-xml-jdbc ....................... SKIPPED
23-Jun-2019 00:00:48 [INFO] spring-oauth2-tests-xml-client ..................... SKIPPED
23-Jun-2019 00:00:48 [INFO] OAuth for Spring Security - Integration Tests ...... SKIPPED
23-Jun-2019 00:00:48 [INFO] OAuth for Spring Security - Sparklr (OAuth 1 Provider Example) SKIPPED
23-Jun-2019 00:00:48 [INFO] OAuth for Spring Security - Tonr (OAuth 1 Consumer Example) SKIPPED
23-Jun-2019 00:00:48 [INFO] OAuth for Spring Security - Sparklr2 (OAuth 2 Provider Example) SKIPPED
23-Jun-2019 00:00:48 [INFO] OAuth for Spring Security - Tonr2 (OAuth 2 Client Example) SKIPPED
23-Jun-2019 00:00:48 [INFO] OAuth for Spring Security - Samples ................ SKIPPED
23-Jun-2019 00:00:48 [INFO] ------------------------------------------------------------------------
23-Jun-2019 00:00:48 [INFO] BUILD FAILURE
23-Jun-2019 00:00:48 [INFO] ------------------------------------------------------------------------
23-Jun-2019 00:00:48 [INFO] Total time: 45.033 s
23-Jun-2019 00:00:48 [INFO] Finished at: 2019-06-23T00:00:48+00:00
23-Jun-2019 00:00:48 [INFO] Final Memory: 75M/528M
23-Jun-2019 00:00:48 [INFO] ------------------------------------------------------------------------
23-Jun-2019 00:00:48 [ERROR] Failed to execute goal org.apache.maven.plugins:maven-surefire-plugin:2.12.4:test (default-test) on project spring-security-oauth2: Execution default-test of goal org.apache.maven.plugins:maven-surefire-plugin:2.12.4:test failed: The forked VM terminated without saying properly goodbye. VM crash or System.exit called ? -> [Help 1]
23-Jun-2019 00:00:48 [ERROR]
23-Jun-2019 00:00:48 [ERROR] To see the full stack trace of the errors, re-run Maven with the -e switch.
23-Jun-2019 00:00:48 [ERROR] Re-run Maven using the -X switch to enable full debug logging.
23-Jun-2019 00:00:48 [ERROR]
23-Jun-2019 00:00:48 [ERROR] For more information about the errors and possible solutions, please read the following articles:
23-Jun-2019 00:00:48 [ERROR] [Help 1] http://cwiki.apache.org/confluence/display/MAVEN/PluginExecutionException
23-Jun-2019 00:00:48 [ERROR]
23-Jun-2019 00:00:48 [ERROR] After correcting the problems, you can resume the build with the command
23-Jun-2019 00:00:48 [ERROR]   mvn <goals> -rf :spring-security-oauth2
23-Jun-2019 00:00:48 Exception in thread "main"
23-Jun-2019 00:00:48
23-Jun-2019 00:00:48 Failing task since return code of [/opt/jdk-7/bin/java -cp /opt/maven-3.3/boot/plexus-classworlds-2.5.2.jar -Dclassworlds.conf=/tmp/artifactoryM23076221074346312205conf -DbuildInfoConfig.propertiesFile=/tmp/buildInfo1348572814623999989.properties -Xmx1256m -Xms128m -Dmaven.home=/opt/maven-3.3 -Dmaven.multiModuleProjectDirectory=/opt/bamboo-home/xml-data/build-dir/SECOAUTH-NIGHTLY-JOB1 org.codehaus.plexus.classworlds.launcher.Launcher clean install -P bootstrap -Dartifactory.publish.password=********] was 1 while expected 0
23-Jun-2019 00:00:48 Finished task 'Artifactory Maven 3' with result: Failed
23-Jun-2019 00:00:48 Running post build plugin 'Docker Container Cleanup'
23-Jun-2019 00:00:48 Running post build plugin 'NCover Results Collector'
23-Jun-2019 00:00:48 Running post build plugin 'Artifactory Release Management Staging'
23-Jun-2019 00:00:48 Running post build plugin 'Artifactory Build Info Copier'
23-Jun-2019 00:00:48 Running post build plugin 'Artifactory Gradle Properties Info Copier'
23-Jun-2019 00:00:48 Running post build plugin 'Clover Results Collector'
23-Jun-2019 00:00:48 Running post build plugin 'npm Cache Cleanup'
23-Jun-2019 00:00:48 Running post build plugin 'Artifact Copier'
23-Jun-2019 00:00:48 Successfully removed working directory at '/opt/bamboo-home/xml-data/build-dir/SECOAUTH-NIGHTLY-JOB1'
23-Jun-2019 00:00:48 Finalising the build...
23-Jun-2019 00:00:48 Stopping timer.
23-Jun-2019 00:00:48 Build SECOAUTH-NIGHTLY-JOB1-1683 completed.
23-Jun-2019 00:00:57 Running on server: post build plugin 'NCover Results Collector'
23-Jun-2019 00:00:57 Running on server: post build plugin 'Build Hanging Detection Configuration'
23-Jun-2019 00:00:57 Running on server: post build plugin 'Clover Delta Calculator'
23-Jun-2019 00:00:57 Running on server: post build plugin 'Maven Dependencies Postprocessor'
23-Jun-2019 00:00:57 All post build plugins have finished
23-Jun-2019 00:00:57 Generating build results summary...
23-Jun-2019 00:00:57 Saving build results to disk...
23-Jun-2019 00:00:57 Logging substituted variables...
23-Jun-2019 00:00:57 Indexing build results...
23-Jun-2019 00:00:57 Finished building SECOAUTH-NIGHTLY-JOB1-1683.