Build: #1692 failed

Job: Default Job failed

Stages & jobs

  1. Default Stage

Build log

The build generated 637 lines of output. Download or view full build log

02-Jul-2019 00:00:13 Build Spring Security OAuth - 2.1.x - Default Job #1692 (SECOAUTH-NIGHTLY-JOB1-1692) started building on agent bamboo-16.af.pivotal.io
02-Jul-2019 00:00:13 Remote agent on host bamboo-16.af.pivotal.io
02-Jul-2019 00:00:16 Build working directory is /opt/bamboo-home/xml-data/build-dir/SECOAUTH-NIGHTLY-JOB1
02-Jul-2019 00:00:16 Executing build Spring Security OAuth - 2.1.x - Default Job #1692 (SECOAUTH-NIGHTLY-JOB1-1692)
02-Jul-2019 00:00:16 Starting task 'Checkout Default Repository' of type 'com.atlassian.bamboo.plugins.vcs:task.vcs.checkout'
02-Jul-2019 00:00:16 Build always requires a clean checkout
02-Jul-2019 00:00:16 Cleaning build directory '/opt/bamboo-home/xml-data/build-dir/SECOAUTH-NIGHTLY-JOB1'
02-Jul-2019 00:00:16 Checking out into /opt/bamboo-home/xml-data/build-dir/SECOAUTH-NIGHTLY-JOB1
02-Jul-2019 00:00:16 Updating source code to revision: 3d37444a991104dd7f23edb2812e9f57620a1395
02-Jul-2019 00:00:16 Creating local git repository in '/opt/bamboo-home/xml-data/build-dir/SECOAUTH-NIGHTLY-JOB1/.git'.
02-Jul-2019 00:00:16 Initialized empty Git repository in /opt/bamboo-home/xml-data/build-dir/SECOAUTH-NIGHTLY-JOB1/.git/
02-Jul-2019 00:00:16 Fetching 'refs/heads/master' from 'git://github.com/SpringSource/spring-security-oauth.git'. Will try to do a shallow fetch.
02-Jul-2019 00:00:19 From git://github.com/SpringSource/spring-security-oauth
02-Jul-2019 00:00:19 * [new branch]      master     -> master
02-Jul-2019 00:00:19 Checking out revision 3d37444a991104dd7f23edb2812e9f57620a1395.
02-Jul-2019 00:00:19 Already on 'master'
02-Jul-2019 00:00:19 Updated source code to revision: 3d37444a991104dd7f23edb2812e9f57620a1395
02-Jul-2019 00:00:19 Finished task 'Checkout Default Repository' with result: Success
02-Jul-2019 00:00:19 Running pre-build action: Artifactory Release Staging
02-Jul-2019 00:00:19 Running pre-build action: VCS Version Collector
02-Jul-2019 00:00:19 Skipping execution of task 'Build' as it is disabled
02-Jul-2019 00:00:19 Starting task 'Artifactory Maven 3' of type 'org.jfrog.bamboo.bamboo-artifactory-plugin:maven3Task'
02-Jul-2019 00:00:19 Bamboo Artifactory Plugin version: 2.6.3
02-Jul-2019 00:00:19
Beginning to execute external process for build 'Spring Security OAuth - 2.1.x - Default Job #1692 (SECOAUTH-NIGHTLY-JOB1-1692)'
... running command line:
/opt/jdk-7/bin/java -cp /opt/maven-3.3/boot/plexus-classworlds-2.5.2.jar -Dclassworlds.conf=/tmp/artifactoryM27803094717186021668conf -DbuildInfoConfig.propertiesFile=/tmp/buildInfo6477550229245482484.properties -Xmx1256m -Xms128m -Dmaven.home=/opt/maven-3.3 -Dmaven.multiModuleProjectDirectory=/opt/bamboo-home/xml-data/build-dir/SECOAUTH-NIGHTLY-JOB1 org.codehaus.plexus.classworlds.launcher.Launcher clean install -P bootstrap -Dartifactory.publish.password=********
... in: /opt/bamboo-home/xml-data/build-dir/SECOAUTH-NIGHTLY-JOB1
... using extra environment variables:
bamboo_planRepository_1_branch=master
bamboo_repository_94273667_previous_revision_number=3d37444a991104dd7f23edb2812e9f57620a1395
bamboo_********_username_password=********
bamboo_signing_store_password=********
bamboo_capability_system_builder_ant_Ant_1_9=/opt/ant-1.9
bamboo_capability_system_builder_ant_Ant_1_8=/opt/ant-1.8
bamboo_planRepository_1_branchDisplayName=master
bamboo_artifactory_override_resolve_repo=libs-milestone
bamboo_capability_system_builder_node_Node_js_10_16=/opt/node-10.16/bin/node
bamboo_repository_revision_number=3d37444a991104dd7f23edb2812e9f57620a1395
bamboo_RIAK_BIN=/usr/sbin/riak
bamboo_repository_94273667_revision_number=3d37444a991104dd7f23edb2812e9f57620a1395
WRAPPER_BITS=32
bamboo_buildKey=SECOAUTH-NIGHTLY-JOB1
bamboo_repository_94273667_git_branch=master
bamboo_bintray_password=********
bamboo_sonar_token_password=********
PWD=/opt/bamboo-home/bin
bamboo_shortJobName=Default Job
bamboo_artifactory_override_resolver_password=********
bamboo_sonatype_token=RSJChaox
bamboo_capability_system_builder_gradle___gradlew=./gradlew
bamboo_buildResultsUrl=https://build.spring.io/browse/SECOAUTH-NIGHTLY-JOB1-1692
bamboo_capability_system_builder_mvn3_Maven_3_3=/opt/maven-3.3
bamboo_capability_system_builder_mvn3_Maven_3_2=/opt/maven-3.2
bamboo_capability_system_builder_mvn3_Maven_3_1=/opt/maven-3.1
bamboo_planRepository_repositoryUrl=git://github.com/SpringSource/spring-security-oauth.git
bamboo_capability_system_builder_mvn3_Maven_3_6=/opt/maven-3.6
bamboo_agentId=286195719
bamboo_capability_system_builder_mvn3_Maven_3_5=/opt/maven-3.5
bamboo_capability_system_builder_mvn3_Maven_3_0=/opt/maven-3.0
bamboo_planRepository_revision=3d37444a991104dd7f23edb2812e9f57620a1395
bamboo_planRepository_previousRevision=3d37444a991104dd7f23edb2812e9f57620a1395
bamboo_capability_remote_build=true
bamboo_repository_branch_name=master
bamboo_sonatype_token_password=********
bamboo_sonatype_user=springsource
SHLVL=1
bamboo_org_jfrog_bamboo_buildInfo_serverUrl=https://repo.spring.io
bamboo_scdf_acceptance_tests_password=********
bamboo_repository_94273667_branch_name=master
WRAPPER_OS=linux
TERM=linux
XDG_SESSION_ID=c1
bamboo_planRepository_branch=master
bamboo_org_jfrog_bamboo_release_activated=false
bamboo_planRepository_1_type=gitv2
bamboo_planRepository_branchName=master
bamboo_capability_system_jdk_JDK_12=/opt/jdk-12
WRAPPER_FILE_SEPARATOR=/
_=/opt/bamboo-home/bin/bamboo-agent.sh
bamboo_capability_system_builder_ant_Ant_1_10=/opt/ant-1.10
bamboo_repository_94273667_name=Plan Repository
WRAPPER_PATH_SEPARATOR=:
bamboo_sonar_password=********
bamboo_hg_cache_directory=/opt/bamboo-home/xml-data/build-dir/_hg-repositories-cache
bamboo_planRepository_1_username=
bamboo_planRepository_type=gitv2
bamboo_git_cache_directory=/opt/bamboo-home/xml-data/build-dir/_git-repositories-cache
bamboo_artifactory_username=buildmaster
bamboo_tmp_directory=/opt/bamboo-home/temp
bamboo_planKey=SECOAUTH-NIGHTLY
bamboo_planRepository_username=
bamboo_JDK8_HOME=/opt/jdk-8
bamboo_repository_94273667_git_username=
bamboo_planRepository_1_branchName=master
bamboo_sonar_version=5.6.3
bamboo_sonar_jdbc_password=********
bamboo_bintray_api_key_password=********
XDG_DATA_DIRS=/usr/local/share:/usr/share:/var/lib/snapd/desktop
bamboo_capability_system_jdk_JDK_1_11=/opt/jdk-11
bamboo_resultsUrl=https://build.spring.io/browse/SECOAUTH-NIGHTLY-JOB1-1692
bamboo_capability_system_jdk_JDK_1_10=/opt/jdk-10
bamboo_build_working_directory=/opt/bamboo-home/xml-data/build-dir/SECOAUTH-NIGHTLY-JOB1
bamboo_planRepository_1_name=Plan Repository
bamboo_capability_system_os=ubuntu1804
bamboo_nexusPush_stagingProfile=buildmaster
bamboo_shortPlanName=2.1.x
MAIL=/var/mail/bamboo
bamboo_planRepository_name=Plan Repository
LOGNAME=bamboo
bamboo_buildNumber=1692
SHELL=/bin/bash
bamboo_planName=Spring Security OAuth - 2.1.x
bamboo_JDK7_HOME=/opt/jdk-7
bamboo_repository_94273667_git_repositoryUrl=git://github.com/SpringSource/spring-security-oauth.git
bamboo_shortPlanKey=NIGHTLY
OLDPWD=/opt/users/bamboo
bamboo_shortJobKey=JOB1
bamboo_artifactory_password=********
bamboo_buildTimeStamp=2019-07-02T00:00:12.325Z
bamboo_repository_previous_revision_number=3d37444a991104dd7f23edb2812e9f57620a1395
bamboo_sonar_username=buildmaster
bamboo_********_password=********
bamboo_repository_git_branch=master
bamboo_buildResultKey=SECOAUTH-NIGHTLY-JOB1-1692
bamboo_nexusPush_close=true
bamboo_artifactory_override_resolver_username=buildmaster
bamboo_buildPlanName=Spring Security OAuth - 2.1.x - Default Job
bamboo_planRepository_1_revision=3d37444a991104dd7f23edb2812e9f57620a1395
bamboo_repository_name=Plan Repository
bamboo_signing_key_password=********
bamboo_capability_system_builder_groovy_Groovy_2_5=/opt/groovy-2.5
LANG=en_US.UTF-8
bamboo_buildFailed=false
bamboo_capability_system_docker_executable=/usr/bin/docker
DISPLAY=localhost:1.0
bamboo_capability_system_jdk_OpenJDK_7=/opt/jdk-7
bamboo_capability_system_builder_groovy_Groovy_2_4=/opt/groovy-2.4
bamboo_artifactory_override_deployer_username=buildmaster
bamboo_capability_system_builder_command_Bash=/bin/bash
bamboo_artifactory_password_mask_a=********
bamboo_agentWorkingDirectory=/opt/bamboo-home/xml-data/build-dir
bamboo_capability_system_git_executable=/usr/bin/git
bamboo_repository_git_username=
bamboo_planRepository_1_previousRevision=3d37444a991104dd7f23edb2812e9f57620a1395
bamboo_capability_os_family=unix
bamboo_planRepository_branchDisplayName=master
bamboo_capability_system_builder_maven_Artifactory_Maven_3_6=/opt/maven-3.6
bamboo_capability_system_builder_maven_Artifactory_Maven_3_5=/opt/maven-3.5
GIT_SSL_NO_VERIFY=true
bamboo_capability_system_builder_maven_Artifactory_Maven_3_3=/opt/maven-3.3
bamboo_capability_system_builder_maven_Artifactory_Maven_3_2=/opt/maven-3.2
bamboo_s3_properties=/home/bamboo/tools/s3.properties
bamboo_capability_system_builder_maven_Artifactory_Maven_3_1=/opt/maven-3.1
bamboo_artifactory_override_deploy_repo=libs-snapshot-local
bamboo_capability_system_builder_maven_Artifactory_Maven_3_0=/opt/maven-3.0
bamboo_plan_storageTag=SECOAUTH-NIGHTLY
bamboo_bintray_username_password=********
USER=bamboo
bamboo_repository_git_repositoryUrl=git://github.com/SpringSource/spring-security-oauth.git
bamboo_working_directory=/opt/bamboo-home/xml-data/build-dir/SECOAUTH-NIGHTLY-JOB1
bamboo_org_jfrog_bamboo_buildInfo_activated=true
bamboo_planRepository_1_repositoryUrl=git://github.com/SpringSource/spring-security-oauth.git
bamboo_capability_system_jdk_JDK_1_8=/opt/jdk-8
bamboo_artifactory_override_deployer_password=********
bamboo_capability_system_jdk_JDK_1_9=/opt/jdk-9
WRAPPER_ARCH=x86
bamboo_capability_system_jdk_JDK_1_6=/opt/jdk-6
bamboo_sonatype_password=********
bamboo_capability_system_jdk_JDK_1_7=/opt/jdk-7
bamboo_sonar_ip=10.194.6.9
XDG_RUNTIME_DIR=/run/user/1002
HOME=/home/bamboo
PATH=/bin:/home/bamboo/bin:/usr/local/sbin:/usr/local/bin:/usr/sbin:/usr/bin:/sbin:/bin:/usr/games:/usr/local/games:/snap/bin:/home/bamboo/bin:/usr/local/bin:/bin:/home/bamboo/bin:/usr/local/sbin:/usr/local/bin:/usr/sbin:/usr/bin:/sbin:/bin:/usr/games:/usr/local/games:/snap/bin:/home/bamboo/bin:/usr/local/bin
02-Jul-2019 00:00:21 [INFO] Scanning for projects...
02-Jul-2019 00:00:21 Downloading: https://repo.spring.io/libs-snapshot-local/org/springframework/boot/spring-boot-starter-parent/1.5.1.RELEASE/spring-boot-starter-parent-1.5.1.RELEASE.pom
02-Jul-2019 00:00:21
02-Jul-2019 00:00:21 Downloading: https://repo.spring.io/libs-milestone-local/org/springframework/boot/spring-boot-starter-parent/1.5.1.RELEASE/spring-boot-starter-parent-1.5.1.RELEASE.pom
02-Jul-2019 00:00:21
02-Jul-2019 00:00:21 Downloading: https://repo.spring.io/release/org/springframework/boot/spring-boot-starter-parent/1.5.1.RELEASE/spring-boot-starter-parent-1.5.1.RELEASE.pom
02-Jul-2019 00:00:21 1/8 KB   
02-Jul-2019 00:00:21 3/8 KB   
02-Jul-2019 00:00:21 4/8 KB   
02-Jul-2019 00:00:21 5/8 KB   
02-Jul-2019 00:00:21 7/8 KB   
02-Jul-2019 00:00:21 8/8 KB   
02-Jul-2019 00:00:21          
02-Jul-2019 00:00:21 Downloaded: https://repo.spring.io/release/org/springframework/boot/spring-boot-starter-parent/1.5.1.RELEASE/spring-boot-starter-parent-1.5.1.RELEASE.pom (8 KB at 37.2 KB/sec)
02-Jul-2019 00:00:22 Downloading: https://repo.spring.io/libs-snapshot-local/org/springframework/boot/spring-boot-dependencies/1.5.1.RELEASE/spring-boot-dependencies-1.5.1.RELEASE.pom
02-Jul-2019 00:00:22          
02-Jul-2019 00:00:22 Downloading: https://repo.spring.io/libs-milestone-local/org/springframework/boot/spring-boot-dependencies/1.5.1.RELEASE/spring-boot-dependencies-1.5.1.RELEASE.pom
02-Jul-2019 00:00:22          
02-Jul-2019 00:00:22 Downloading: https://repo.spring.io/release/org/springframework/boot/spring-boot-dependencies/1.5.1.RELEASE/spring-boot-dependencies-1.5.1.RELEASE.pom
02-Jul-2019 00:00:22 1/88 KB   
02-Jul-2019 00:00:22 1/88 KB   
02-Jul-2019 00:00:22 3/88 KB   
02-Jul-2019 00:00:22 4/88 KB   
02-Jul-2019 00:00:22 5/88 KB   
02-Jul-2019 00:00:22 7/88 KB   
02-Jul-2019 00:00:22 8/88 KB   
02-Jul-2019 00:00:22 9/88 KB   
02-Jul-2019 00:00:22 11/88 KB   
02-Jul-2019 00:00:22 12/88 KB   
02-Jul-2019 00:00:22 13/88 KB   
02-Jul-2019 00:00:22 14/88 KB   
02-Jul-2019 00:00:22 15/88 KB   
02-Jul-2019 00:00:22 16/88 KB   
02-Jul-2019 00:00:22 18/88 KB   
02-Jul-2019 00:00:22 19/88 KB   
02-Jul-2019 00:00:22 20/88 KB   
02-Jul-2019 00:00:22 22/88 KB   
02-Jul-2019 00:00:22 23/88 KB   
02-Jul-2019 00:00:22 24/88 KB   
02-Jul-2019 00:00:22 26/88 KB   
02-Jul-2019 00:00:22 27/88 KB   
02-Jul-2019 00:00:22 28/88 KB   
02-Jul-2019 00:00:22 30/88 KB   
02-Jul-2019 00:00:22 31/88 KB   
02-Jul-2019 00:00:22 32/88 KB   
02-Jul-2019 00:00:22 34/88 KB   
02-Jul-2019 00:00:22 35/88 KB   
02-Jul-2019 00:00:22 36/88 KB   
02-Jul-2019 00:00:22 38/88 KB   
02-Jul-2019 00:00:22 39/88 KB   
02-Jul-2019 00:00:22 40/88 KB   
02-Jul-2019 00:00:22 41/88 KB   
02-Jul-2019 00:00:22 43/88 KB   
02-Jul-2019 00:00:22 44/88 KB   
02-Jul-2019 00:00:22 45/88 KB   
02-Jul-2019 00:00:22 47/88 KB   
02-Jul-2019 00:00:22 48/88 KB   
02-Jul-2019 00:00:22 49/88 KB   
02-Jul-2019 00:00:22 51/88 KB   
02-Jul-2019 00:00:22 52/88 KB   
02-Jul-2019 00:00:22 53/88 KB   
02-Jul-2019 00:00:22 55/88 KB   
02-Jul-2019 00:00:22 56/88 KB   
02-Jul-2019 00:00:22 57/88 KB   
02-Jul-2019 00:00:22 59/88 KB   
02-Jul-2019 00:00:22 60/88 KB   
02-Jul-2019 00:00:22 61/88 KB   
02-Jul-2019 00:00:22 63/88 KB   
02-Jul-2019 00:00:22 63/88 KB   
02-Jul-2019 00:00:22 64/88 KB   
02-Jul-2019 00:00:22 65/88 KB   
02-Jul-2019 00:00:22 67/88 KB   
02-Jul-2019 00:00:22 68/88 KB   
02-Jul-2019 00:00:22 69/88 KB   
02-Jul-2019 00:00:22 71/88 KB   
02-Jul-2019 00:00:22 72/88 KB   
02-Jul-2019 00:00:22 73/88 KB   
02-Jul-2019 00:00:22 75/88 KB   
02-Jul-2019 00:00:22 76/88 KB   
02-Jul-2019 00:00:22 77/88 KB   
02-Jul-2019 00:00:22 79/88 KB   
02-Jul-2019 00:00:22 80/88 KB   
02-Jul-2019 00:00:22 81/88 KB   
02-Jul-2019 00:00:22 83/88 KB   
02-Jul-2019 00:00:22 84/88 KB   
02-Jul-2019 00:00:22 85/88 KB   
02-Jul-2019 00:00:22 87/88 KB   
02-Jul-2019 00:00:22 88/88 KB   
02-Jul-2019 00:00:22            
02-Jul-2019 00:00:22 Downloaded: https://repo.spring.io/release/org/springframework/boot/spring-boot-dependencies/1.5.1.RELEASE/spring-boot-dependencies-1.5.1.RELEASE.pom (88 KB at 332.5 KB/sec)
02-Jul-2019 00:00:23 [INFO] Initializing Artifactory Build-Info Recording
02-Jul-2019 00:00:23 [INFO] ------------------------------------------------------------------------
02-Jul-2019 00:00:23 [INFO] Reactor Build Order:
02-Jul-2019 00:00:23 [INFO]
02-Jul-2019 00:00:23 [INFO] OAuth for Spring Security
02-Jul-2019 00:00:23 [INFO] OAuth 1(a) for Spring Security
02-Jul-2019 00:00:23 [INFO] OAuth2 for Spring Security
02-Jul-2019 00:00:23 [INFO] spring-oauth2-tests
02-Jul-2019 00:00:23 [INFO] spring-oauth2-tests-common
02-Jul-2019 00:00:23 [INFO] spring-oauth2-tests-vanilla
02-Jul-2019 00:00:23 [INFO] spring-oauth2-tests-mappings
02-Jul-2019 00:00:23 [INFO] spring-oauth2-tests-form
02-Jul-2019 00:00:23 [INFO] spring-oauth2-tests-jwt
02-Jul-2019 00:00:23 [INFO] spring-oauth2-tests-approval
02-Jul-2019 00:00:23 [INFO] spring-oauth2-tests-jdbc
02-Jul-2019 00:00:23 [INFO] spring-oauth2-tests-jpa
02-Jul-2019 00:00:23 [INFO] spring-oauth2-tests-jaxb
02-Jul-2019 00:00:23 [INFO] spring-oauth-tests-custom-grant
02-Jul-2019 00:00:23 [INFO] spring-oauth2-tests-multi
02-Jul-2019 00:00:23 [INFO] spring-oauth2-tests-client
02-Jul-2019 00:00:23 [INFO] spring-oauth2-tests-resource
02-Jul-2019 00:00:23 [INFO] spring-oauth2-tests-custom-authentication
02-Jul-2019 00:00:23 [INFO] spring-oauth2-tests-xml
02-Jul-2019 00:00:23 [INFO] spring-oauth2-tests-xml-common
02-Jul-2019 00:00:23 [INFO] spring-oauth2-tests-xml-vanilla
02-Jul-2019 00:00:23 [INFO] spring-oauth2-tests-xml-mappings
02-Jul-2019 00:00:23 [INFO] spring-oauth2-tests-xml-form
02-Jul-2019 00:00:23 [INFO] spring-oauth2-tests-xml-jwt
02-Jul-2019 00:00:23 [INFO] spring-oauth2-tests-xml-approval
02-Jul-2019 00:00:23 [INFO] spring-oauth2-tests-xml-jdbc
02-Jul-2019 00:00:23 [INFO] spring-oauth2-tests-xml-client
02-Jul-2019 00:00:23 [INFO] OAuth for Spring Security - Integration Tests
02-Jul-2019 00:00:23 [INFO] OAuth for Spring Security - Sparklr (OAuth 1 Provider Example)
02-Jul-2019 00:00:23 [INFO] OAuth for Spring Security - Tonr (OAuth 1 Consumer Example)
02-Jul-2019 00:00:23 [INFO] OAuth for Spring Security - Sparklr2 (OAuth 2 Provider Example)
02-Jul-2019 00:00:23 [INFO] OAuth for Spring Security - Tonr2 (OAuth 2 Client Example)
02-Jul-2019 00:00:23 [INFO] OAuth for Spring Security - Samples
02-Jul-2019 00:00:23 [INFO]                                                                         
02-Jul-2019 00:00:23 [INFO] ------------------------------------------------------------------------
02-Jul-2019 00:00:23 [INFO] Building OAuth for Spring Security 2.3.7.BUILD-SNAPSHOT
02-Jul-2019 00:00:23 [INFO] ------------------------------------------------------------------------
02-Jul-2019 00:00:24 [INFO]
02-Jul-2019 00:00:24 [INFO] --- maven-clean-plugin:2.5:clean (default-clean) @ spring-security-oauth-parent ---
02-Jul-2019 00:00:24 [INFO]
02-Jul-2019 00:00:24 [INFO] >>> maven-source-plugin:2.1.2:jar (attach-sources) > generate-sources @ spring-security-oauth-parent >>>
02-Jul-2019 00:00:24 [INFO]
02-Jul-2019 00:00:24 [INFO] <<< maven-source-plugin:2.1.2:jar (attach-sources) < generate-sources @ spring-security-oauth-parent <<<
02-Jul-2019 00:00:24 [INFO]
02-Jul-2019 00:00:24 [INFO] --- maven-source-plugin:2.1.2:jar (attach-sources) @ spring-security-oauth-parent ---
02-Jul-2019 00:00:24 [INFO]
02-Jul-2019 00:00:24 [INFO] --- maven-javadoc-plugin:2.9.1:jar (javadoc) @ spring-security-oauth-parent ---
02-Jul-2019 00:00:24 [INFO] Not executing Javadoc as the project is not a Java classpath-capable package
02-Jul-2019 00:00:24 [INFO]
02-Jul-2019 00:00:24 [INFO] --- maven-install-plugin:2.4:install (default-install) @ spring-security-oauth-parent ---
02-Jul-2019 00:00:24 [INFO] Installing /opt/bamboo-home/xml-data/build-dir/SECOAUTH-NIGHTLY-JOB1/pom.xml to /home/bamboo/.m2/repository/org/springframework/security/oauth/spring-security-oauth-parent/2.3.7.BUILD-SNAPSHOT/spring-security-oauth-parent-2.3.7.BUILD-SNAPSHOT.pom
02-Jul-2019 00:00:24 [INFO]                                                                         
02-Jul-2019 00:00:24 [INFO] ------------------------------------------------------------------------
02-Jul-2019 00:00:24 [INFO] Building OAuth 1(a) for Spring Security 2.3.7.BUILD-SNAPSHOT
02-Jul-2019 00:00:24 [INFO] ------------------------------------------------------------------------
02-Jul-2019 00:00:24 [INFO]
02-Jul-2019 00:00:24 [INFO] --- maven-clean-plugin:2.5:clean (default-clean) @ spring-security-oauth ---
02-Jul-2019 00:00:24 [INFO]
02-Jul-2019 00:00:24 [INFO] --- maven-resources-plugin:2.6:resources (default-resources) @ spring-security-oauth ---
02-Jul-2019 00:00:25 [INFO] Using 'UTF-8' encoding to copy filtered resources.
02-Jul-2019 00:00:25 [INFO] Copying 3 resources
02-Jul-2019 00:00:25 [INFO]
02-Jul-2019 00:00:25 [INFO] --- maven-compiler-plugin:2.3.2:compile (default-compile) @ spring-security-oauth ---
02-Jul-2019 00:00:25 [INFO] Compiling 108 source files to /opt/bamboo-home/xml-data/build-dir/SECOAUTH-NIGHTLY-JOB1/spring-security-oauth/target/classes
02-Jul-2019 00:00:26 [WARNING] /opt/bamboo-home/xml-data/build-dir/SECOAUTH-NIGHTLY-JOB1/spring-security-oauth/src/main/java/org/springframework/security/oauth/consumer/net/OAuthOverHttpsURLStreamHandler.java:[36,78] Handler is internal proprietary API and may be removed in a future release
02-Jul-2019 00:00:26 [WARNING] /opt/bamboo-home/xml-data/build-dir/SECOAUTH-NIGHTLY-JOB1/spring-security-oauth/src/main/java/org/springframework/security/oauth/consumer/net/OAuthOverHttpURLStreamHandler.java:[36,76] Handler is internal proprietary API and may be removed in a future release
02-Jul-2019 00:00:26 [INFO]
02-Jul-2019 00:00:26 [INFO] --- maven-resources-plugin:2.6:testResources (default-testResources) @ spring-security-oauth ---
02-Jul-2019 00:00:26 [INFO] Using 'UTF-8' encoding to copy filtered resources.
02-Jul-2019 00:00:26 [INFO] Copying 8 resources
02-Jul-2019 00:00:26 [INFO]
02-Jul-2019 00:00:26 [INFO] --- maven-compiler-plugin:2.3.2:testCompile (default-testCompile) @ spring-security-oauth ---
02-Jul-2019 00:00:26 [INFO] Compiling 22 source files to /opt/bamboo-home/xml-data/build-dir/SECOAUTH-NIGHTLY-JOB1/spring-security-oauth/target/test-classes
02-Jul-2019 00:00:27 [WARNING] /opt/bamboo-home/xml-data/build-dir/SECOAUTH-NIGHTLY-JOB1/spring-security-oauth/src/test/java/org/springframework/security/oauth/consumer/client/CoreOAuthConsumerSupportTests.java:[65,32] Handler is internal proprietary API and may be removed in a future release
02-Jul-2019 00:00:27 [WARNING] /opt/bamboo-home/xml-data/build-dir/SECOAUTH-NIGHTLY-JOB1/spring-security-oauth/src/test/java/org/springframework/security/oauth/consumer/client/CoreOAuthConsumerSupportTests.java:[483,54] Handler is internal proprietary API and may be removed in a future release
02-Jul-2019 00:00:27 [INFO]
02-Jul-2019 00:00:27 [INFO] --- maven-surefire-plugin:2.12.4:test (default-test) @ spring-security-oauth ---
02-Jul-2019 00:00:27 [INFO] Surefire report directory: /opt/bamboo-home/xml-data/build-dir/SECOAUTH-NIGHTLY-JOB1/spring-security-oauth/target/surefire-reports
02-Jul-2019 00:00:27
02-Jul-2019 00:00:27 -------------------------------------------------------
02-Jul-2019 00:00:27 T E S T S
02-Jul-2019 00:00:27 -------------------------------------------------------
02-Jul-2019 00:00:27 Running org.springframework.security.oauth.config.FilterChainInitializationTests
02-Jul-2019 00:00:28 Tests run: 1, Failures: 0, Errors: 0, Skipped: 0, Time elapsed: 0.987 sec
02-Jul-2019 00:00:28 Running org.springframework.security.oauth.config.AuthorizationServerBeanDefinitionParserTests
02-Jul-2019 00:00:28 Tests run: 2, Failures: 0, Errors: 0, Skipped: 0, Time elapsed: 0.335 sec
02-Jul-2019 00:00:28 Running org.springframework.security.oauth.config.ConsumerServiceBeanDefinitionParserTests
02-Jul-2019 00:00:29 Tests run: 2, Failures: 0, Errors: 0, Skipped: 0, Time elapsed: 0.257 sec
02-Jul-2019 00:00:29 Running org.springframework.security.oauth.provider.nonce.InMemoryNonceServicesTests
02-Jul-2019 00:00:29 Tests run: 5, Failures: 0, Errors: 0, Skipped: 0, Time elapsed: 0.003 sec
02-Jul-2019 00:00:29 Running org.springframework.security.oauth.provider.filter.ProtectedResourceProcessingFilterTests
02-Jul-2019 00:00:29 Tests run: 1, Failures: 0, Errors: 0, Skipped: 0, Time elapsed: 0.143 sec
02-Jul-2019 00:00:29 Running org.springframework.security.oauth.provider.filter.OAuthProcessingFilterTests
02-Jul-2019 00:00:29 Tests run: 3, Failures: 0, Errors: 0, Skipped: 0, Time elapsed: 0.047 sec
02-Jul-2019 00:00:29 Running org.springframework.security.oauth.provider.filter.OAuthUserAuthorizationProcessingFilterTests
02-Jul-2019 00:00:29 Tests run: 1, Failures: 0, Errors: 0, Skipped: 0, Time elapsed: 0.005 sec
02-Jul-2019 00:00:29 Running org.springframework.security.oauth.provider.filter.UserAuthorizationSuccessfulAuthenticationHandlerTests
02-Jul-2019 00:00:29 Tests run: 1, Failures: 0, Errors: 0, Skipped: 0, Time elapsed: 0.004 sec
02-Jul-2019 00:00:29 Running org.springframework.security.oauth.provider.filter.AccessTokenProcessingFilterTests
02-Jul-2019 00:00:29 Tests run: 2, Failures: 0, Errors: 0, Skipped: 0, Time elapsed: 0.002 sec
02-Jul-2019 00:00:29 Running org.springframework.security.oauth.provider.filter.UnauthenticatedRequestTokenProcessingFilterTests
02-Jul-2019 00:00:29 Tests run: 2, Failures: 0, Errors: 0, Skipped: 0, Time elapsed: 0.004 sec
02-Jul-2019 00:00:29 Running org.springframework.security.oauth.provider.CoreOAuthProviderSupportTests
02-Jul-2019 00:00:29 Tests run: 2, Failures: 0, Errors: 0, Skipped: 0, Time elapsed: 0.003 sec
02-Jul-2019 00:00:29 Running org.springframework.security.oauth.common.signature.PlainTextSignatureMethodTests
02-Jul-2019 00:00:29 Tests run: 1, Failures: 0, Errors: 0, Skipped: 0, Time elapsed: 0 sec
02-Jul-2019 00:00:29 Running org.springframework.security.oauth.common.signature.CoreOAuthSignatureMethodFactoryTests
02-Jul-2019 00:00:29 Tests run: 1, Failures: 0, Errors: 0, Skipped: 0, Time elapsed: 0.205 sec
02-Jul-2019 00:00:29 Running org.springframework.security.oauth.common.signature.RSA_SHA1SignatureMethodTests
02-Jul-2019 00:00:29 Tests run: 2, Failures: 0, Errors: 0, Skipped: 0, Time elapsed: 0.086 sec
02-Jul-2019 00:00:29 Running org.springframework.security.oauth.common.signature.HMAC_SHA1SignatureMethodTests
02-Jul-2019 00:00:29 Tests run: 3, Failures: 0, Errors: 0, Skipped: 0, Time elapsed: 0.029 sec
02-Jul-2019 00:00:29 Running org.springframework.security.oauth.common.OAuthCodecTests
02-Jul-2019 00:00:29 Tests run: 1, Failures: 0, Errors: 0, Skipped: 0, Time elapsed: 0.001 sec
02-Jul-2019 00:00:29 Running org.springframework.security.oauth.consumer.client.CoreOAuthConsumerSupportTests
02-Jul-2019 00:00:29 Tests run: 10, Failures: 0, Errors: 0, Skipped: 0, Time elapsed: 0.021 sec
02-Jul-2019 00:00:29 Running org.springframework.security.oauth.consumer.client.OAuthRestTemplateTests
02-Jul-2019 00:00:29 Tests run: 2, Failures: 0, Errors: 0, Skipped: 0, Time elapsed: 0.122 sec
02-Jul-2019 00:00:29 Running org.springframework.security.oauth.consumer.GoogleOAuthTests
02-Jul-2019 00:00:29 Tests run: 1, Failures: 0, Errors: 0, Skipped: 0, Time elapsed: 0.001 sec
02-Jul-2019 00:00:29 Running org.springframework.security.oauth.consumer.filter.OAuthConsumerContextFilterTests
02-Jul-2019 00:00:29 Tests run: 2, Failures: 0, Errors: 0, Skipped: 0, Time elapsed: 0.019 sec
02-Jul-2019 00:00:29 Running org.springframework.security.oauth.consumer.rememberme.HttpSessionOAuthRememberMeServicesTests
02-Jul-2019 00:00:29 Tests run: 4, Failures: 0, Errors: 0, Skipped: 0, Time elapsed: 0.01 sec
02-Jul-2019 00:00:29 Running net.oauth.signature.GoogleCodeCompatibilityTests
02-Jul-2019 00:00:29 Tests run: 2, Failures: 0, Errors: 0, Skipped: 0, Time elapsed: 0.014 sec
02-Jul-2019 00:00:29
02-Jul-2019 00:00:29 Results :
02-Jul-2019 00:00:29
02-Jul-2019 00:00:29 Tests run: 51, Failures: 0, Errors: 0, Skipped: 0
02-Jul-2019 00:00:29
02-Jul-2019 00:00:30 [INFO]
02-Jul-2019 00:00:30 [INFO] --- maven-jar-plugin:2.4:jar (default-jar) @ spring-security-oauth ---
02-Jul-2019 00:00:30 [INFO] Building jar: /opt/bamboo-home/xml-data/build-dir/SECOAUTH-NIGHTLY-JOB1/spring-security-oauth/target/spring-security-oauth-2.3.7.BUILD-SNAPSHOT.jar
02-Jul-2019 00:00:30 [INFO]
02-Jul-2019 00:00:30 [INFO] >>> maven-source-plugin:2.1.2:jar (attach-sources) > generate-sources @ spring-security-oauth >>>
02-Jul-2019 00:00:30 [INFO]
02-Jul-2019 00:00:30 [INFO] <<< maven-source-plugin:2.1.2:jar (attach-sources) < generate-sources @ spring-security-oauth <<<
02-Jul-2019 00:00:30 [INFO]
02-Jul-2019 00:00:30 [INFO] --- maven-source-plugin:2.1.2:jar (attach-sources) @ spring-security-oauth ---
02-Jul-2019 00:00:30 [INFO] org already added, skipping
02-Jul-2019 00:00:30 [INFO] org/springframework already added, skipping
02-Jul-2019 00:00:30 [INFO] org/springframework/security already added, skipping
02-Jul-2019 00:00:30 [INFO] org/springframework/security/oauth already added, skipping
02-Jul-2019 00:00:30 [INFO] Building jar: /opt/bamboo-home/xml-data/build-dir/SECOAUTH-NIGHTLY-JOB1/spring-security-oauth/target/spring-security-oauth-2.3.7.BUILD-SNAPSHOT-sources.jar
02-Jul-2019 00:00:30 [INFO] org already added, skipping
02-Jul-2019 00:00:30 [INFO] org/springframework already added, skipping
02-Jul-2019 00:00:30 [INFO] org/springframework/security already added, skipping
02-Jul-2019 00:00:30 [INFO] org/springframework/security/oauth already added, skipping
02-Jul-2019 00:00:30 [INFO]
02-Jul-2019 00:00:30 [INFO] --- maven-javadoc-plugin:2.9.1:jar (javadoc) @ spring-security-oauth ---
02-Jul-2019 00:00:33 [INFO]
02-Jul-2019 00:00:33 2 warnings
02-Jul-2019 00:00:33 [WARNING] Javadoc Warnings
02-Jul-2019 00:00:33 [WARNING] /opt/bamboo-home/xml-data/build-dir/SECOAUTH-NIGHTLY-JOB1/spring-security-oauth/src/main/java/org/springframework/security/oauth/consumer/net/OAuthOverHttpURLStreamHandler.java:36: warning: Handler is internal proprietary API and may be removed in a future release
02-Jul-2019 00:00:33 [WARNING] public class OAuthOverHttpURLStreamHandler extends sun.net.www.protocol.http.Handler {
02-Jul-2019 00:00:33 [WARNING] ^
02-Jul-2019 00:00:33 [WARNING] /opt/bamboo-home/xml-data/build-dir/SECOAUTH-NIGHTLY-JOB1/spring-security-oauth/src/main/java/org/springframework/security/oauth/consumer/net/OAuthOverHttpsURLStreamHandler.java:36: warning: Handler is internal proprietary API and may be removed in a future release
02-Jul-2019 00:00:33 [WARNING] public class OAuthOverHttpsURLStreamHandler extends sun.net.www.protocol.https.Handler {
02-Jul-2019 00:00:33 [WARNING] ^
02-Jul-2019 00:00:33 [INFO] Building jar: /opt/bamboo-home/xml-data/build-dir/SECOAUTH-NIGHTLY-JOB1/spring-security-oauth/target/spring-security-oauth-2.3.7.BUILD-SNAPSHOT-javadoc.jar
02-Jul-2019 00:00:33 [INFO]
02-Jul-2019 00:00:33 [INFO] --- maven-install-plugin:2.4:install (default-install) @ spring-security-oauth ---
02-Jul-2019 00:00:33 [INFO] Installing /opt/bamboo-home/xml-data/build-dir/SECOAUTH-NIGHTLY-JOB1/spring-security-oauth/target/spring-security-oauth-2.3.7.BUILD-SNAPSHOT.jar to /home/bamboo/.m2/repository/org/springframework/security/oauth/spring-security-oauth/2.3.7.BUILD-SNAPSHOT/spring-security-oauth-2.3.7.BUILD-SNAPSHOT.jar
02-Jul-2019 00:00:33 [INFO] Installing /opt/bamboo-home/xml-data/build-dir/SECOAUTH-NIGHTLY-JOB1/spring-security-oauth/pom.xml to /home/bamboo/.m2/repository/org/springframework/security/oauth/spring-security-oauth/2.3.7.BUILD-SNAPSHOT/spring-security-oauth-2.3.7.BUILD-SNAPSHOT.pom
02-Jul-2019 00:00:33 [INFO] Installing /opt/bamboo-home/xml-data/build-dir/SECOAUTH-NIGHTLY-JOB1/spring-security-oauth/target/spring-security-oauth-2.3.7.BUILD-SNAPSHOT-sources.jar to /home/bamboo/.m2/repository/org/springframework/security/oauth/spring-security-oauth/2.3.7.BUILD-SNAPSHOT/spring-security-oauth-2.3.7.BUILD-SNAPSHOT-sources.jar
02-Jul-2019 00:00:33 [INFO] Installing /opt/bamboo-home/xml-data/build-dir/SECOAUTH-NIGHTLY-JOB1/spring-security-oauth/target/spring-security-oauth-2.3.7.BUILD-SNAPSHOT-javadoc.jar to /home/bamboo/.m2/repository/org/springframework/security/oauth/spring-security-oauth/2.3.7.BUILD-SNAPSHOT/spring-security-oauth-2.3.7.BUILD-SNAPSHOT-javadoc.jar
02-Jul-2019 00:00:33 [INFO]                                                                         
02-Jul-2019 00:00:33 [INFO] ------------------------------------------------------------------------
02-Jul-2019 00:00:33 [INFO] Building OAuth2 for Spring Security 2.3.7.BUILD-SNAPSHOT
02-Jul-2019 00:00:33 [INFO] ------------------------------------------------------------------------
02-Jul-2019 00:00:33 [INFO]
02-Jul-2019 00:00:33 [INFO] --- maven-clean-plugin:2.5:clean (default-clean) @ spring-security-oauth2 ---
02-Jul-2019 00:00:33 [INFO]
02-Jul-2019 00:00:33 [INFO] --- maven-resources-plugin:2.6:resources (default-resources) @ spring-security-oauth2 ---
02-Jul-2019 00:00:33 [INFO] Using 'UTF-8' encoding to copy filtered resources.
02-Jul-2019 00:00:33 [INFO] Copying 4 resources
02-Jul-2019 00:00:33 [INFO]
02-Jul-2019 00:00:33 [INFO] --- maven-compiler-plugin:2.3.2:compile (default-compile) @ spring-security-oauth2 ---
02-Jul-2019 00:00:33 [INFO] Compiling 249 source files to /opt/bamboo-home/xml-data/build-dir/SECOAUTH-NIGHTLY-JOB1/spring-security-oauth2/target/classes
02-Jul-2019 00:00:36 [INFO]
02-Jul-2019 00:00:36 [INFO] --- maven-resources-plugin:2.6:testResources (default-testResources) @ spring-security-oauth2 ---
02-Jul-2019 00:00:36 [INFO] Using 'UTF-8' encoding to copy filtered resources.
02-Jul-2019 00:00:36 [INFO] Copying 21 resources
02-Jul-2019 00:00:36 [INFO]
02-Jul-2019 00:00:36 [INFO] --- maven-compiler-plugin:2.3.2:testCompile (default-testCompile) @ spring-security-oauth2 ---
02-Jul-2019 00:00:36 [INFO] Compiling 120 source files to /opt/bamboo-home/xml-data/build-dir/SECOAUTH-NIGHTLY-JOB1/spring-security-oauth2/target/test-classes
02-Jul-2019 00:00:39 [INFO]
02-Jul-2019 00:00:39 [INFO] --- maven-surefire-plugin:2.12.4:test (default-test) @ spring-security-oauth2 ---
02-Jul-2019 00:00:39 [INFO] Surefire report directory: /opt/bamboo-home/xml-data/build-dir/SECOAUTH-NIGHTLY-JOB1/spring-security-oauth2/target/surefire-reports
02-Jul-2019 00:00:39
02-Jul-2019 00:00:39 -------------------------------------------------------
02-Jul-2019 00:00:39 T E S T S
02-Jul-2019 00:00:39 -------------------------------------------------------
02-Jul-2019 00:00:39 Running org.springframework.security.oauth2.config.annotation.TokenServicesMultipleBeansTests
02-Jul-2019 00:00:41 Tests run: 1, Failures: 0, Errors: 0, Skipped: 0, Time elapsed: 1.557 sec
02-Jul-2019 00:00:41 Running org.springframework.security.oauth2.config.annotation.Gh501EnableAuthorizationServerTests
02-Jul-2019 00:00:41 Tests run: 1, Failures: 0, Errors: 0, Skipped: 0, Time elapsed: 0.711 sec
02-Jul-2019 00:00:41 Running org.springframework.security.oauth2.config.annotation.ClientConfigurationTests
02-Jul-2019 00:00:42 Tests run: 1, Failures: 0, Errors: 0, Skipped: 0, Time elapsed: 0.247 sec
02-Jul-2019 00:00:42 Running org.springframework.security.oauth2.config.annotation.ResourceServerConfigurationTests
02-Jul-2019 00:00:42 [WARN] TokenEndpoint - Handling error: InvalidRequestException, Missing grant type
02-Jul-2019 00:00:43 [WARN] PageNotFound - No mapping found for HTTP request with URI [/] in DispatcherServlet with name ''
02-Jul-2019 00:00:43 [WARN] PageNotFound - No mapping found for HTTP request with URI [/] in DispatcherServlet with name ''
02-Jul-2019 00:00:43 [WARN] PageNotFound - No mapping found for HTTP request with URI [/] in DispatcherServlet with name ''
02-Jul-2019 00:00:43 [WARN] PageNotFound - No mapping found for HTTP request with URI [/] in DispatcherServlet with name ''
02-Jul-2019 00:00:43 [WARN] TokenEndpoint - Handling error: InvalidRequestException, Missing grant type
02-Jul-2019 00:00:43 Tests run: 9, Failures: 0, Errors: 0, Skipped: 0, Time elapsed: 1.654 sec
02-Jul-2019 00:00:43 Running org.springframework.security.oauth2.config.annotation.AuthorizationServerConfigurationTests
02-Jul-2019 00:00:43 [WARN] AnnotationConfigWebApplicationContext - Exception encountered during context initialization - cancelling refresh attempt: org.springframework.beans.factory.UnsatisfiedDependencyException: Error creating bean with name 'org.springframework.security.oauth2.config.annotation.web.configuration.AuthorizationServerEndpointsConfiguration': Unsatisfied dependency expressed through field 'configurers'; nested exception is org.springframework.beans.factory.NoSuchBeanDefinitionException: No qualifying bean of type 'java.util.List<org.springframework.security.oauth2.config.annotation.web.configuration.AuthorizationServerConfigurer>' available: expected at least 1 bean which qualifies as autowire candidate. Dependency annotations: {@org.springframework.beans.factory.annotation.Autowired(required=true)}
02-Jul-2019 00:00:44 [WARN] JwtAccessTokenConverter - Unable to create an RSA verifier from verifierKey (ignoreable if using MAC)
02-Jul-2019 00:00:45 [WARN] AnnotationConfigWebApplicationContext - Exception encountered during context initialization - cancelling refresh attempt: org.springframework.beans.factory.UnsatisfiedDependencyException: Error creating bean with name 'authorizationServerConfigurationTests.AuthorizationServerTypes': Unsatisfied dependency expressed through field 'tokenServices'; nested exception is org.springframework.beans.factory.BeanCreationException: Error creating bean with name 'org.springframework.security.oauth2.config.annotation.web.configuration.AuthorizationServerEndpointsConfiguration': Invocation of init method failed; nested exception is java.lang.AssertionError
02-Jul-2019 00:00:46 Tests run: 20, Failures: 0, Errors: 0, Skipped: 0, Time elapsed: 2.23 sec
02-Jul-2019 00:00:46 Running org.springframework.security.oauth2.config.annotation.Gh808EnableAuthorizationServerTests
02-Jul-2019 00:00:46 Tests run: 2, Failures: 0, Errors: 0, Skipped: 0, Time elapsed: 0.145 sec
02-Jul-2019 00:00:46 Running org.springframework.security.oauth2.config.xml.ResourceServerBeanDefinitionParserTests
02-Jul-2019 00:00:46 Tests run: 2, Failures: 0, Errors: 0, Skipped: 0, Time elapsed: 0.188 sec
02-Jul-2019 00:00:46 Running org.springframework.security.oauth2.config.xml.AuthorizationServerInvalidParserTests
02-Jul-2019 00:00:46 Tests run: 1, Failures: 0, Errors: 0, Skipped: 0, Time elapsed: 0.028 sec
02-Jul-2019 00:00:46 Running org.springframework.security.oauth2.config.xml.AuthorizationServerBeanDefinitionParserTests
02-Jul-2019 00:00:46 Tests run: 12, Failures: 0, Errors: 0, Skipped: 0, Time elapsed: 0.485 sec
02-Jul-2019 00:00:46 Running org.springframework.security.oauth2.config.xml.ClientDetailsServiceBeanDefinitionParserTests
02-Jul-2019 00:00:46 Tests run: 3, Failures: 0, Errors: 0, Skipped: 0, Time elapsed: 0.035 sec
02-Jul-2019 00:00:46 Running org.springframework.security.oauth2.config.xml.ResourceBeanDefinitionParserTests
02-Jul-2019 00:00:46 Tests run: 7, Failures: 0, Errors: 0, Skipped: 0, Time elapsed: 0.065 sec
02-Jul-2019 00:00:46 Running org.springframework.security.oauth2.config.xml.InvalidResourceBeanDefinitionParserTests
02-Jul-2019 00:00:47 Tests run: 5, Failures: 0, Errors: 0, Skipped: 0, Time elapsed: 0.057 sec
02-Jul-2019 00:00:47 Running org.springframework.security.oauth2.config.xml.AuthorizationServerCustomGrantParserTests
02-Jul-2019 00:00:47 Tests run: 1, Failures: 0, Errors: 0, Skipped: 0, Time elapsed: 0.022 sec
02-Jul-2019 00:00:47 Running org.springframework.security.oauth2.config.xml.AuthorizationServerClientCredentialsPasswordInvalidXmlTests
02-Jul-2019 00:00:47 Tests run: 2, Failures: 0, Errors: 0, Skipped: 0, Time elapsed: 0.382 sec
02-Jul-2019 00:00:47 Running org.springframework.security.oauth2.config.xml.AuthorizationServerClientCredentialsPasswordValidXmlTests
02-Jul-2019 00:00:47 Tests run: 2, Failures: 0, Errors: 0, Skipped: 0, Time elapsed: 0.234 sec
02-Jul-2019 00:00:47 Running org.springframework.security.oauth2.http.converter.jaxb.JaxbOAuth2ExceptionMessageConverterTests
02-Jul-2019 00:00:49 Tests run: 22, Failures: 0, Errors: 0, Skipped: 0, Time elapsed: 1.483 sec
02-Jul-2019 00:00:49 Running org.springframework.security.oauth2.http.converter.jaxb.JaxbOAuth2AccessTokenMessageConverterTests
02-Jul-2019 00:00:50 Tests run: 8, Failures: 0, Errors: 0, Skipped: 0, Time elapsed: 0.84 sec
02-Jul-2019 00:00:50 Running org.springframework.security.oauth2.client.http.OAuth2ErrorHandlerTests
02-Jul-2019 00:00:50 Tests run: 12, Failures: 0, Errors: 0, Skipped: 0, Time elapsed: 0.056 sec
02-Jul-2019 00:00:50 Running org.springframework.security.oauth2.client.DefaultOAuth2RequestAuthenticatorTests
02-Jul-2019 00:00:50 Tests run: 6, Failures: 0, Errors: 0, Skipped: 0, Time elapsed: 0.001 sec
02-Jul-2019 00:00:50 Running org.springframework.security.oauth2.client.token.grant.password.ResourceOwnerPasswordAccessTokenProviderTests
02-Jul-2019 00:00:50 Tests run: 3, Failures: 0, Errors: 0, Skipped: 0, Time elapsed: 0 sec
02-Jul-2019 00:00:50 Running org.springframework.security.oauth2.client.token.grant.implicit.ImplicitAccessTokenProviderTests
02-Jul-2019 00:00:50 Tests run: 2, Failures: 0, Errors: 0, Skipped: 0, Time elapsed: 0.001 sec
02-Jul-2019 00:00:50 Running org.springframework.security.oauth2.client.token.grant.code.AuthorizationCodeAccessTokenProviderWithConversionTests
02-Jul-2019 00:00:50 Tests run: 4, Failures: 0, Errors: 0, Skipped: 0, Time elapsed: 0.121 sec
02-Jul-2019 00:00:50 Running org.springframework.security.oauth2.client.token.grant.code.AuthorizationCodeAccessTokenProviderTests
02-Jul-2019 00:00:50 Tests run: 5, Failures: 0, Errors: 0, Skipped: 0, Time elapsed: 0.001 sec
02-Jul-2019 00:00:50 Running org.springframework.security.oauth2.client.token.grant.code.AuthorizationCodeResourceDetailsTests
02-Jul-2019 00:00:50 Tests run: 2, Failures: 0, Errors: 0, Skipped: 0, Time elapsed: 0.001 sec
02-Jul-2019 00:00:50 Running org.springframework.security.oauth2.client.token.JdbcClientTokenServicesTests
02-Jul-2019 00:00:50 Tests run: 3, Failures: 0, Errors: 0, Skipped: 0, Time elapsed: 0.319 sec
02-Jul-2019 00:00:50 Running org.springframework.security.oauth2.client.token.OAuth2AccessTokenSupportTests
02-Jul-2019 00:00:50 Tests run: 5, Failures: 0, Errors: 0, Skipped: 0, Time elapsed: 0.024 sec
02-Jul-2019 00:00:50 Running org.springframework.security.oauth2.client.token.AccessTokenProviderChainTests
02-Jul-2019 00:00:50 Tests run: 15, Failures: 0, Errors: 0, Skipped: 0, Time elapsed: 0.029 sec
02-Jul-2019 00:00:50 Running org.springframework.security.oauth2.client.filter.OAuth2ClientContextFilterTests
02-Jul-2019 00:00:50 Tests run: 11, Failures: 0, Errors: 0, Skipped: 0, Time elapsed: 0.007 sec
02-Jul-2019 00:00:50 Running org.springframework.security.oauth2.client.filter.OAuth2ClientAuthenticationProcessingFilterTests
02-Jul-2019 00:00:50 Tests run: 5, Failures: 0, Errors: 0, Skipped: 0, Time elapsed: 0.018 sec
02-Jul-2019 00:00:50 Running org.springframework.security.oauth2.client.OAuth2RestTemplateTests
02-Jul-2019 00:00:50 Tests run: 12, Failures: 0, Errors: 0, Skipped: 0, Time elapsed: 0.207 sec
02-Jul-2019 00:00:50 Running org.springframework.security.oauth2.provider.request.DefaultAuthorizationRequestFactoryTests
02-Jul-2019 00:00:50 Tests run: 9, Failures: 0, Errors: 0, Skipped: 0, Time elapsed: 0.002 sec
02-Jul-2019 00:00:50 Running org.springframework.security.oauth2.provider.request.DefaultOAuth2RequestValidatorTests
02-Jul-2019 00:00:50 Tests run: 3, Failures: 0, Errors: 0, Skipped: 0, Time elapsed: 0.001 sec
02-Jul-2019 00:00:50 Running org.springframework.security.oauth2.provider.password.ResourceOwnerPasswordTokenGranterTests
02-Jul-2019 00:00:50 Tests run: 7, Failures: 0, Errors: 0, Skipped: 0, Time elapsed: 0.004 sec
02-Jul-2019 00:00:50 Running org.springframework.security.oauth2.provider.client.BaseClientDetailsTests
02-Jul-2019 00:00:50 Tests run: 11, Failures: 0, Errors: 0, Skipped: 0, Time elapsed: 0.047 sec
02-Jul-2019 00:00:50 Running org.springframework.security.oauth2.provider.client.JdbcClientDetailsServiceTests
02-Jul-2019 00:00:51 Tests run: 14, Failures: 0, Errors: 0, Skipped: 0, Time elapsed: 0.277 sec
02-Jul-2019 00:00:51 Running org.springframework.security.oauth2.provider.client.ClientCredentialsTokenEndpointFilterTests
02-Jul-2019 00:00:51 Tests run: 3, Failures: 0, Errors: 0, Skipped: 0, Time elapsed: 0.021 sec
02-Jul-2019 00:00:51 Running org.springframework.security.oauth2.provider.client.ClientDetailsUserDetailsServiceTests
02-Jul-2019 00:00:51 Tests run: 2, Failures: 0, Errors: 0, Skipped: 0, Time elapsed: 0.005 sec
02-Jul-2019 00:00:51 Running org.springframework.security.oauth2.provider.approval.ApprovalStoreUserApprovalHandlerTests
02-Jul-2019 00:00:51 Tests run: 10, Failures: 0, Errors: 0, Skipped: 0, Time elapsed: 0.004 sec
02-Jul-2019 00:00:51 Running org.springframework.security.oauth2.provider.approval.DefaultUserApprovalHandlerTests
02-Jul-2019 00:00:51 Tests run: 1, Failures: 0, Errors: 0, Skipped: 0, Time elapsed: 0 sec
02-Jul-2019 00:00:51 Running org.springframework.security.oauth2.provider.approval.TokenStoreUserApprovalHandlerTests
02-Jul-2019 00:00:51 Tests run: 3, Failures: 0, Errors: 0, Skipped: 0, Time elapsed: 0.002 sec
02-Jul-2019 00:00:51 Running org.springframework.security.oauth2.provider.approval.JdbcApprovalStoreTests
02-Jul-2019 00:00:51 Tests run: 6, Failures: 0, Errors: 0, Skipped: 0, Time elapsed: 0.074 sec
02-Jul-2019 00:00:51 Running org.springframework.security.oauth2.provider.approval.InMemoryApprovalStoreTests
02-Jul-2019 00:00:51 Tests run: 5, Failures: 0, Errors: 0, Skipped: 0, Time elapsed: 0.001 sec
02-Jul-2019 00:00:51 Running org.springframework.security.oauth2.provider.approval.TokenApprovalStoreTests
02-Jul-2019 00:00:51 Tests run: 5, Failures: 0, Errors: 0, Skipped: 0, Time elapsed: 0.003 sec
02-Jul-2019 00:00:51 Running org.springframework.security.oauth2.provider.vote.ClientScopeVoterTests
02-Jul-2019 00:00:51 Tests run: 3, Failures: 0, Errors: 0, Skipped: 0, Time elapsed: 0.001 sec
02-Jul-2019 00:00:51 Running org.springframework.security.oauth2.provider.vote.ScopeVoterTests
02-Jul-2019 00:00:51 Tests run: 6, Failures: 0, Errors: 0, Skipped: 0, Time elapsed: 0.002 sec
02-Jul-2019 00:00:51 Running org.springframework.security.oauth2.provider.test.OAuth2RequestTests
02-Jul-2019 00:00:51 Tests run: 4, Failures: 0, Errors: 0, Skipped: 0, Time elapsed: 0 sec
02-Jul-2019 00:00:51 Running org.springframework.security.oauth2.provider.token.DefaultTokenServicesWithJdbcTests
02-Jul-2019 00:00:51 Tests run: 19, Failures: 0, Errors: 0, Skipped: 0, Time elapsed: 0.404 sec
02-Jul-2019 00:00:51 Running org.springframework.security.oauth2.provider.token.store.JwtAccessTokenConverterTests
02-Jul-2019 00:00:51 [WARN] JwtAccessTokenConverter - Unable to create an RSA verifier from verifierKey (ignoreable if using MAC)
02-Jul-2019 00:00:51 [WARN] JwtAccessTokenConverter - Unable to create an RSA verifier from verifierKey (ignoreable if using MAC)
02-Jul-2019 00:00:51 [WARN] JwtAccessTokenConverter - Unable to create an RSA verifier from verifierKey (ignoreable if using MAC)
02-Jul-2019 00:00:51 Tests run: 14, Failures: 0, Errors: 0, Skipped: 0, Time elapsed: 0.176 sec
02-Jul-2019 00:00:51 Running org.springframework.security.oauth2.provider.token.store.InMemoryTokenStoreTests
02-Jul-2019 00:00:51 Tests run: 16, Failures: 0, Errors: 0, Skipped: 0, Time elapsed: 0.013 sec
02-Jul-2019 00:00:51 Running org.springframework.security.oauth2.provider.token.store.JwtTokenStoreTests
02-Jul-2019 00:00:51 [WARN] JwtAccessTokenConverter - Unable to create an RSA verifier from verifierKey (ignoreable if using MAC)
02-Jul-2019 00:00:51 [WARN] JwtAccessTokenConverter - Unable to create an RSA verifier from verifierKey (ignoreable if using MAC)
02-Jul-2019 00:00:51 [WARN] JwtAccessTokenConverter - Unable to create an RSA verifier from verifierKey (ignoreable if using MAC)
02-Jul-2019 00:00:51 [WARN] JwtAccessTokenConverter - Unable to create an RSA verifier from verifierKey (ignoreable if using MAC)
02-Jul-2019 00:00:51 [WARN] JwtAccessTokenConverter - Unable to create an RSA verifier from verifierKey (ignoreable if using MAC)
02-Jul-2019 00:00:51 [WARN] JwtAccessTokenConverter - Unable to create an RSA verifier from verifierKey (ignoreable if using MAC)
02-Jul-2019 00:00:51 [WARN] JwtAccessTokenConverter - Unable to create an RSA verifier from verifierKey (ignoreable if using MAC)
02-Jul-2019 00:00:51 [WARN] JwtAccessTokenConverter - Unable to create an RSA verifier from verifierKey (ignoreable if using MAC)
02-Jul-2019 00:00:51 [WARN] JwtAccessTokenConverter - Unable to create an RSA verifier from verifierKey (ignoreable if using MAC)
02-Jul-2019 00:00:51 [WARN] JwtAccessTokenConverter - Unable to create an RSA verifier from verifierKey (ignoreable if using MAC)
02-Jul-2019 00:00:51 [WARN] JwtAccessTokenConverter - Unable to create an RSA verifier from verifierKey (ignoreable if using MAC)
02-Jul-2019 00:00:51 [WARN] JwtAccessTokenConverter - Unable to create an RSA verifier from verifierKey (ignoreable if using MAC)
02-Jul-2019 00:00:51 [WARN] JwtAccessTokenConverter - Unable to create an RSA verifier from verifierKey (ignoreable if using MAC)
02-Jul-2019 00:00:51 [WARN] JwtAccessTokenConverter - Unable to create an RSA verifier from verifierKey (ignoreable if using MAC)
02-Jul-2019 00:00:51 [WARN] JwtAccessTokenConverter - Unable to create an RSA verifier from verifierKey (ignoreable if using MAC)
02-Jul-2019 00:00:51 [WARN] JwtAccessTokenConverter - Unable to create an RSA verifier from verifierKey (ignoreable if using MAC)
02-Jul-2019 00:00:51 [WARN] JwtAccessTokenConverter - Unable to create an RSA verifier from verifierKey (ignoreable if using MAC)
02-Jul-2019 00:00:51 [WARN] JwtAccessTokenConverter - Unable to create an RSA verifier from verifierKey (ignoreable if using MAC)
02-Jul-2019 00:00:51 Tests run: 18, Failures: 0, Errors: 0, Skipped: 0, Time elapsed: 0.04 sec
02-Jul-2019 00:00:51 Running org.springframework.security.oauth2.provider.token.store.redis.RedisTokenStorePrefixTests
02-Jul-2019 00:00:55 Tests run: 15, Failures: 0, Errors: 0, Skipped: 0, Time elapsed: 3.132 sec
02-Jul-2019 00:00:55 Running org.springframework.security.oauth2.provider.token.store.redis.RedisTokenStoreMockTests
02-Jul-2019 00:00:55 Tests run: 2, Failures: 0, Errors: 0, Skipped: 0, Time elapsed: 0.067 sec
02-Jul-2019 00:00:55 Running org.springframework.security.oauth2.provider.token.store.redis.RedisTokenStoreTests
02-Jul-2019 00:00:58 Tests run: 16, Failures: 0, Errors: 0, Skipped: 0, Time elapsed: 3.053 sec
02-Jul-2019 00:00:58 Running org.springframework.security.oauth2.provider.token.store.JdbcTokenStoreTests
02-Jul-2019 00:00:58 Tests run: 14, Failures: 0, Errors: 0, Skipped: 0, Time elapsed: 0.155 sec
02-Jul-2019 00:00:58 Running org.springframework.security.oauth2.provider.token.DefaultTokenServicesAuthoritiesChangeTests
02-Jul-2019 00:00:58 Tests run: 1, Failures: 0, Errors: 0, Skipped: 0, Time elapsed: 0.001 sec
02-Jul-2019 00:00:58 Running org.springframework.security.oauth2.provider.token.DefaultUserAuthenticationConverterTests
02-Jul-2019 00:00:58 Tests run: 3, Failures: 0, Errors: 0, Skipped: 0, Time elapsed: 0.003 sec
02-Jul-2019 00:00:58 Running org.springframework.security.oauth2.provider.token.TokenServicesWithTokenEnhancerTests
02-Jul-2019 00:00:58 [WARN] JwtAccessTokenConverter - Unable to create an RSA verifier from verifierKey (ignoreable if using MAC)
02-Jul-2019 00:00:58 [WARN] JwtAccessTokenConverter - Unable to create an RSA verifier from verifierKey (ignoreable if using MAC)
02-Jul-2019 00:00:58 [WARN] JwtAccessTokenConverter - Unable to create an RSA verifier from verifierKey (ignoreable if using MAC)
02-Jul-2019 00:00:58 [WARN] JwtAccessTokenConverter - Unable to create an RSA verifier from verifierKey (ignoreable if using MAC)
02-Jul-2019 00:00:58 [WARN] JwtAccessTokenConverter - Unable to create an RSA verifier from verifierKey (ignoreable if using MAC)
02-Jul-2019 00:00:58 Tests run: 5, Failures: 0, Errors: 0, Skipped: 0, Time elapsed: 0.015 sec
02-Jul-2019 00:00:58 Running org.springframework.security.oauth2.provider.token.DefaultTokenServicesWithJwtTests
02-Jul-2019 00:00:58 [WARN] JwtAccessTokenConverter - Unable to create an RSA verifier from verifierKey (ignoreable if using MAC)
02-Jul-2019 00:00:58 [WARN] JwtAccessTokenConverter - Unable to create an RSA verifier from verifierKey (ignoreable if using MAC)
02-Jul-2019 00:00:58 [WARN] JwtAccessTokenConverter - Unable to create an RSA verifier from verifierKey (ignoreable if using MAC)
02-Jul-2019 00:00:58 [WARN] JwtAccessTokenConverter - Unable to create an RSA verifier from verifierKey (ignoreable if using MAC)
02-Jul-2019 00:00:58 [WARN] JwtAccessTokenConverter - Unable to create an RSA verifier from verifierKey (ignoreable if using MAC)
02-Jul-2019 00:00:58 [WARN] JwtAccessTokenConverter - Unable to create an RSA verifier from verifierKey (ignoreable if using MAC)
02-Jul-2019 00:00:58 [WARN] JwtAccessTokenConverter - Unable to create an RSA verifier from verifierKey (ignoreable if using MAC)
02-Jul-2019 00:00:58 [WARN] JwtAccessTokenConverter - Unable to create an RSA verifier from verifierKey (ignoreable if using MAC)
02-Jul-2019 00:00:58 [WARN] JwtAccessTokenConverter - Unable to create an RSA verifier from verifierKey (ignoreable if using MAC)
02-Jul-2019 00:00:58 [WARN] JwtAccessTokenConverter - Unable to create an RSA verifier from verifierKey (ignoreable if using MAC)
02-Jul-2019 00:00:58 [WARN] JwtAccessTokenConverter - Unable to create an RSA verifier from verifierKey (ignoreable if using MAC)
02-Jul-2019 00:00:58 [WARN] JwtAccessTokenConverter - Unable to create an RSA verifier from verifierKey (ignoreable if using MAC)
02-Jul-2019 00:00:58 [WARN] JwtAccessTokenConverter - Unable to create an RSA verifier from verifierKey (ignoreable if using MAC)
02-Jul-2019 00:00:58 [WARN] JwtAccessTokenConverter - Unable to create an RSA verifier from verifierKey (ignoreable if using MAC)
02-Jul-2019 00:00:58 [WARN] JwtAccessTokenConverter - Unable to create an RSA verifier from verifierKey (ignoreable if using MAC)
02-Jul-2019 00:00:58 Tests run: 15, Failures: 0, Errors: 0, Skipped: 0, Time elapsed: 0.037 sec
02-Jul-2019 00:00:58 Running org.springframework.security.oauth2.provider.token.DefaultTokenServicesTests
02-Jul-2019 00:00:58 Tests run: 1, Failures: 0, Errors: 0, Skipped: 0, Time elapsed: 0.004 sec
02-Jul-2019 00:00:58 Running org.springframework.security.oauth2.provider.token.DefaultTokenServicesWithInMemoryTests
02-Jul-2019 00:00:58 Tests run: 25, Failures: 0, Errors: 0, Skipped: 0, Time elapsed: 0.019 sec
02-Jul-2019 00:00:58 Running org.springframework.security.oauth2.provider.token.DefaultAccessTokenConverterTests
02-Jul-2019 00:00:58 Tests run: 15, Failures: 0, Errors: 0, Skipped: 0, Time elapsed: 0.003 sec
02-Jul-2019 00:00:58 Running org.springframework.security.oauth2.provider.implicit.InMemoryImplicitGrantServiceTests
02-Jul-2019 00:00:58 Tests run: 2, Failures: 0, Errors: 0, Skipped: 0, Time elapsed: 0.001 sec
02-Jul-2019 00:00:58 Running org.springframework.security.oauth2.provider.error.DefaultWebResponseExceptionTranslatorTests
02-Jul-2019 00:00:58 Tests run: 1, Failures: 0, Errors: 0, Skipped: 0, Time elapsed: 0 sec
02-Jul-2019 00:00:58 Running org.springframework.security.oauth2.provider.error.OAuth2AuthenticationEntryPointTests
02-Jul-2019 00:00:58 [WARN] DefaultHandlerExceptionResolver - Resolved exception caused by handler execution: org.springframework.web.HttpMediaTypeNotAcceptableException: Could not find acceptable representation
02-Jul-2019 00:00:58 Tests run: 7, Failures: 0, Errors: 0, Skipped: 0, Time elapsed: 0.033 sec
02-Jul-2019 00:00:58 Running org.springframework.security.oauth2.provider.error.OAuth2AccessDeniedHandlerTests
02-Jul-2019 00:00:58 Tests run: 1, Failures: 0, Errors: 0, Skipped: 0, Time elapsed: 0.004 sec
02-Jul-2019 00:00:58 Running org.springframework.security.oauth2.provider.authentication.OAuth2AuthenticationProcessingFilterTests
02-Jul-2019 00:00:58 Tests run: 8, Failures: 0, Errors: 0, Skipped: 0, Time elapsed: 0.038 sec
02-Jul-2019 00:00:58 Running org.springframework.security.oauth2.provider.authentication.OAuth2AuthenticationDetailsTests
02-Jul-2019 00:00:58 Tests run: 1, Failures: 0, Errors: 0, Skipped: 0, Time elapsed: 0.001 sec
02-Jul-2019 00:00:58 Running org.springframework.security.oauth2.provider.authentication.OAuth2AuthenticationManagerTests
02-Jul-2019 00:00:58 Tests run: 3, Failures: 0, Errors: 0, Skipped: 0, Time elapsed: 0.001 sec
02-Jul-2019 00:00:58 Running org.springframework.security.oauth2.provider.endpoint.FrameworkEndpointHandlerMappingTests
02-Jul-2019 00:00:58 Tests run: 4, Failures: 0, Errors: 0, Skipped: 0, Time elapsed: 0.001 sec
02-Jul-2019 00:00:58 Running org.springframework.security.oauth2.provider.endpoint.WhitelabelApprovalEndpointTests
02-Jul-2019 00:00:58 Tests run: 6, Failures: 0, Errors: 0, Skipped: 0, Time elapsed: 0.003 sec
02-Jul-2019 00:00:58 Running org.springframework.security.oauth2.provider.endpoint.ExactMatchRedirectResolverTests
02-Jul-2019 00:00:58 Tests run: 3, Failures: 0, Errors: 0, Skipped: 0, Time elapsed: 0.001 sec
02-Jul-2019 00:00:58 Running org.springframework.security.oauth2.provider.endpoint.AuthorizationEndpointTests
02-Jul-2019 00:00:58 Tests run: 34, Failures: 0, Errors: 0, Skipped: 0, Time elapsed: 0.022 sec
02-Jul-2019 00:00:58 Running org.springframework.security.oauth2.provider.endpoint.TokenEndpointTests
02-Jul-2019 00:00:58 Tests run: 6, Failures: 0, Errors: 0, Skipped: 0, Time elapsed: 0.009 sec
02-Jul-2019 00:00:58 Running org.springframework.security.oauth2.provider.endpoint.DefaultRedirectResolverTests
02-Jul-2019 00:00:58 Tests run: 31, Failures: 0, Errors: 0, Skipped: 0, Time elapsed: 0.009 sec
02-Jul-2019 00:00:58 Running org.springframework.security.oauth2.provider.endpoint.WhitelabelErrorEndpointTests
02-Jul-2019 00:00:58 Tests run: 3, Failures: 0, Errors: 0, Skipped: 0, Time elapsed: 0.001 sec
02-Jul-2019 00:00:58 Running org.springframework.security.oauth2.provider.endpoint.TokenEndpointAuthenticationFilterTests
02-Jul-2019 00:00:58 Tests run: 3, Failures: 0, Errors: 0, Skipped: 0, Time elapsed: 0.014 sec
02-Jul-2019 00:00:58 Running org.springframework.security.oauth2.provider.AuthorizationRequestTests
02-Jul-2019 00:00:58 Tests run: 9, Failures: 0, Errors: 0, Skipped: 0, Time elapsed: 0.004 sec
02-Jul-2019 00:00:58 Running org.springframework.security.oauth2.provider.OAuth2AuthenticationTests
02-Jul-2019 00:00:58 {"authorities":[{"authority":"ROLE_USER"}],"details":null,"authenticated":false,"userAuthentication":{"authorities":[{"authority":"ROLE_USER"}],"details":null,"authenticated":true,"principal":"foo","credentials":"bar","name":"foo"},"clientOnly":false,"oauth2Request":{"clientId":"id","scope":["read"],"requestParameters":{},"resourceIds":[],"authorities":[],"approved":false,"refresh":false,"redirectUri":null,"responseTypes":[],"extensions":{},"grantType":null,"refreshTokenRequest":null},"principal":"foo","credentials":"","name":"foo"}
02-Jul-2019 00:00:58 Tests run: 8, Failures: 0, Errors: 0, Skipped: 0, Time elapsed: 0.014 sec
02-Jul-2019 00:00:58 Running org.springframework.security.oauth2.provider.expression.OAuth2MethodSecurityExpressionHandlerTests
02-Jul-2019 00:00:58 Tests run: 9, Failures: 0, Errors: 0, Skipped: 0, Time elapsed: 0.006 sec
02-Jul-2019 00:00:58 Running org.springframework.security.oauth2.provider.expression.OAuth2SecurityExpressionMethodsTests
02-Jul-2019 00:00:58 Tests run: 10, Failures: 0, Errors: 0, Skipped: 0, Time elapsed: 0.002 sec
02-Jul-2019 00:00:58 Running org.springframework.security.oauth2.provider.expression.OAuth2WebSecurityExpressionHandlerTests
02-Jul-2019 00:00:58 Tests run: 6, Failures: 0, Errors: 0, Skipped: 0, Time elapsed: 0.002 sec
02-Jul-2019 00:00:58 Running org.springframework.security.oauth2.provider.expression.OAuth2ExpressionParserTests
02-Jul-2019 00:00:58 Tests run: 3, Failures: 0, Errors: 0, Skipped: 0, Time elapsed: 0.006 sec
02-Jul-2019 00:00:58 Running org.springframework.security.oauth2.provider.OAuth2RequestTests
02-Jul-2019 00:00:58 Tests run: 4, Failures: 0, Errors: 0, Skipped: 0, Time elapsed: 0.001 sec
02-Jul-2019 00:00:58 Running org.springframework.security.oauth2.provider.code.AuthorizationCodeTokenGranterTests
02-Jul-2019 00:00:58 Tests run: 5, Failures: 0, Errors: 0, Skipped: 0, Time elapsed: 0.003 sec
02-Jul-2019 00:00:58 Running org.springframework.security.oauth2.provider.code.InMemoryAuthorizationCodeServicesTests
02-Jul-2019 00:00:58 Tests run: 3, Failures: 0, Errors: 0, Skipped: 0, Time elapsed: 0.001 sec
02-Jul-2019 00:00:58 Running org.springframework.security.oauth2.provider.code.JdbcAuthorizationCodeServicesTests
02-Jul-2019 00:00:58 Tests run: 3, Failures: 0, Errors: 0, Skipped: 0, Time elapsed: 0.028 sec
02-Jul-2019 00:00:58 Running org.springframework.security.oauth2.provider.code.SubdomainRedirectResolverTests
02-Jul-2019 00:00:58 Tests run: 2, Failures: 0, Errors: 0, Skipped: 0, Time elapsed: 0 sec
02-Jul-2019 00:00:58 Running org.springframework.security.oauth2.common.OAuth2AccessTokenJackson1DeserializerTests
02-Jul-2019 00:00:59 Tests run: 8, Failures: 0, Errors: 0, Skipped: 0, Time elapsed: 1.101 sec
02-Jul-2019 00:00:59 Running org.springframework.security.oauth2.common.OAuth2AccessTokenJackson2DeserializerTests
02-Jul-2019 00:01:00 Tests run: 9, Failures: 0, Errors: 0, Skipped: 0, Time elapsed: 1.029 sec
02-Jul-2019 00:01:00 Running org.springframework.security.oauth2.common.exception.OAuth2ExceptionDeserializerTests
02-Jul-2019 00:01:00 Tests run: 13, Failures: 0, Errors: 0, Skipped: 0, Time elapsed: 0.009 sec
02-Jul-2019 00:01:00 Running org.springframework.security.oauth2.common.exception.OAuth2ExceptionSerializerTests
02-Jul-2019 00:01:00 Tests run: 11, Failures: 0, Errors: 0, Skipped: 0, Time elapsed: 0.008 sec
02-Jul-2019 00:01:00 Running org.springframework.security.oauth2.common.exception.OAuth2ExceptionJackson2DeserializerTests
02-Jul-2019 00:01:00 Tests run: 14, Failures: 0, Errors: 0, Skipped: 0, Time elapsed: 0.006 sec
02-Jul-2019 00:01:00 Running org.springframework.security.oauth2.common.OAuth2AccessTokenJackson2SerializerTests
02-Jul-2019 00:01:01 Tests run: 10, Failures: 0, Errors: 0, Skipped: 0, Time elapsed: 0.917 sec
02-Jul-2019 00:01:01 Running org.springframework.security.oauth2.common.OAuth2AccessTokenJackson1SerializerTests
02-Jul-2019 00:01:04 Tests run: 1, Failures: 0, Errors: 0, Skipped: 0, Time elapsed: 2.815 sec
02-Jul-2019 00:01:05 Exception: java.lang.OutOfMemoryError thrown from the UncaughtExceptionHandler in thread "main"
02-Jul-2019 00:01:06
02-Jul-2019 00:01:06 Results :
02-Jul-2019 00:01:06
02-Jul-2019 00:01:06 Tests run: 696, Failures: 0, Errors: 0, Skipped: 0
02-Jul-2019 00:01:06
02-Jul-2019 00:01:06 [INFO] ------------------------------------------------------------------------
02-Jul-2019 00:01:06 [INFO] Reactor Summary:
02-Jul-2019 00:01:06 [INFO]
02-Jul-2019 00:01:06 [INFO] OAuth for Spring Security .......................... SUCCESS [  0.960 s]
02-Jul-2019 00:01:06 [INFO] OAuth 1(a) for Spring Security ..................... SUCCESS [  8.836 s]
02-Jul-2019 00:01:06 [INFO] OAuth2 for Spring Security ......................... FAILURE [ 32.141 s]
02-Jul-2019 00:01:06 [INFO] spring-oauth2-tests ................................ SKIPPED
02-Jul-2019 00:01:06 [INFO] spring-oauth2-tests-common ......................... SKIPPED
02-Jul-2019 00:01:06 [INFO] spring-oauth2-tests-vanilla ........................ SKIPPED
02-Jul-2019 00:01:06 [INFO] spring-oauth2-tests-mappings ....................... SKIPPED
02-Jul-2019 00:01:06 [INFO] spring-oauth2-tests-form ........................... SKIPPED
02-Jul-2019 00:01:06 [INFO] spring-oauth2-tests-jwt ............................ SKIPPED
02-Jul-2019 00:01:06 [INFO] spring-oauth2-tests-approval ....................... SKIPPED
02-Jul-2019 00:01:06 [INFO] spring-oauth2-tests-jdbc ........................... SKIPPED
02-Jul-2019 00:01:06 [INFO] spring-oauth2-tests-jpa ............................ SKIPPED
02-Jul-2019 00:01:06 [INFO] spring-oauth2-tests-jaxb ........................... SKIPPED
02-Jul-2019 00:01:06 [INFO] spring-oauth-tests-custom-grant .................... SKIPPED
02-Jul-2019 00:01:06 [INFO] spring-oauth2-tests-multi .......................... SKIPPED
02-Jul-2019 00:01:06 [INFO] spring-oauth2-tests-client ......................... SKIPPED
02-Jul-2019 00:01:06 [INFO] spring-oauth2-tests-resource ....................... SKIPPED
02-Jul-2019 00:01:06 [INFO] spring-oauth2-tests-custom-authentication .......... SKIPPED
02-Jul-2019 00:01:06 [INFO] spring-oauth2-tests-xml ............................ SKIPPED
02-Jul-2019 00:01:06 [INFO] spring-oauth2-tests-xml-common ..................... SKIPPED
02-Jul-2019 00:01:06 [INFO] spring-oauth2-tests-xml-vanilla .................... SKIPPED
02-Jul-2019 00:01:06 [INFO] spring-oauth2-tests-xml-mappings ................... SKIPPED
02-Jul-2019 00:01:06 [INFO] spring-oauth2-tests-xml-form ....................... SKIPPED
02-Jul-2019 00:01:06 [INFO] spring-oauth2-tests-xml-jwt ........................ SKIPPED
02-Jul-2019 00:01:06 [INFO] spring-oauth2-tests-xml-approval ................... SKIPPED
02-Jul-2019 00:01:06 [INFO] spring-oauth2-tests-xml-jdbc ....................... SKIPPED
02-Jul-2019 00:01:06 [INFO] spring-oauth2-tests-xml-client ..................... SKIPPED
02-Jul-2019 00:01:06 [INFO] OAuth for Spring Security - Integration Tests ...... SKIPPED
02-Jul-2019 00:01:06 [INFO] OAuth for Spring Security - Sparklr (OAuth 1 Provider Example) SKIPPED
02-Jul-2019 00:01:06 [INFO] OAuth for Spring Security - Tonr (OAuth 1 Consumer Example) SKIPPED
02-Jul-2019 00:01:06 [INFO] OAuth for Spring Security - Sparklr2 (OAuth 2 Provider Example) SKIPPED
02-Jul-2019 00:01:06 [INFO] OAuth for Spring Security - Tonr2 (OAuth 2 Client Example) SKIPPED
02-Jul-2019 00:01:06 [INFO] OAuth for Spring Security - Samples ................ SKIPPED
02-Jul-2019 00:01:06 [INFO] ------------------------------------------------------------------------
02-Jul-2019 00:01:06 [INFO] BUILD FAILURE
02-Jul-2019 00:01:06 [INFO] ------------------------------------------------------------------------
02-Jul-2019 00:01:06 [INFO] Total time: 45.005 s
02-Jul-2019 00:01:06 [INFO] Finished at: 2019-07-02T00:01:06+00:00
02-Jul-2019 00:01:06 [INFO] Final Memory: 75M/529M
02-Jul-2019 00:01:06 [INFO] ------------------------------------------------------------------------
02-Jul-2019 00:01:06 [ERROR] Failed to execute goal org.apache.maven.plugins:maven-surefire-plugin:2.12.4:test (default-test) on project spring-security-oauth2: Execution default-test of goal org.apache.maven.plugins:maven-surefire-plugin:2.12.4:test failed: The forked VM terminated without saying properly goodbye. VM crash or System.exit called ? -> [Help 1]
02-Jul-2019 00:01:06 [ERROR]
02-Jul-2019 00:01:06 [ERROR] To see the full stack trace of the errors, re-run Maven with the -e switch.
02-Jul-2019 00:01:06 [ERROR] Re-run Maven using the -X switch to enable full debug logging.
02-Jul-2019 00:01:06 [ERROR]
02-Jul-2019 00:01:06 [ERROR] For more information about the errors and possible solutions, please read the following articles:
02-Jul-2019 00:01:06 [ERROR] [Help 1] http://cwiki.apache.org/confluence/display/MAVEN/PluginExecutionException
02-Jul-2019 00:01:06 [ERROR]
02-Jul-2019 00:01:06 [ERROR] After correcting the problems, you can resume the build with the command
02-Jul-2019 00:01:06 [ERROR]   mvn <goals> -rf :spring-security-oauth2
02-Jul-2019 00:01:06 Exception in thread "main"
02-Jul-2019 00:01:06
02-Jul-2019 00:01:06 Failing task since return code of [/opt/jdk-7/bin/java -cp /opt/maven-3.3/boot/plexus-classworlds-2.5.2.jar -Dclassworlds.conf=/tmp/artifactoryM27803094717186021668conf -DbuildInfoConfig.propertiesFile=/tmp/buildInfo6477550229245482484.properties -Xmx1256m -Xms128m -Dmaven.home=/opt/maven-3.3 -Dmaven.multiModuleProjectDirectory=/opt/bamboo-home/xml-data/build-dir/SECOAUTH-NIGHTLY-JOB1 org.codehaus.plexus.classworlds.launcher.Launcher clean install -P bootstrap -Dartifactory.publish.password=********] was 1 while expected 0
02-Jul-2019 00:01:06 Finished task 'Artifactory Maven 3' with result: Failed
02-Jul-2019 00:01:06 Running post build plugin 'Docker Container Cleanup'
02-Jul-2019 00:01:06 Running post build plugin 'NCover Results Collector'
02-Jul-2019 00:01:06 Running post build plugin 'Artifactory Release Management Staging'
02-Jul-2019 00:01:06 Running post build plugin 'Artifactory Build Info Copier'
02-Jul-2019 00:01:06 Running post build plugin 'Artifactory Gradle Properties Info Copier'
02-Jul-2019 00:01:06 Running post build plugin 'Clover Results Collector'
02-Jul-2019 00:01:06 Running post build plugin 'npm Cache Cleanup'
02-Jul-2019 00:01:06 Running post build plugin 'Artifact Copier'
02-Jul-2019 00:01:06 Successfully removed working directory at '/opt/bamboo-home/xml-data/build-dir/SECOAUTH-NIGHTLY-JOB1'
02-Jul-2019 00:01:06 Finalising the build...
02-Jul-2019 00:01:06 Stopping timer.
02-Jul-2019 00:01:06 Build SECOAUTH-NIGHTLY-JOB1-1692 completed.
02-Jul-2019 00:01:06 Running on server: post build plugin 'NCover Results Collector'
02-Jul-2019 00:01:06 Running on server: post build plugin 'Build Hanging Detection Configuration'
02-Jul-2019 00:01:06 Running on server: post build plugin 'Clover Delta Calculator'
02-Jul-2019 00:01:06 Running on server: post build plugin 'Maven Dependencies Postprocessor'
02-Jul-2019 00:01:06 All post build plugins have finished
02-Jul-2019 00:01:06 Generating build results summary...
02-Jul-2019 00:01:06 Saving build results to disk...
02-Jul-2019 00:01:06 Logging substituted variables...
02-Jul-2019 00:01:06 Indexing build results...
02-Jul-2019 00:01:06 Finished building SECOAUTH-NIGHTLY-JOB1-1692.