Build: #1014 failed Scheduled

Build result summary

Details

Completed
Duration
5 minutes
Labels
None
Agent
bamboo-03.af.pivotal.io
Revision
ec4a0cb9ffb92d91141524b6446ae1162de98bf5 ec4a0cb9ffb92d91141524b6446ae1162de98bf5
Total tests
194
Failing since
#1013 (Scheduled – )

Responsible

This build has been failing since #1013
No one has taken responsibility

Tests

Existing test failures 1
Status Test Failing since View job Duration
java.lang.IllegalStateException: java.lang.IllegalStateException: Failed to load ApplicationContext
java.lang.IllegalStateException: Failed to load ApplicationContext
	at org.springframework.test.context.cache.DefaultCacheAwareContextLoaderDelegate.loadContext(DefaultCacheAwareContextLoaderDelegate.java:124)
	at org.springframework.test.context.support.DefaultTestContext.getApplicationContext(DefaultTestContext.java:83)
	at org.springframework.test.context.support.DependencyInjectionTestExecutionListener.injectDependencies(DependencyInjectionTestExecutionListener.java:117)
	at org.springframework.test.context.support.DependencyInjectionTestExecutionListener.prepareTestInstance(DependencyInjectionTestExecutionListener.java:83)
	at org.springframework.test.context.TestContextManager.prepareTestInstance(TestContextManager.java:230)
	at org.spockframework.spring.SpringTestContextManager.prepareTestInstance(SpringTestContextManager.java:49)
(142 more lines...)java.lang.NullPointerException: java.lang.NullPointerException: Cannot get property 'failed' on null object
java.lang.NullPointerException: Cannot get property 'failed' on null object
	at geb.spock.GebReportingSpec.cleanup(GebReportingSpec.groovy:45)
Fixed tests 1
Status Test Failing since View job Duration
Successful AttributeTests first visit no attributes History
Failing since build #1013 (Scheduled) Default 2 secs