Build: #1045 failed Scheduled

Build result summary

Details

Completed
Duration
3 minutes
Labels
None
Agent
bamboo-01.af.pivotal.io
Revision
144d3d4103a73e1e8cfdd4c6d16a98fee4a824fa 144d3d4103a73e1e8cfdd4c6d16a98fee4a824fa
Total tests
181
Failing since
#1033 (Scheduled – )

Responsible

This build has been failing since #1033
No one has taken responsibility

Tests

Existing test failures 1
Status Test Failing since View job Duration
geb.error.UnexpectedPageException: geb.error.UnexpectedPageException: At checker page verification failed for page sample.pages.HomePage
geb.error.UnexpectedPageException: At checker page verification failed for page sample.pages.HomePage
	at geb.navigator.NonEmptyNavigator.click(NonEmptyNavigator.groovy:492)
	at geb.navigator.NonEmptyNavigator.click(NonEmptyNavigator.groovy:469)
	at geb.content.TemplateDerivedPageContent.click(TemplateDerivedPageContent.groovy:33)
	at sample.pages.LoginPage._clinit__closure2$_closure5(LoginPage.groovy:35)
	at sample.pages.LoginPage._clinit__closure2$_closure5(LoginPage.groovy)
	at geb.content.PageContentTemplate.invokeFactory(PageContentTemplate.groovy:97)
(24 more lines...)