Build #2,131

Master build of Spring Data GemFire.

Build: #2131 failed Child of SPRINGDATACMNS-DATACMNS-2858

Build result summary

Details

Completed
Duration
14 minutes
Labels
None
Agent
bamboo-11.af.pivotal.io
Revision
1ebe33c26d3afc87d6e01de6a3dc39139ce5f4fd 1ebe33c26d3afc87d6e01de6a3dc39139ce5f4fd
Total tests
2473
Failing since
#2129 (Child of SPRINGDATACMNS-DATACMNS-2856)
Fixed in
#2132 (Child of SPRINGDATACMNS-DATACMNS-2859)

Responsible

This build has been failing since #2129
No one has taken responsibility

Tests

New test failures 1
Status Test View job Duration
Collapse Failed ApacheGeodeSecurityManagerSecurityIntegrationTests authorizedUser History
Default Job < 1 sec
org.apache.geode.cache.client.ServerOperationException: remote server on bamboo-11(GeodeSecurityIntegrationTestsClient:21674:loner):34824:b9b85729:GeodeSecurityIntegrationTestsClient: org.apache.geode.security.NotAuthorizedException: analyst not authorized for DATA:WRITE:Echo:two
Caused by: org.apache.geode.security.NotAuthorizedException: analyst not authorized for DATA:WRITE:Echo:two
Caused by: org.apache.shiro.authz.UnauthorizedException: Subject does not have permission [DATA:WRITE:Echo:two]
Fixed tests 1
Status Test Failing since View job Duration
Successful GemfireTemplateQueriesOnGroupedPooledClientCacheRegionsIntegrationTests findsAllCats History
Failing since build #2130 (Child of SPRINGDATACMNS-DATACMNS-2857) Default Job < 1 sec