Nightly build of Spring Data GemFire master with Mocks enabled.

Build: #1305 was successful

Job: Default Job was successful

Stages & jobs

  1. Default Stage

Build log

The build generated 10,371 lines of output.The output is too long and has been truncated to the last 1,000 lines. Download or view full build log

16-Feb-2019 21:43:08   /home/bamboo/.m2/repository/net/bytebuddy/byte-buddy/1.9.3/byte-buddy-1.9.3.jar
16-Feb-2019 21:43:08   /home/bamboo/.m2/repository/net/bytebuddy/byte-buddy-agent/1.9.3/byte-buddy-agent-1.9.3.jar
16-Feb-2019 21:43:08   /home/bamboo/.m2/repository/org/objenesis/objenesis/2.6/objenesis-2.6.jar
16-Feb-2019 21:43:08   /home/bamboo/.m2/repository/org/springframework/spring-test/5.1.5.RELEASE/spring-test-5.1.5.RELEASE.jar
16-Feb-2019 21:43:08   /home/bamboo/.m2/repository/org/slf4j/slf4j-api/1.7.25/slf4j-api-1.7.25.jar
16-Feb-2019 21:43:08   /home/bamboo/.m2/repository/ch/qos/logback/logback-classic/1.2.3/logback-classic-1.2.3.jar
16-Feb-2019 21:43:08   /home/bamboo/.m2/repository/ch/qos/logback/logback-core/1.2.3/logback-core-1.2.3.jar
16-Feb-2019 21:43:08   /home/bamboo/.m2/repository/org/projectlombok/lombok/1.18.6/lombok-1.18.6.jar
16-Feb-2019 21:43:08   /home/bamboo/.m2/repository/org/apache/maven/surefire/surefire-junit4/2.22.1/surefire-junit4-2.22.1.jar
16-Feb-2019 21:43:08 Library Path:
16-Feb-2019 21:43:08   /usr/java/packages/lib/amd64
16-Feb-2019 21:43:08   /usr/lib64
16-Feb-2019 21:43:08   /lib64
16-Feb-2019 21:43:08   /lib
16-Feb-2019 21:43:08   /usr/lib
16-Feb-2019 21:43:08 System Properties:
16-Feb-2019 21:43:08     artifactory.publish.password = ********
16-Feb-2019 21:43:08     awt.toolkit = sun.awt.X11.XToolkit
16-Feb-2019 21:43:08     basedir = /opt/bamboo-home/xml-data/build-dir/SGF-NJDK8-JOB1
16-Feb-2019 21:43:08     file.encoding = UTF-8
16-Feb-2019 21:43:08     file.encoding.pkg = sun.io
16-Feb-2019 21:43:08     file.separator = /
16-Feb-2019 21:43:08     gemfire.disableShutdownHook = true
16-Feb-2019 21:43:08     java.awt.graphicsenv = sun.awt.X11GraphicsEnvironment
16-Feb-2019 21:43:08     java.awt.printerjob = sun.print.PSPrinterJob
16-Feb-2019 21:43:08     java.class.version = 52.0
16-Feb-2019 21:43:08     java.endorsed.dirs = /opt/jdk1.8.0_144/jre/lib/endorsed
16-Feb-2019 21:43:08     java.ext.dirs = /opt/jdk1.8.0_144/jre/lib/ext:/usr/java/packages/lib/ext
16-Feb-2019 21:43:08     java.home = /opt/jdk1.8.0_144/jre
16-Feb-2019 21:43:08     java.io.tmpdir = /tmp
16-Feb-2019 21:43:08     java.runtime.name = Java(TM) SE Runtime Environment
16-Feb-2019 21:43:08     java.runtime.version = 1.8.0_144-b01
16-Feb-2019 21:43:08     java.specification.name = Java Platform API Specification
16-Feb-2019 21:43:08     java.specification.vendor = Oracle Corporation
16-Feb-2019 21:43:08     java.specification.version = 1.8
16-Feb-2019 21:43:08     java.vendor = Oracle Corporation
16-Feb-2019 21:43:08     java.vendor.url = http://java.oracle.com/
16-Feb-2019 21:43:08     java.vendor.url.bug = http://bugreport.sun.com/bugreport/
16-Feb-2019 21:43:08     java.version = 1.8.0_144
16-Feb-2019 21:43:08     java.vm.info = mixed mode
16-Feb-2019 21:43:08     java.vm.name = Java HotSpot(TM) 64-Bit Server VM
16-Feb-2019 21:43:08     java.vm.specification.name = Java Virtual Machine Specification
16-Feb-2019 21:43:08     java.vm.specification.vendor = Oracle Corporation
16-Feb-2019 21:43:08     java.vm.specification.version = 1.8
16-Feb-2019 21:43:08     java.vm.vendor = Oracle Corporation
16-Feb-2019 21:43:08     java.vm.version = 25.144-b01
16-Feb-2019 21:43:08     javax.net.ssl.keyStore = ********
16-Feb-2019 21:43:08     line.separator =
16-Feb-2019 21:43:08
16-Feb-2019 21:43:08     localRepository = /home/bamboo/.m2/repository
16-Feb-2019 21:43:08     logback.log.level = error
16-Feb-2019 21:43:08     os.version = 4.4.0-141-generic
16-Feb-2019 21:43:08     path.separator = :
16-Feb-2019 21:43:08     spring.profiles.active = apache-geode
16-Feb-2019 21:43:08     sun.arch.data.model = 64
16-Feb-2019 21:43:08     sun.boot.class.path = /opt/jdk1.8.0_144/jre/lib/resources.jar:/opt/jdk1.8.0_144/jre/lib/rt.jar:/opt/jdk1.8.0_144/jre/lib/sunrsasign.jar:/opt/jdk1.8.0_144/jre/lib/jsse.jar:/opt/jdk1.8.0_144/jre/lib/jce.jar:/opt/jdk1.8.0_144/jre/lib/charsets.jar:/opt/jdk1.8.0_144/jre/lib/jfr.jar:/opt/jdk1.8.0_144/jre/classes
16-Feb-2019 21:43:08     sun.boot.library.path = /opt/jdk1.8.0_144/jre/lib/amd64
16-Feb-2019 21:43:08     sun.cpu.endian = little
16-Feb-2019 21:43:08     sun.cpu.isalist =
16-Feb-2019 21:43:08     sun.io.unicode.encoding = UnicodeLittle
16-Feb-2019 21:43:08     sun.java.command = org.apache.maven.surefire.booter.ForkedBooter /opt/bamboo-home/xml-data/build-dir/SGF-NJDK8-JOB1/target/surefire 2019-02-16T21-30-33_068-jvmRun1 surefire8784811507657401309tmp surefire_2911586767691909068909tmp
16-Feb-2019 21:43:08     sun.java.launcher = SUN_STANDARD
16-Feb-2019 21:43:08     sun.jnu.encoding = UTF-8
16-Feb-2019 21:43:08     sun.management.compiler = HotSpot 64-Bit Tiered Compilers
16-Feb-2019 21:43:08     sun.nio.ch.bugLevel =
16-Feb-2019 21:43:08     sun.os.patch.level = unknown
16-Feb-2019 21:43:08     surefire.test.class.path = /opt/bamboo-home/xml-data/build-dir/SGF-NJDK8-JOB1/target/test-classes:/opt/bamboo-home/xml-data/build-dir/SGF-NJDK8-JOB1/target/classes:/home/bamboo/.m2/repository/javax/cache/cache-api/1.0.0/cache-api-1.0.0.jar:/home/bamboo/.m2/repository/org/apache/geronimo/specs/geronimo-jcdi_2.0_spec/1.0.1/geronimo-jcdi_2.0_spec-1.0.1.jar:/home/bamboo/.m2/repository/javax/interceptor/javax.interceptor-api/1.2.1/javax.interceptor-api-1.2.1.jar:/home/bamboo/.m2/repository/javax/el/el-api/2.2/el-api-2.2.jar:/home/bamboo/.m2/repository/javax/enterprise/cdi-api/1.0/cdi-api-1.0.jar:/home/bamboo/.m2/repository/org/jboss/interceptor/jboss-interceptor-api/1.1/jboss-interceptor-api-1.1.jar:/home/bamboo/.m2/repository/javax/annotation/jsr250-api/1.0/jsr250-api-1.0.jar:/home/bamboo/.m2/repository/javax/inject/javax.inject/1/javax.inject-1.jar:/home/bamboo/.m2/repository/org/springframework/spring-context-support/5.1.5.RELEASE/spring-context-support-5.1.5.RELEASE.jar:/home/bamboo/.m2/repository/org/springframework/spring-beans/5.1.5.RELEASE/spring-beans-5.1.5.RELEASE.jar:/home/bamboo/.m2/repository/org/springframework/spring-context/5.1.5.RELEASE/spring-context-5.1.5.RELEASE.jar:/home/bamboo/.m2/repository/org/springframework/spring-aop/5.1.5.RELEASE/spring-aop-5.1.5.RELEASE.jar:/home/bamboo/.m2/repository/org/springframework/spring-expression/5.1.5.RELEASE/spring-expression-5.1.5.RELEASE.jar:/home/bamboo/.m2/repository/org/springframework/spring-core/5.1.5.RELEASE/spring-core-5.1.5.RELEASE.jar:/home/bamboo/.m2/repository/org/springframework/spring-jcl/5.1.5.RELEASE/spring-jcl-5.1.5.RELEASE.jar:/home/bamboo/.m2/repository/org/springframework/spring-tx/5.1.5.RELEASE/spring-tx-5.1.5.RELEASE.jar:/home/bamboo/.m2/repository/org/springframework/spring-web/5.1.5.RELEASE/spring-web-5.1.5.RELEASE.jar:/home/bamboo/.m2/repository/org/springframework/data/spring-data-commons/2.2.0.BUILD-SNAPSHOT/spring-data-commons-2.2.0.BUILD-SNAPSHOT.jar:/home/bamboo/.m2/repository/io/pivotal/gemfire/geode-core/9.7.0/geode-core-9.7.0.jar:/home/bamboo/.m2/repository/com/github/stephenc/findbugs/findbugs-annotations/1.3.9-1/findbugs-annotations-1.3.9-1.jar:/home/bamboo/.m2/repository/org/jgroups/jgroups/3.6.14.Final/jgroups-3.6.14.Final.jar:/home/bamboo/.m2/repository/commons-io/commons-io/2.6/commons-io-2.6.jar:/home/bamboo/.m2/repository/commons-validator/commons-validator/1.6/commons-validator-1.6.jar:/home/bamboo/.m2/repository/commons-beanutils/commons-beanutils/1.9.2/commons-beanutils-1.9.2.jar:/home/bamboo/.m2/repository/commons-logging/commons-logging/1.2/commons-logging-1.2.jar:/home/bamboo/.m2/repository/commons-collections/commons-collections/3.2.2/commons-collections-3.2.2.jar:/home/bamboo/.m2/repository/commons-digester/commons-digester/2.1/commons-digester-2.1.jar:/home/bamboo/.m2/repository/javax/activation/activation/1.1.1/activation-1.1.1.jar:/home/bamboo/.m2/repository/javax/xml/bind/jaxb-api/2.2.11/jaxb-api-2.2.11.jar:/home/bamboo/.m2/repository/com/sun/xml/bind/jaxb-core/2.2.11/jaxb-core-2.2.11.jar:/home/bamboo/.m2/repository/com/sun/xml/bind/jaxb-impl/2.2.11/jaxb-impl-2.2.11.jar:/home/bamboo/.m2/repository/commons-lang/commons-lang/2.6/commons-lang-2.6.jar:/home/bamboo/.m2/repository/it/unimi/dsi/fastutil/8.2.1/fastutil-8.2.1.jar:/home/bamboo/.m2/repository/javax/resource/javax.resource-api/1.7/javax.resource-api-1.7.jar:/home/bamboo/.m2/repository/javax/transaction/javax.transaction-api/1.2/javax.transaction-api-1.2.jar:/home/bamboo/.m2/repository/net/java/dev/jna/jna/4.1.0/jna-4.1.0.jar:/home/bamboo/.m2/repository/net/sf/jopt-simple/jopt-simple/5.0.4/jopt-simple-5.0.4.jar:/home/bamboo/.m2/repository/org/apache/logging/log4j/log4j-api/2.11.0/log4j-api-2.11.0.jar:/home/bamboo/.m2/repository/org/apache/logging/log4j/log4j-core/2.11.0/log4j-core-2.11.0.jar:/home/bamboo/.m2/repository/org/apache/shiro/shiro-core/1.4.0/shiro-core-1.4.0.jar:/home/bamboo/.m2/repository/org/apache/shiro/shiro-lang/1.4.0/shiro-lang-1.4.0.jar:/home/bamboo/.m2/repository/org/apache/shiro/shiro-cache/1.4.0/shiro-cache-1.4.0.jar:/home/bamboo/.m2/repository/org/apache/shiro/shiro-crypto-hash/1.4.0/shiro-crypto-hash-1.4.0.jar:/home/bamboo/.m2/repository/org/apache/shiro/shiro-crypto-core/1.4.0/shiro-crypto-core-1.4.0.jar:/home/bamboo/.m2/repository/org/apache/shiro/shiro-crypto-cipher/1.4.0/shiro-crypto-cipher-1.4.0.jar:/home/bamboo/.m2/repository/org/apache/shiro/shiro-config-core/1.4.0/shiro-config-core-1.4.0.jar:/home/bamboo/.m2/repository/org/apache/shiro/shiro-config-ogdl/1.4.0/shiro-config-ogdl-1.4.0.jar:/home/bamboo/.m2/repository/org/apache/shiro/shiro-event/1.4.0/shiro-event-1.4.0.jar:/home/bamboo/.m2/repository/io/github/classgraph/classgraph/4.0.6/classgraph-4.0.6.jar:/home/bamboo/.m2/repository/com/healthmarketscience/rmiio/rmiio/2.1.2/rmiio-2.1.2.jar:/home/bamboo/.m2/repository/io/pivotal/gemfire/geode-common/9.7.0/geode-common-9.7.0.jar:/home/bamboo/.m2/repository/io/pivotal/gemfire/geode-json/9.7.0/geode-json-9.7.0.jar:/home/bamboo/.m2/repository/io/pivotal/gemfire/geode-cq/9.7.0/geode-cq-9.7.0.jar:/home/bamboo/.m2/repository/io/pivotal/gemfire/geode-lucene/9.7.0/geode-lucene-9.7.0.jar:/home/bamboo/.m2/repository/org/apache/lucene/lucene-core/6.6.2/lucene-core-6.6.2.jar:/home/bamboo/.m2/repository/mx4j/mx4j/3.0.2/mx4j-3.0.2.jar:/home/bamboo/.m2/repository/org/apache/lucene/lucene-analyzers-common/6.6.2/lucene-analyzers-common-6.6.2.jar:/home/bamboo/.m2/repository/org/apache/lucene/lucene-queryparser/6.6.2/lucene-queryparser-6.6.2.jar:/home/bamboo/.m2/repository/org/apache/lucene/lucene-queries/6.6.2/lucene-queries-6.6.2.jar:/home/bamboo/.m2/repository/org/apache/lucene/lucene-analyzers-phonetic/6.6.2/lucene-analyzers-phonetic-6.6.2.jar:/home/bamboo/.m2/repository/commons-codec/commons-codec/1.10/commons-codec-1.10.jar:/home/bamboo/.m2/repository/io/pivotal/gemfire/geode-wan/9.7.0/geode-wan-9.7.0.jar:/home/bamboo/.m2/repository/antlr/antlr/2.7.7/antlr-2.7.7.jar:/home/bamboo/.m2/repository/org/apache/shiro/shiro-spring/1.3.2/shiro-spring-1.3.2.jar:/home/bamboo/.m2/repository/org/apache/shiro/shiro-web/1.3.2/shiro-web-1.3.2.jar:/home/bamboo/.m2/repository/org/aspectj/aspectjweaver/1.9.2/aspectjweaver-1.9.2.jar:/home/bamboo/.m2/repository/com/fasterxml/jackson/core/jackson-annotations/2.9.0/jackson-annotations-2.9.0.jar:/home/bamboo/.m2/repository/com/fasterxml/jackson/core/jackson-databind/2.9.8/jackson-databind-2.9.8.jar:/home/bamboo/.m2/repository/com/fasterxml/jackson/core/jackson-core/2.9.8/jackson-core-2.9.8.jar:/home/bamboo/.m2/repository/org/slf4j/jcl-over-slf4j/1.7.25/jcl-over-slf4j-1.7.25.jar:/home/bamboo/.m2/repository/javax/annotation/javax.annotation-api/1.3/javax.annotation-api-1.3.jar:/home/bamboo/.m2/repository/org/assertj/assertj-core/3.12.0/assertj-core-3.12.0.jar:/home/bamboo/.m2/repository/org/apache/derby/derbyLocale_zh_TW/10.9.1.0/derbyLocale_zh_TW-10.9.1.0.jar:/home/bamboo/.m2/repository/org/apache/derby/derby/10.9.1.0/derby-10.9.1.0.jar:/home/bamboo/.m2/repository/org/apache/openwebbeans/openwebbeans-se/2.0.10/openwebbeans-se-2.0.10.jar:/home/bamboo/.m2/repository/org/apache/openwebbeans/openwebbeans-impl/2.0.10/openwebbeans-impl-2.0.10.jar:/home/bamboo/.m2/repository/org/apache/xbean/xbean-finder-shaded/4.12/xbean-finder-shaded-4.12.jar:/home/bamboo/.m2/repository/org/apache/xbean/xbean-asm7-shaded/4.12/xbean-asm7-shaded-4.12.jar:/home/bamboo/.m2/repository/org/apache/openwebbeans/openwebbeans-spi/2.0.10/openwebbeans-spi-2.0.10.jar:/home/bamboo/.m2/repository/edu/umd/cs/mtc/multithreadedtc/1.01/multithreadedtc-1.01.jar:/home/bamboo/.m2/repository/org/iq80/snappy/snappy/0.4/snappy-0.4.jar:/home/bamboo/.m2/repository/org/springframework/shell/spring-shell/1.2.0.RELEASE/spring-shell-1.2.0.RELEASE.jar:/home/bamboo/.m2/repository/com/google/guava/guava/17.0/guava-17.0.jar:/home/bamboo/.m2/repository/jline/jline/2.12/jline-2.12.jar:/home/bamboo/.m2/repository/org/hamcrest/hamcrest-library/1.3/hamcrest-library-1.3.jar:/home/bamboo/.m2/repository/org/hamcrest/hamcrest-core/1.3/hamcrest-core-1.3.jar:/home/bamboo/.m2/repository/junit/junit/4.12/junit-4.12.jar:/home/bamboo/.m2/repository/org/mockito/mockito-core/2.23.4/mockito-core-2.23.4.jar:/home/bamboo/.m2/repository/net/bytebuddy/byte-buddy/1.9.3/byte-buddy-1.9.3.jar:/home/bamboo/.m2/repository/net/bytebuddy/byte-buddy-agent/1.9.3/byte-buddy-agent-1.9.3.jar:/home/bamboo/.m2/repository/org/objenesis/objenesis/2.6/objenesis-2.6.jar:/home/bamboo/.m2/repository/org/springframework/spring-test/5.1.5.RELEASE/spring-test-5.1.5.RELEASE.jar:/home/bamboo/.m2/repository/org/slf4j/slf4j-api/1.7.25/slf4j-api-1.7.25.jar:/home/bamboo/.m2/repository/ch/qos/logback/logback-classic/1.2.3/logback-classic-1.2.3.jar:/home/bamboo/.m2/repository/ch/qos/logback/logback-core/1.2.3/logback-core-1.2.3.jar:/home/bamboo/.m2/repository/org/projectlombok/lombok/1.18.6/lombok-1.18.6.jar:
16-Feb-2019 21:43:08     user.country = US
16-Feb-2019 21:43:08     user.language = en
16-Feb-2019 21:43:08     user.timezone = Etc/UTC
16-Feb-2019 21:43:08 Log4J 2 Configuration:
16-Feb-2019 21:43:08     jar:file:/opt/users/bamboo/.m2/repository/io/pivotal/gemfire/geode-core/9.7.0/geode-core-9.7.0.jar!/log4j2.xml
16-Feb-2019 21:43:08 ---------------------------------------------------------------------------
16-Feb-2019 21:43:08
16-Feb-2019 21:43:08
16-Feb-2019 21:43:08 [info 2019/02/16 21:43:08.799 UTC <main> tid=0x1] initializing InternalDataSerializer with 3 services
16-Feb-2019 21:43:08
16-Feb-2019 21:43:08 [info 2019/02/16 21:43:08.817 UTC <main> tid=0x1] [ThreadsMonitor] New Monitor object and process were created.
16-Feb-2019 21:43:08
16-Feb-2019 21:43:08
16-Feb-2019 21:43:08 [info 2019/02/16 21:43:08.837 UTC <StatSampler> tid=0x12] Disabling statistic archival.
16-Feb-2019 21:43:08
16-Feb-2019 21:43:08 [info 2019/02/16 21:43:08.873 UTC <main> tid=0x1] Running in local mode since no locators were specified.
16-Feb-2019 21:43:08
16-Feb-2019 21:43:09 [info 2019/02/16 21:43:09.048 UTC <main> tid=0x1] Initializing region _monitoringRegion_10.194.6.20<v-1>0
16-Feb-2019 21:43:09
16-Feb-2019 21:43:09 [info 2019/02/16 21:43:09.055 UTC <main> tid=0x1] Initialization of region _monitoringRegion_10.194.6.20<v-1>0 completed
16-Feb-2019 21:43:09
16-Feb-2019 21:43:09 [info 2019/02/16 21:43:09.675 UTC <main> tid=0x1] Initialized cache service org.apache.geode.cache.lucene.internal.LuceneServiceImpl
16-Feb-2019 21:43:09
16-Feb-2019 21:43:09 [info 2019/02/16 21:43:09.675 UTC <main> tid=0x1] Loading previously deployed jars
16-Feb-2019 21:43:09
16-Feb-2019 21:43:09 [info 2019/02/16 21:43:09.693 UTC <main> tid=0x1] Connected to Distributed System [BasicSubRegionConfig] as Member [bamboo-10(BasicSubRegionConfig:29007:loner):0:075543f8:BasicSubRegionConfig] in Group(s) [[]] with Role(s) [[]] on Host [bamboo-10.af.pivotal.io] having PID [29007]
16-Feb-2019 21:43:09
16-Feb-2019 21:43:09 [info 2019/02/16 21:43:09.695 UTC <main> tid=0x1] Created new Pivotal GemFire version [9.7.0] Cache [BasicSubRegionConfig]
16-Feb-2019 21:43:09
16-Feb-2019 21:43:09 [info 2019/02/16 21:43:09.711 UTC <main> tid=0x1] Falling back to creating Region [r-region] in Cache [BasicSubRegionConfig]
16-Feb-2019 21:43:09
16-Feb-2019 21:43:09 [info 2019/02/16 21:43:09.718 UTC <main> tid=0x1] Created Region [r-region]
16-Feb-2019 21:43:09
16-Feb-2019 21:43:09 [info 2019/02/16 21:43:09.730 UTC <main> tid=0x1] Falling back to creating Region [c-region] in Cache [BasicSubRegionConfig]
16-Feb-2019 21:43:09
16-Feb-2019 21:43:09 [info 2019/02/16 21:43:09.730 UTC <main> tid=0x1] Created Region [c-region]
16-Feb-2019 21:43:09
16-Feb-2019 21:43:09 [info 2019/02/16 21:43:09.773 UTC <main> tid=0x1] Began transaction (1) for test context [DefaultTestContext@706fe5c6 testClass = TxIntegrationTest, testInstance = org.springframework.data.gemfire.TxIntegrationTest@6c15e8c7, testMethod = testTransactionCommit@TxIntegrationTest, testException = [null], mergedContextConfiguration = [MergedContextConfiguration@56380231 testClass = TxIntegrationTest, locations = '{classpath:/org/springframework/data/gemfire/basic-tx-config.xml}', classes = '{}', contextInitializerClasses = '[]', activeProfiles = '{}', propertySourceLocations = '{}', propertySourceProperties = '{}', contextCustomizers = set[[empty]], contextLoader = 'org.springframework.test.context.support.DelegatingSmartContextLoader', parent = [null]], attributes = map[[empty]]]; transaction manager [org.springframework.data.gemfire.transaction.GemfireTransactionManager@64f1fd08]; rollback [false]
16-Feb-2019 21:43:09
16-Feb-2019 21:43:09 [info 2019/02/16 21:43:09.793 UTC <main> tid=0x1] Committed transaction for test: [DefaultTestContext@706fe5c6 testClass = TxIntegrationTest, testInstance = org.springframework.data.gemfire.TxIntegrationTest@6c15e8c7, testMethod = testTransactionCommit@TxIntegrationTest, testException = [null], mergedContextConfiguration = [MergedContextConfiguration@56380231 testClass = TxIntegrationTest, locations = '{classpath:/org/springframework/data/gemfire/basic-tx-config.xml}', classes = '{}', contextInitializerClasses = '[]', activeProfiles = '{}', propertySourceLocations = '{}', propertySourceProperties = '{}', contextCustomizers = set[[empty]], contextLoader = 'org.springframework.test.context.support.DelegatingSmartContextLoader', parent = [null]], attributes = map[[empty]]]
16-Feb-2019 21:43:09
16-Feb-2019 21:43:09 [info 2019/02/16 21:43:09.798 UTC <main> tid=0x1] Began transaction (1) for test context [DefaultTestContext@706fe5c6 testClass = TxIntegrationTest, testInstance = org.springframework.data.gemfire.TxIntegrationTest@1d5d5621, testMethod = testTransactionRollback@TxIntegrationTest, testException = [null], mergedContextConfiguration = [MergedContextConfiguration@56380231 testClass = TxIntegrationTest, locations = '{classpath:/org/springframework/data/gemfire/basic-tx-config.xml}', classes = '{}', contextInitializerClasses = '[]', activeProfiles = '{}', propertySourceLocations = '{}', propertySourceProperties = '{}', contextCustomizers = set[[empty]], contextLoader = 'org.springframework.test.context.support.DelegatingSmartContextLoader', parent = [null]], attributes = map[[empty]]]; transaction manager [org.springframework.data.gemfire.transaction.GemfireTransactionManager@64f1fd08]; rollback [true]
16-Feb-2019 21:43:09
16-Feb-2019 21:43:09 [info 2019/02/16 21:43:09.799 UTC <main> tid=0x1] Rolled back transaction for test: [DefaultTestContext@706fe5c6 testClass = TxIntegrationTest, testInstance = org.springframework.data.gemfire.TxIntegrationTest@1d5d5621, testMethod = testTransactionRollback@TxIntegrationTest, testException = [null], mergedContextConfiguration = [MergedContextConfiguration@56380231 testClass = TxIntegrationTest, locations = '{classpath:/org/springframework/data/gemfire/basic-tx-config.xml}', classes = '{}', contextInitializerClasses = '[]', activeProfiles = '{}', propertySourceLocations = '{}', propertySourceProperties = '{}', contextCustomizers = set[[empty]], contextLoader = 'org.springframework.test.context.support.DelegatingSmartContextLoader', parent = [null]], attributes = map[[empty]]]
16-Feb-2019 21:43:09
16-Feb-2019 21:43:09 [INFO] Tests run: 2, Failures: 0, Errors: 0, Skipped: 0, Time elapsed: 2.593 s - in org.springframework.data.gemfire.TxIntegrationTest
16-Feb-2019 21:43:09 [info 2019/02/16 21:43:09.812 UTC <Thread-5> tid=0x23] GemFireCache[id = 1256893889; isClosing = true; isShutDownAll = false; created = Sat Feb 16 21:43:08 UTC 2019; server = false; copyOnRead = true; lockLease = 120; lockTimeout = 60]: Now closing.
16-Feb-2019 21:43:09
16-Feb-2019 21:43:10 [INFO] Running org.springframework.data.gemfire.wan.OrderPolicyConverterUnitTests
16-Feb-2019 21:43:10 [INFO] Tests run: 4, Failures: 0, Errors: 0, Skipped: 0, Time elapsed: 0.128 s - in org.springframework.data.gemfire.wan.OrderPolicyConverterUnitTests
16-Feb-2019 21:43:11 [INFO] Running org.springframework.data.gemfire.wan.AsyncEventQueueFactoryBeanTest
16-Feb-2019 21:43:12 [INFO] Tests run: 11, Failures: 0, Errors: 0, Skipped: 0, Time elapsed: 1.256 s - in org.springframework.data.gemfire.wan.AsyncEventQueueFactoryBeanTest
16-Feb-2019 21:43:12 [INFO] Running org.springframework.data.gemfire.wan.ManualGatewayReceiverStartIntegrationTest
16-Feb-2019 21:43:13 [info 2019/02/16 21:43:13.611 UTC <main> tid=0x1] Detected default resource location "classpath:org/springframework/data/gemfire/wan/ManualGatewayReceiverStartIntegrationTest-context.xml" for test class [org.springframework.data.gemfire.wan.ManualGatewayReceiverStartIntegrationTest]
16-Feb-2019 21:43:13
16-Feb-2019 21:43:13 [info 2019/02/16 21:43:13.615 UTC <main> tid=0x1] GenericXmlContextLoader detected default locations for context configuration [ContextConfigurationAttributes@156b88f5 declaringClass = 'org.springframework.data.gemfire.wan.ManualGatewayReceiverStartIntegrationTest', classes = '{}', locations = '{classpath:org/springframework/data/gemfire/wan/ManualGatewayReceiverStartIntegrationTest-context.xml}', inheritLocations = true, initializers = '{class org.springframework.data.gemfire.test.GemfireTestApplicationContextInitializer}', inheritInitializers = true, name = [null], contextLoaderClass = 'org.springframework.test.context.ContextLoader'].
16-Feb-2019 21:43:13
16-Feb-2019 21:43:13 [info 2019/02/16 21:43:13.617 UTC <main> tid=0x1] Could not detect default configuration classes for test class [org.springframework.data.gemfire.wan.ManualGatewayReceiverStartIntegrationTest]: ManualGatewayReceiverStartIntegrationTest does not declare any static, non-private, non-final, nested classes annotated with @Configuration.
16-Feb-2019 21:43:13
16-Feb-2019 21:43:13 [info 2019/02/16 21:43:13.631 UTC <main> tid=0x1] Loaded default TestExecutionListener class names from location [META-INF/spring.factories]: [org.springframework.test.context.web.ServletTestExecutionListener, org.springframework.test.context.support.DirtiesContextBeforeModesTestExecutionListener, org.springframework.test.context.support.DependencyInjectionTestExecutionListener, org.springframework.test.context.support.DirtiesContextTestExecutionListener, org.springframework.test.context.transaction.TransactionalTestExecutionListener, org.springframework.test.context.jdbc.SqlScriptsTestExecutionListener]
16-Feb-2019 21:43:13
16-Feb-2019 21:43:13 [info 2019/02/16 21:43:13.640 UTC <main> tid=0x1] Using TestExecutionListeners: [org.springframework.test.context.support.DirtiesContextBeforeModesTestExecutionListener@48aca48b, org.springframework.test.context.support.DependencyInjectionTestExecutionListener@13fd2ccd, org.springframework.test.context.support.DirtiesContextTestExecutionListener@b9b00e0, org.springframework.test.context.transaction.TransactionalTestExecutionListener@506ae4d4, org.springframework.test.context.jdbc.SqlScriptsTestExecutionListener@7d4f9aae]
16-Feb-2019 21:43:13
16-Feb-2019 21:43:13 [info 2019/02/16 21:43:13.933 UTC <main> tid=0x1] Replacing the [gemfireCache] bean definition having type [org.springframework.data.gemfire.CacheFactoryBean] with mock [org.springframework.data.gemfire.test.MockCacheFactoryBean]...
16-Feb-2019 21:43:13
16-Feb-2019 21:43:14 [info 2019/02/16 21:43:14.398 UTC <main> tid=0x1] Connected to Distributed System [ManualGatewayReceiverStartIntegrationTest] as Member [null] in Group(s) [[]] with Role(s) [[]] on Host [mockDistributedMember.host] having PID [0]
16-Feb-2019 21:43:14
16-Feb-2019 21:43:14 [info 2019/02/16 21:43:14.410 UTC <main> tid=0x1] Found existing Pivotal GemFire version [9.7.0] Cache [ManualGatewayReceiverStartIntegrationTest]
16-Feb-2019 21:43:14
16-Feb-2019 21:43:14 [info 2019/02/16 21:43:14.446 UTC <main> tid=0x1] Falling back to creating Region [Example] in Cache [ManualGatewayReceiverStartIntegrationTest]
16-Feb-2019 21:43:14
16-Feb-2019 21:43:14 [info 2019/02/16 21:43:14.611 UTC <main> tid=0x1] Created Region [Example]
16-Feb-2019 21:43:14
16-Feb-2019 21:43:14 [INFO] Tests run: 2, Failures: 0, Errors: 0, Skipped: 0, Time elapsed: 1.922 s - in org.springframework.data.gemfire.wan.ManualGatewayReceiverStartIntegrationTest
16-Feb-2019 21:43:14 [info 2019/02/16 21:43:14.776 UTC <Thread-1> tid=0xe] Invocation of destroy method failed on bean with name 'gemfireCache': org.apache.geode.cache.CacheClosedException: A cache has not yet been created.
16-Feb-2019 21:43:14
16-Feb-2019 21:43:15 [INFO] Running org.springframework.data.gemfire.wan.OrderPolicyTypeTest
16-Feb-2019 21:43:15 [INFO] Tests run: 6, Failures: 0, Errors: 0, Skipped: 0, Time elapsed: 0.051 s - in org.springframework.data.gemfire.wan.OrderPolicyTypeTest
16-Feb-2019 21:43:15 [INFO] Running org.springframework.data.gemfire.wan.AsyncEventQueueWithListenerIntegrationTest
16-Feb-2019 21:43:16 [info 2019/02/16 21:43:16.648 UTC <main> tid=0x1] Loaded default TestExecutionListener class names from location [META-INF/spring.factories]: [org.springframework.test.context.web.ServletTestExecutionListener, org.springframework.test.context.support.DirtiesContextBeforeModesTestExecutionListener, org.springframework.test.context.support.DependencyInjectionTestExecutionListener, org.springframework.test.context.support.DirtiesContextTestExecutionListener, org.springframework.test.context.transaction.TransactionalTestExecutionListener, org.springframework.test.context.jdbc.SqlScriptsTestExecutionListener]
16-Feb-2019 21:43:16
16-Feb-2019 21:43:16 [info 2019/02/16 21:43:16.659 UTC <main> tid=0x1] Using TestExecutionListeners: [org.springframework.test.context.support.DirtiesContextBeforeModesTestExecutionListener@1b11171f, org.springframework.test.context.support.DependencyInjectionTestExecutionListener@1151e434, org.springframework.test.context.support.DirtiesContextTestExecutionListener@2dc54ad4, org.springframework.test.context.transaction.TransactionalTestExecutionListener@4659191b, org.springframework.test.context.jdbc.SqlScriptsTestExecutionListener@55634720]
16-Feb-2019 21:43:16
16-Feb-2019 21:43:16 [info 2019/02/16 21:43:16.944 UTC <main> tid=0x1] Replacing the [gemfireCache] bean definition having type [org.springframework.data.gemfire.CacheFactoryBean] with mock [org.springframework.data.gemfire.test.MockCacheFactoryBean]...
16-Feb-2019 21:43:16
16-Feb-2019 21:43:17 [info 2019/02/16 21:43:17.409 UTC <main> tid=0x1] Connected to Distributed System [AsyncEventQueueWithListenerTest] as Member [null] in Group(s) [[]] with Role(s) [[]] on Host [mockDistributedMember.host] having PID [0]
16-Feb-2019 21:43:17
16-Feb-2019 21:43:17 [info 2019/02/16 21:43:17.421 UTC <main> tid=0x1] Found existing Pivotal GemFire version [9.7.0] Cache [AsyncEventQueueWithListenerTest]
16-Feb-2019 21:43:17
16-Feb-2019 21:43:17 org.springframework.data.gemfire.wan.AsyncEventQueueWithListenerIntegrationTest$TestAsyncEventListener initialized!
16-Feb-2019 21:43:17 org.springframework.data.gemfire.wan.AsyncEventQueueWithListenerIntegrationTest$TestAsyncEventListener initialized!
16-Feb-2019 21:43:17 [INFO] Tests run: 3, Failures: 0, Errors: 0, Skipped: 0, Time elapsed: 1.605 s - in org.springframework.data.gemfire.wan.AsyncEventQueueWithListenerIntegrationTest
16-Feb-2019 21:43:17 [info 2019/02/16 21:43:17.516 UTC <Thread-1> tid=0xe] Invocation of destroy method failed on bean with name 'gemfireCache': org.apache.geode.cache.CacheClosedException: A cache has not yet been created.
16-Feb-2019 21:43:17
16-Feb-2019 21:43:18 [INFO] Running org.springframework.data.gemfire.wan.GatewayReceiverFactoryBeanTest
16-Feb-2019 21:43:19 [INFO] Tests run: 2, Failures: 0, Errors: 0, Skipped: 0, Time elapsed: 1.153 s - in org.springframework.data.gemfire.wan.GatewayReceiverFactoryBeanTest
16-Feb-2019 21:43:19 [INFO] Running org.springframework.data.gemfire.wan.GatewaySenderFactoryBeanTest
16-Feb-2019 21:43:20 [INFO] Tests run: 7, Failures: 0, Errors: 0, Skipped: 0, Time elapsed: 1.146 s - in org.springframework.data.gemfire.wan.GatewaySenderFactoryBeanTest
16-Feb-2019 21:43:21 [INFO] Running org.springframework.data.gemfire.wan.CachePartitionRegionWithConcurrentParallelAsyncEventQueueAndGatewaySenderIntegrationTest
16-Feb-2019 21:43:22 [info 2019/02/16 21:43:22.162 UTC <main> tid=0x1] Detected default resource location "classpath:org/springframework/data/gemfire/wan/CachePartitionRegionWithConcurrentParallelAsyncEventQueueAndGatewaySenderIntegrationTest-context.xml" for test class [org.springframework.data.gemfire.wan.CachePartitionRegionWithConcurrentParallelAsyncEventQueueAndGatewaySenderIntegrationTest]
16-Feb-2019 21:43:22
16-Feb-2019 21:43:22 [info 2019/02/16 21:43:22.166 UTC <main> tid=0x1] GenericXmlContextLoader detected default locations for context configuration [ContextConfigurationAttributes@4d465b11 declaringClass = 'org.springframework.data.gemfire.wan.CachePartitionRegionWithConcurrentParallelAsyncEventQueueAndGatewaySenderIntegrationTest', classes = '{}', locations = '{classpath:org/springframework/data/gemfire/wan/CachePartitionRegionWithConcurrentParallelAsyncEventQueueAndGatewaySenderIntegrationTest-context.xml}', inheritLocations = true, initializers = '{}', inheritInitializers = true, name = [null], contextLoaderClass = 'org.springframework.test.context.ContextLoader'].
16-Feb-2019 21:43:22
16-Feb-2019 21:43:22 [info 2019/02/16 21:43:22.167 UTC <main> tid=0x1] Could not detect default configuration classes for test class [org.springframework.data.gemfire.wan.CachePartitionRegionWithConcurrentParallelAsyncEventQueueAndGatewaySenderIntegrationTest]: CachePartitionRegionWithConcurrentParallelAsyncEventQueueAndGatewaySenderIntegrationTest does not declare any static, non-private, non-final, nested classes annotated with @Configuration.
16-Feb-2019 21:43:22
16-Feb-2019 21:43:22 [info 2019/02/16 21:43:22.181 UTC <main> tid=0x1] Loaded default TestExecutionListener class names from location [META-INF/spring.factories]: [org.springframework.test.context.web.ServletTestExecutionListener, org.springframework.test.context.support.DirtiesContextBeforeModesTestExecutionListener, org.springframework.test.context.support.DependencyInjectionTestExecutionListener, org.springframework.test.context.support.DirtiesContextTestExecutionListener, org.springframework.test.context.transaction.TransactionalTestExecutionListener, org.springframework.test.context.jdbc.SqlScriptsTestExecutionListener]
16-Feb-2019 21:43:22
16-Feb-2019 21:43:22 [info 2019/02/16 21:43:22.190 UTC <main> tid=0x1] Using TestExecutionListeners: [org.springframework.test.context.support.DirtiesContextBeforeModesTestExecutionListener@783a467b, org.springframework.test.context.support.DependencyInjectionTestExecutionListener@272113c4, org.springframework.test.context.support.DirtiesContextTestExecutionListener@73e9cf30, org.springframework.test.context.transaction.TransactionalTestExecutionListener@771a660, org.springframework.test.context.jdbc.SqlScriptsTestExecutionListener@2d52216b]
16-Feb-2019 21:43:22
16-Feb-2019 21:43:24 [INFO] Tests run: 3, Failures: 0, Errors: 0, Skipped: 0, Time elapsed: 2.892 s - in org.springframework.data.gemfire.wan.CachePartitionRegionWithConcurrentParallelAsyncEventQueueAndGatewaySenderIntegrationTest
16-Feb-2019 21:43:25 [INFO] Running org.springframework.data.gemfire.search.lucene.support.LucenePageUnitTests
16-Feb-2019 21:43:26 [INFO] Tests run: 20, Failures: 0, Errors: 0, Skipped: 0, Time elapsed: 0.699 s - in org.springframework.data.gemfire.search.lucene.support.LucenePageUnitTests
16-Feb-2019 21:43:26 [INFO] Running org.springframework.data.gemfire.search.lucene.support.PdxInstanceMethodInterceptorUnitTests
16-Feb-2019 21:43:27 [INFO] Tests run: 10, Failures: 0, Errors: 0, Skipped: 0, Time elapsed: 1.178 s - in org.springframework.data.gemfire.search.lucene.support.PdxInstanceMethodInterceptorUnitTests
16-Feb-2019 21:43:28 [INFO] Running org.springframework.data.gemfire.search.lucene.support.PdxInstanceMethodInterceptorFactoryUnitTests
16-Feb-2019 21:43:29 [INFO] Tests run: 3, Failures: 0, Errors: 0, Skipped: 0, Time elapsed: 0.467 s - in org.springframework.data.gemfire.search.lucene.support.PdxInstanceMethodInterceptorFactoryUnitTests
16-Feb-2019 21:43:29 [INFO] Running org.springframework.data.gemfire.search.lucene.ProjectingLuceneOperationsUnitTests
16-Feb-2019 21:43:30 [INFO] Tests run: 2, Failures: 0, Errors: 0, Skipped: 0, Time elapsed: 0.495 s - in org.springframework.data.gemfire.search.lucene.ProjectingLuceneOperationsUnitTests
16-Feb-2019 21:43:30 [INFO] Running org.springframework.data.gemfire.search.lucene.LuceneAccessorUnitTests
16-Feb-2019 21:43:31 [INFO] Tests run: 17, Failures: 0, Errors: 0, Skipped: 0, Time elapsed: 0.745 s - in org.springframework.data.gemfire.search.lucene.LuceneAccessorUnitTests
16-Feb-2019 21:43:31 [INFO] Running org.springframework.data.gemfire.search.lucene.LuceneOperationsIntegrationTests
16-Feb-2019 21:43:32 [info 2019/02/16 21:43:32.601 UTC <main> tid=0x1] Could not detect default resource locations for test class [org.springframework.data.gemfire.search.lucene.LuceneOperationsIntegrationTests]: no resource found for suffixes {-context.xml}.
16-Feb-2019 21:43:32
16-Feb-2019 21:43:32 [info 2019/02/16 21:43:32.612 UTC <main> tid=0x1] AnnotationConfigContextLoader detected default configuration classes for context configuration [ContextConfigurationAttributes@1af2d44a declaringClass = 'org.springframework.data.gemfire.search.lucene.LuceneOperationsIntegrationTests', classes = '{class org.springframework.data.gemfire.search.lucene.LuceneOperationsIntegrationTests$TestConfiguration}', locations = '{}', inheritLocations = true, initializers = '{}', inheritInitializers = true, name = [null], contextLoaderClass = 'org.springframework.test.context.ContextLoader'].
16-Feb-2019 21:43:32
16-Feb-2019 21:43:32 [info 2019/02/16 21:43:32.626 UTC <main> tid=0x1] Loaded default TestExecutionListener class names from location [META-INF/spring.factories]: [org.springframework.test.context.web.ServletTestExecutionListener, org.springframework.test.context.support.DirtiesContextBeforeModesTestExecutionListener, org.springframework.test.context.support.DependencyInjectionTestExecutionListener, org.springframework.test.context.support.DirtiesContextTestExecutionListener, org.springframework.test.context.transaction.TransactionalTestExecutionListener, org.springframework.test.context.jdbc.SqlScriptsTestExecutionListener]
16-Feb-2019 21:43:32
16-Feb-2019 21:43:32 [info 2019/02/16 21:43:32.635 UTC <main> tid=0x1] Using TestExecutionListeners: [org.springframework.test.context.support.DirtiesContextBeforeModesTestExecutionListener@4a883b15, org.springframework.test.context.support.DependencyInjectionTestExecutionListener@25641d39, org.springframework.test.context.support.DirtiesContextTestExecutionListener@7b36aa0c, org.springframework.test.context.transaction.TransactionalTestExecutionListener@5824a83d, org.springframework.test.context.jdbc.SqlScriptsTestExecutionListener@537f60bf]
16-Feb-2019 21:43:32
16-Feb-2019 21:43:35 [INFO] Tests run: 2, Failures: 0, Errors: 0, Skipped: 0, Time elapsed: 3.744 s - in org.springframework.data.gemfire.search.lucene.LuceneOperationsIntegrationTests
16-Feb-2019 21:43:37 [INFO] Running org.springframework.data.gemfire.search.lucene.LuceneTemplateUnitTests
16-Feb-2019 21:43:37 [INFO] Tests run: 8, Failures: 0, Errors: 0, Skipped: 0, Time elapsed: 0.718 s - in org.springframework.data.gemfire.search.lucene.LuceneTemplateUnitTests
16-Feb-2019 21:43:38 [INFO] Running org.springframework.data.gemfire.search.lucene.LuceneServiceFactoryBeanUnitTests
16-Feb-2019 21:43:39 [INFO] Tests run: 6, Failures: 0, Errors: 0, Skipped: 0, Time elapsed: 1.228 s - in org.springframework.data.gemfire.search.lucene.LuceneServiceFactoryBeanUnitTests
16-Feb-2019 21:43:40 [INFO] Running org.springframework.data.gemfire.search.lucene.ProjectingLuceneTemplateUnitTests
16-Feb-2019 21:43:40 [INFO] Tests run: 2, Failures: 0, Errors: 0, Skipped: 0, Time elapsed: 0.656 s - in org.springframework.data.gemfire.search.lucene.ProjectingLuceneTemplateUnitTests
16-Feb-2019 21:43:41 [INFO] Running org.springframework.data.gemfire.search.lucene.LuceneOperationsUnitTests
16-Feb-2019 21:43:41 [INFO] Tests run: 6, Failures: 0, Errors: 0, Skipped: 0, Time elapsed: 0.491 s - in org.springframework.data.gemfire.search.lucene.LuceneOperationsUnitTests
16-Feb-2019 21:43:42 [INFO] Running org.springframework.data.gemfire.search.lucene.ProjectingLuceneAccessorUnitTests
16-Feb-2019 21:43:43 [INFO] Tests run: 5, Failures: 0, Errors: 0, Skipped: 0, Time elapsed: 1.417 s - in org.springframework.data.gemfire.search.lucene.ProjectingLuceneAccessorUnitTests
16-Feb-2019 21:43:44 [INFO] Running org.springframework.data.gemfire.search.lucene.LuceneIndexFactoryBeanUnitTests
16-Feb-2019 21:43:45 [INFO] Tests run: 41, Failures: 0, Errors: 0, Skipped: 0, Time elapsed: 1.453 s - in org.springframework.data.gemfire.search.lucene.LuceneIndexFactoryBeanUnitTests
16-Feb-2019 21:43:46 [INFO] Running org.springframework.data.gemfire.CacheClusterConfigurationIntegrationTest
16-Feb-2019 21:43:47 [FORK] - [info 2019/02/16 21:43:47.549 UTC <main> tid=0x1] Starting peer location for Distribution Locator on bamboo-10.af.pivotal.io[37763]
16-Feb-2019 21:43:47 [FORK] -
16-Feb-2019 21:43:47 [FORK] - [info 2019/02/16 21:43:47.553 UTC <main> tid=0x1] Starting Distribution Locator on bamboo-10.af.pivotal.io[37763]
16-Feb-2019 21:43:47 [FORK] -
16-Feb-2019 21:43:47 [FORK] - [info 2019/02/16 21:43:47.557 UTC <main> tid=0x1] Locator was created at Sat Feb 16 21:43:47 UTC 2019
16-Feb-2019 21:43:47 [FORK] -
16-Feb-2019 21:43:47 [FORK] - [info 2019/02/16 21:43:47.558 UTC <main> tid=0x1] Listening on port 37763 bound on address 0.0.0.0/0.0.0.0
16-Feb-2019 21:43:47 [FORK] -
16-Feb-2019 21:43:47 [FORK] - [info 2019/02/16 21:43:47.559 UTC <main> tid=0x1] GemFire peer location service starting.  Other locators:   Locators preferred as coordinators: true  Network partition detection enabled: true  View persistence file: /opt/bamboo-home/xml-data/build-dir/SGF-NJDK8-JOB1/clusterconfiglocator/locator37763view.dat
16-Feb-2019 21:43:47 [FORK] -
16-Feb-2019 21:43:47 [FORK] - [info 2019/02/16 21:43:47.559 UTC <main> tid=0x1] recovery file not found: /opt/bamboo-home/xml-data/build-dir/SGF-NJDK8-JOB1/clusterconfiglocator/locator37763view.dat
16-Feb-2019 21:43:47 [FORK] -
16-Feb-2019 21:43:47 [FORK] - [info 2019/02/16 21:43:47.562 UTC <main> tid=0x1] Starting distributed system
16-Feb-2019 21:43:47 [FORK] -
16-Feb-2019 21:43:54 Feb 16, 2019 9:43:54 PM org.springframework.data.gemfire.process.ProcessWrapper shutdown
16-Feb-2019 21:43:54 INFO: Stopping process [29856]...
16-Feb-2019 21:43:54
16-Feb-2019 21:43:55 [WARNING] Tests run: 2, Failures: 0, Errors: 0, Skipped: 1, Time elapsed: 8.995 s - in org.springframework.data.gemfire.CacheClusterConfigurationIntegrationTest
16-Feb-2019 21:43:55 [INFO] Running org.springframework.data.gemfire.SubRegionIntegrationTest
16-Feb-2019 21:43:56 [info 2019/02/16 21:43:56.516 UTC <main> tid=0x1] Loaded default TestExecutionListener class names from location [META-INF/spring.factories]: [org.springframework.test.context.web.ServletTestExecutionListener, org.springframework.test.context.support.DirtiesContextBeforeModesTestExecutionListener, org.springframework.test.context.support.DependencyInjectionTestExecutionListener, org.springframework.test.context.support.DirtiesContextTestExecutionListener, org.springframework.test.context.transaction.TransactionalTestExecutionListener, org.springframework.test.context.jdbc.SqlScriptsTestExecutionListener]
16-Feb-2019 21:43:56
16-Feb-2019 21:43:56 [info 2019/02/16 21:43:56.528 UTC <main> tid=0x1] Using TestExecutionListeners: [org.springframework.test.context.support.DirtiesContextBeforeModesTestExecutionListener@4efac082, org.springframework.test.context.support.DependencyInjectionTestExecutionListener@6bd61f98, org.springframework.test.context.support.DirtiesContextTestExecutionListener@48aca48b, org.springframework.test.context.transaction.TransactionalTestExecutionListener@13fd2ccd, org.springframework.test.context.jdbc.SqlScriptsTestExecutionListener@b9b00e0]
16-Feb-2019 21:43:56
16-Feb-2019 21:43:56 [info 2019/02/16 21:43:56.814 UTC <main> tid=0x1] Replacing the [gemfireCache] bean definition having type [org.springframework.data.gemfire.CacheFactoryBean] with mock [org.springframework.data.gemfire.test.MockCacheFactoryBean]...
16-Feb-2019 21:43:56
16-Feb-2019 21:43:57 [info 2019/02/16 21:43:57.340 UTC <main> tid=0x1] Connected to Distributed System [ComplexSubRegionConfig] as Member [null] in Group(s) [[]] with Role(s) [[]] on Host [mockDistributedMember.host] having PID [0]
16-Feb-2019 21:43:57
16-Feb-2019 21:43:57 [info 2019/02/16 21:43:57.352 UTC <main> tid=0x1] Found existing Pivotal GemFire version [9.7.0] Cache [ComplexSubRegionConfig]
16-Feb-2019 21:43:57
16-Feb-2019 21:43:57 [info 2019/02/16 21:43:57.355 UTC <main> tid=0x1] Falling back to creating Region [Customers] in Cache [ComplexSubRegionConfig]
16-Feb-2019 21:43:57
16-Feb-2019 21:43:57 [info 2019/02/16 21:43:57.522 UTC <main> tid=0x1] Created Region [Customers]
16-Feb-2019 21:43:57
16-Feb-2019 21:43:57 [info 2019/02/16 21:43:57.604 UTC <main> tid=0x1] Falling back to creating Region [Accounts] in Cache [ComplexSubRegionConfig]
16-Feb-2019 21:43:57
16-Feb-2019 21:43:57 [info 2019/02/16 21:43:57.607 UTC <main> tid=0x1] Creating Subregion [Accounts] with parent Region [Customers]
16-Feb-2019 21:43:57
16-Feb-2019 21:43:57 [INFO] Tests run: 2, Failures: 0, Errors: 0, Skipped: 0, Time elapsed: 1.928 s - in org.springframework.data.gemfire.SubRegionIntegrationTest
16-Feb-2019 21:43:57 [info 2019/02/16 21:43:57.677 UTC <Thread-1> tid=0xe] Invocation of destroy method failed on bean with name 'gemfireCache': org.apache.geode.cache.CacheClosedException: A cache has not yet been created.
16-Feb-2019 21:43:57
16-Feb-2019 21:43:58 [INFO] Running org.springframework.data.gemfire.snapshot.SnapshotServiceFactoryBeanTest
16-Feb-2019 21:43:59 [INFO] Tests run: 58, Failures: 0, Errors: 0, Skipped: 0, Time elapsed: 1.499 s - in org.springframework.data.gemfire.snapshot.SnapshotServiceFactoryBeanTest
16-Feb-2019 21:44:00 [INFO] Running org.springframework.data.gemfire.snapshot.SnapshotServiceFactoryBeanIntegrationTest
16-Feb-2019 21:44:00 [INFO] Tests run: 2, Failures: 0, Errors: 0, Skipped: 0, Time elapsed: 0.754 s - in org.springframework.data.gemfire.snapshot.SnapshotServiceFactoryBeanIntegrationTest
16-Feb-2019 21:44:01 [INFO] Running org.springframework.data.gemfire.snapshot.event.SnapshotApplicationEventTest
16-Feb-2019 21:44:02 [INFO] Tests run: 9, Failures: 0, Errors: 0, Skipped: 0, Time elapsed: 0.576 s - in org.springframework.data.gemfire.snapshot.event.SnapshotApplicationEventTest
16-Feb-2019 21:44:02 [INFO] Running org.springframework.data.gemfire.snapshot.filter.ComposableSnapshotFilterTest
16-Feb-2019 21:44:03 [INFO] Tests run: 9, Failures: 0, Errors: 0, Skipped: 0, Time elapsed: 0.419 s - in org.springframework.data.gemfire.snapshot.filter.ComposableSnapshotFilterTest
16-Feb-2019 21:44:03 [INFO] Running org.springframework.data.gemfire.snapshot.SnapshotApplicationEventTriggeredImportsExportsIntegrationTest
16-Feb-2019 21:44:04 [info 2019/02/16 21:44:04.179 UTC <main> tid=0x1] Detected default resource location "classpath:org/springframework/data/gemfire/snapshot/SnapshotApplicationEventTriggeredImportsExportsIntegrationTest-context.xml" for test class [org.springframework.data.gemfire.snapshot.SnapshotApplicationEventTriggeredImportsExportsIntegrationTest]
16-Feb-2019 21:44:04
16-Feb-2019 21:44:04 [info 2019/02/16 21:44:04.182 UTC <main> tid=0x1] GenericXmlContextLoader detected default locations for context configuration [ContextConfigurationAttributes@4d0f2471 declaringClass = 'org.springframework.data.gemfire.snapshot.SnapshotApplicationEventTriggeredImportsExportsIntegrationTest', classes = '{}', locations = '{classpath:org/springframework/data/gemfire/snapshot/SnapshotApplicationEventTriggeredImportsExportsIntegrationTest-context.xml}', inheritLocations = true, initializers = '{}', inheritInitializers = true, name = [null], contextLoaderClass = 'org.springframework.test.context.ContextLoader'].
16-Feb-2019 21:44:04
16-Feb-2019 21:44:04 [info 2019/02/16 21:44:04.184 UTC <main> tid=0x1] Could not detect default configuration classes for test class [org.springframework.data.gemfire.snapshot.SnapshotApplicationEventTriggeredImportsExportsIntegrationTest]: SnapshotApplicationEventTriggeredImportsExportsIntegrationTest does not declare any static, non-private, non-final, nested classes annotated with @Configuration.
16-Feb-2019 21:44:04
16-Feb-2019 21:44:04 [info 2019/02/16 21:44:04.198 UTC <main> tid=0x1] Loaded default TestExecutionListener class names from location [META-INF/spring.factories]: [org.springframework.test.context.web.ServletTestExecutionListener, org.springframework.test.context.support.DirtiesContextBeforeModesTestExecutionListener, org.springframework.test.context.support.DependencyInjectionTestExecutionListener, org.springframework.test.context.support.DirtiesContextTestExecutionListener, org.springframework.test.context.transaction.TransactionalTestExecutionListener, org.springframework.test.context.jdbc.SqlScriptsTestExecutionListener]
16-Feb-2019 21:44:04
16-Feb-2019 21:44:04 [info 2019/02/16 21:44:04.206 UTC <main> tid=0x1] Using TestExecutionListeners: [org.springframework.test.context.support.DirtiesContextBeforeModesTestExecutionListener@3f6f6701, org.springframework.test.context.support.DependencyInjectionTestExecutionListener@3527942a, org.springframework.test.context.support.DirtiesContextTestExecutionListener@942a29c, org.springframework.test.context.transaction.TransactionalTestExecutionListener@1ed6388a, org.springframework.test.context.jdbc.SqlScriptsTestExecutionListener@5a45133e]
16-Feb-2019 21:44:04
16-Feb-2019 21:44:04 [info 2019/02/16 21:44:04.646 UTC <main> tid=0x1] Initializing ExecutorService 'snapshotImportsMonitorScheduler'
16-Feb-2019 21:44:04
16-Feb-2019 21:44:04 [info 2019/02/16 21:44:04.646 UTC <main> tid=0x1] Bean 'snapshotImportsMonitorScheduler' of type [org.springframework.scheduling.concurrent.ThreadPoolTaskScheduler] is not eligible for getting processed by all BeanPostProcessors (for example: not eligible for auto-proxying)
16-Feb-2019 21:44:04
16-Feb-2019 21:44:06 [warn 2019/02/16 21:44:06.264 UTC <main> tid=0x1] enforce-unique-host and redundancy-zone properties have no effect for a LonerDistributedSystem.
16-Feb-2019 21:44:06
16-Feb-2019 21:44:06 [warn 2019/02/16 21:44:06.274 UTC <main> tid=0x1] enforce-unique-host and redundancy-zone properties have no effect for a LonerDistributedSystem.
16-Feb-2019 21:44:06
16-Feb-2019 21:44:06 [warn 2019/02/16 21:44:06.276 UTC <main> tid=0x1] enforce-unique-host and redundancy-zone properties have no effect for a LonerDistributedSystem.
16-Feb-2019 21:44:06
16-Feb-2019 21:44:06 [warn 2019/02/16 21:44:06.277 UTC <main> tid=0x1] enforce-unique-host and redundancy-zone properties have no effect for a LonerDistributedSystem.
16-Feb-2019 21:44:06
16-Feb-2019 21:44:06 [warn 2019/02/16 21:44:06.279 UTC <main> tid=0x1] enforce-unique-host and redundancy-zone properties have no effect for a LonerDistributedSystem.
16-Feb-2019 21:44:06
16-Feb-2019 21:44:06 [warn 2019/02/16 21:44:06.290 UTC <main> tid=0x1] enforce-unique-host and redundancy-zone properties have no effect for a LonerDistributedSystem.
16-Feb-2019 21:44:06
16-Feb-2019 21:44:06 [warn 2019/02/16 21:44:06.301 UTC <main> tid=0x1] enforce-unique-host and redundancy-zone properties have no effect for a LonerDistributedSystem.
16-Feb-2019 21:44:06
16-Feb-2019 21:44:06 [warn 2019/02/16 21:44:06.302 UTC <main> tid=0x1] enforce-unique-host and redundancy-zone properties have no effect for a LonerDistributedSystem.
16-Feb-2019 21:44:06
16-Feb-2019 21:44:06 [warn 2019/02/16 21:44:06.303 UTC <main> tid=0x1] enforce-unique-host and redundancy-zone properties have no effect for a LonerDistributedSystem.
16-Feb-2019 21:44:06
16-Feb-2019 21:44:06 [warn 2019/02/16 21:44:06.304 UTC <main> tid=0x1] enforce-unique-host and redundancy-zone properties have no effect for a LonerDistributedSystem.
16-Feb-2019 21:44:06
16-Feb-2019 21:44:06 [warn 2019/02/16 21:44:06.306 UTC <main> tid=0x1] enforce-unique-host and redundancy-zone properties have no effect for a LonerDistributedSystem.
16-Feb-2019 21:44:06
16-Feb-2019 21:44:06 [warn 2019/02/16 21:44:06.307 UTC <main> tid=0x1] enforce-unique-host and redundancy-zone properties have no effect for a LonerDistributedSystem.
16-Feb-2019 21:44:06
16-Feb-2019 21:44:06 [warn 2019/02/16 21:44:06.309 UTC <main> tid=0x1] enforce-unique-host and redundancy-zone properties have no effect for a LonerDistributedSystem.
16-Feb-2019 21:44:06
16-Feb-2019 21:44:06 [warn 2019/02/16 21:44:06.310 UTC <main> tid=0x1] enforce-unique-host and redundancy-zone properties have no effect for a LonerDistributedSystem.
16-Feb-2019 21:44:06
16-Feb-2019 21:44:06 [warn 2019/02/16 21:44:06.311 UTC <main> tid=0x1] enforce-unique-host and redundancy-zone properties have no effect for a LonerDistributedSystem.
16-Feb-2019 21:44:06
16-Feb-2019 21:44:06 [warn 2019/02/16 21:44:06.312 UTC <main> tid=0x1] enforce-unique-host and redundancy-zone properties have no effect for a LonerDistributedSystem.
16-Feb-2019 21:44:06
16-Feb-2019 21:44:06 [warn 2019/02/16 21:44:06.313 UTC <main> tid=0x1] enforce-unique-host and redundancy-zone properties have no effect for a LonerDistributedSystem.
16-Feb-2019 21:44:06
16-Feb-2019 21:44:06 [warn 2019/02/16 21:44:06.314 UTC <main> tid=0x1] enforce-unique-host and redundancy-zone properties have no effect for a LonerDistributedSystem.
16-Feb-2019 21:44:06
16-Feb-2019 21:44:06 [warn 2019/02/16 21:44:06.315 UTC <main> tid=0x1] enforce-unique-host and redundancy-zone properties have no effect for a LonerDistributedSystem.
16-Feb-2019 21:44:06
16-Feb-2019 21:44:06 [warn 2019/02/16 21:44:06.316 UTC <main> tid=0x1] enforce-unique-host and redundancy-zone properties have no effect for a LonerDistributedSystem.
16-Feb-2019 21:44:06
16-Feb-2019 21:44:06 [warn 2019/02/16 21:44:06.317 UTC <main> tid=0x1] enforce-unique-host and redundancy-zone properties have no effect for a LonerDistributedSystem.
16-Feb-2019 21:44:06
16-Feb-2019 21:44:06 [warn 2019/02/16 21:44:06.318 UTC <main> tid=0x1] enforce-unique-host and redundancy-zone properties have no effect for a LonerDistributedSystem.
16-Feb-2019 21:44:06
16-Feb-2019 21:44:06 [warn 2019/02/16 21:44:06.320 UTC <main> tid=0x1] enforce-unique-host and redundancy-zone properties have no effect for a LonerDistributedSystem.
16-Feb-2019 21:44:06
16-Feb-2019 21:44:06 [warn 2019/02/16 21:44:06.321 UTC <main> tid=0x1] enforce-unique-host and redundancy-zone properties have no effect for a LonerDistributedSystem.
16-Feb-2019 21:44:06
16-Feb-2019 21:44:06 [warn 2019/02/16 21:44:06.322 UTC <main> tid=0x1] enforce-unique-host and redundancy-zone properties have no effect for a LonerDistributedSystem.
16-Feb-2019 21:44:06
16-Feb-2019 21:44:06 [warn 2019/02/16 21:44:06.323 UTC <main> tid=0x1] enforce-unique-host and redundancy-zone properties have no effect for a LonerDistributedSystem.
16-Feb-2019 21:44:06
16-Feb-2019 21:44:06 [warn 2019/02/16 21:44:06.324 UTC <main> tid=0x1] enforce-unique-host and redundancy-zone properties have no effect for a LonerDistributedSystem.
16-Feb-2019 21:44:06
16-Feb-2019 21:44:06 [warn 2019/02/16 21:44:06.325 UTC <main> tid=0x1] enforce-unique-host and redundancy-zone properties have no effect for a LonerDistributedSystem.
16-Feb-2019 21:44:06
16-Feb-2019 21:44:06 [warn 2019/02/16 21:44:06.326 UTC <main> tid=0x1] enforce-unique-host and redundancy-zone properties have no effect for a LonerDistributedSystem.
16-Feb-2019 21:44:06
16-Feb-2019 21:44:06 [warn 2019/02/16 21:44:06.327 UTC <main> tid=0x1] enforce-unique-host and redundancy-zone properties have no effect for a LonerDistributedSystem.
16-Feb-2019 21:44:06
16-Feb-2019 21:44:06 [warn 2019/02/16 21:44:06.328 UTC <main> tid=0x1] enforce-unique-host and redundancy-zone properties have no effect for a LonerDistributedSystem.
16-Feb-2019 21:44:06
16-Feb-2019 21:44:06 [warn 2019/02/16 21:44:06.329 UTC <main> tid=0x1] enforce-unique-host and redundancy-zone properties have no effect for a LonerDistributedSystem.
16-Feb-2019 21:44:06
16-Feb-2019 21:44:06 [warn 2019/02/16 21:44:06.330 UTC <main> tid=0x1] enforce-unique-host and redundancy-zone properties have no effect for a LonerDistributedSystem.
16-Feb-2019 21:44:06
16-Feb-2019 21:44:06 [warn 2019/02/16 21:44:06.331 UTC <main> tid=0x1] enforce-unique-host and redundancy-zone properties have no effect for a LonerDistributedSystem.
16-Feb-2019 21:44:06
16-Feb-2019 21:44:06 [warn 2019/02/16 21:44:06.332 UTC <main> tid=0x1] enforce-unique-host and redundancy-zone properties have no effect for a LonerDistributedSystem.
16-Feb-2019 21:44:06
16-Feb-2019 21:44:06 [warn 2019/02/16 21:44:06.333 UTC <main> tid=0x1] enforce-unique-host and redundancy-zone properties have no effect for a LonerDistributedSystem.
16-Feb-2019 21:44:06
16-Feb-2019 21:44:06 [warn 2019/02/16 21:44:06.334 UTC <main> tid=0x1] enforce-unique-host and redundancy-zone properties have no effect for a LonerDistributedSystem.
16-Feb-2019 21:44:06
16-Feb-2019 21:44:06 [warn 2019/02/16 21:44:06.335 UTC <main> tid=0x1] enforce-unique-host and redundancy-zone properties have no effect for a LonerDistributedSystem.
16-Feb-2019 21:44:06
16-Feb-2019 21:44:06 [warn 2019/02/16 21:44:06.336 UTC <main> tid=0x1] enforce-unique-host and redundancy-zone properties have no effect for a LonerDistributedSystem.
16-Feb-2019 21:44:06
16-Feb-2019 21:44:06 [warn 2019/02/16 21:44:06.337 UTC <main> tid=0x1] enforce-unique-host and redundancy-zone properties have no effect for a LonerDistributedSystem.
16-Feb-2019 21:44:06
16-Feb-2019 21:44:06 [warn 2019/02/16 21:44:06.338 UTC <main> tid=0x1] enforce-unique-host and redundancy-zone properties have no effect for a LonerDistributedSystem.
16-Feb-2019 21:44:06
16-Feb-2019 21:44:06 [warn 2019/02/16 21:44:06.339 UTC <main> tid=0x1] enforce-unique-host and redundancy-zone properties have no effect for a LonerDistributedSystem.
16-Feb-2019 21:44:06
16-Feb-2019 21:44:06 [warn 2019/02/16 21:44:06.340 UTC <main> tid=0x1] enforce-unique-host and redundancy-zone properties have no effect for a LonerDistributedSystem.
16-Feb-2019 21:44:06
16-Feb-2019 21:44:06 [warn 2019/02/16 21:44:06.341 UTC <main> tid=0x1] enforce-unique-host and redundancy-zone properties have no effect for a LonerDistributedSystem.
16-Feb-2019 21:44:06
16-Feb-2019 21:44:06 [warn 2019/02/16 21:44:06.342 UTC <main> tid=0x1] enforce-unique-host and redundancy-zone properties have no effect for a LonerDistributedSystem.
16-Feb-2019 21:44:06
16-Feb-2019 21:44:06 [warn 2019/02/16 21:44:06.343 UTC <main> tid=0x1] enforce-unique-host and redundancy-zone properties have no effect for a LonerDistributedSystem.
16-Feb-2019 21:44:06
16-Feb-2019 21:44:06 [warn 2019/02/16 21:44:06.344 UTC <main> tid=0x1] enforce-unique-host and redundancy-zone properties have no effect for a LonerDistributedSystem.
16-Feb-2019 21:44:06
16-Feb-2019 21:44:06 [warn 2019/02/16 21:44:06.345 UTC <main> tid=0x1] enforce-unique-host and redundancy-zone properties have no effect for a LonerDistributedSystem.
16-Feb-2019 21:44:06
16-Feb-2019 21:44:06 [warn 2019/02/16 21:44:06.346 UTC <main> tid=0x1] enforce-unique-host and redundancy-zone properties have no effect for a LonerDistributedSystem.
16-Feb-2019 21:44:06
16-Feb-2019 21:44:06 [warn 2019/02/16 21:44:06.347 UTC <main> tid=0x1] enforce-unique-host and redundancy-zone properties have no effect for a LonerDistributedSystem.
16-Feb-2019 21:44:06
16-Feb-2019 21:44:06 [warn 2019/02/16 21:44:06.348 UTC <main> tid=0x1] enforce-unique-host and redundancy-zone properties have no effect for a LonerDistributedSystem.
16-Feb-2019 21:44:06
16-Feb-2019 21:44:06 [warn 2019/02/16 21:44:06.349 UTC <main> tid=0x1] enforce-unique-host and redundancy-zone properties have no effect for a LonerDistributedSystem.
16-Feb-2019 21:44:06
16-Feb-2019 21:44:06 [warn 2019/02/16 21:44:06.350 UTC <main> tid=0x1] enforce-unique-host and redundancy-zone properties have no effect for a LonerDistributedSystem.
16-Feb-2019 21:44:06
16-Feb-2019 21:44:06 [warn 2019/02/16 21:44:06.351 UTC <main> tid=0x1] enforce-unique-host and redundancy-zone properties have no effect for a LonerDistributedSystem.
16-Feb-2019 21:44:06
16-Feb-2019 21:44:06 [warn 2019/02/16 21:44:06.352 UTC <main> tid=0x1] enforce-unique-host and redundancy-zone properties have no effect for a LonerDistributedSystem.
16-Feb-2019 21:44:06
16-Feb-2019 21:44:06 [warn 2019/02/16 21:44:06.353 UTC <main> tid=0x1] enforce-unique-host and redundancy-zone properties have no effect for a LonerDistributedSystem.
16-Feb-2019 21:44:06
16-Feb-2019 21:44:06 [warn 2019/02/16 21:44:06.354 UTC <main> tid=0x1] enforce-unique-host and redundancy-zone properties have no effect for a LonerDistributedSystem.
16-Feb-2019 21:44:06
16-Feb-2019 21:44:06 [warn 2019/02/16 21:44:06.355 UTC <main> tid=0x1] enforce-unique-host and redundancy-zone properties have no effect for a LonerDistributedSystem.
16-Feb-2019 21:44:06
16-Feb-2019 21:44:06 [warn 2019/02/16 21:44:06.356 UTC <main> tid=0x1] enforce-unique-host and redundancy-zone properties have no effect for a LonerDistributedSystem.
16-Feb-2019 21:44:06
16-Feb-2019 21:44:06 [warn 2019/02/16 21:44:06.357 UTC <main> tid=0x1] enforce-unique-host and redundancy-zone properties have no effect for a LonerDistributedSystem.
16-Feb-2019 21:44:06
16-Feb-2019 21:44:06 [warn 2019/02/16 21:44:06.358 UTC <main> tid=0x1] enforce-unique-host and redundancy-zone properties have no effect for a LonerDistributedSystem.
16-Feb-2019 21:44:06
16-Feb-2019 21:44:06 [warn 2019/02/16 21:44:06.359 UTC <main> tid=0x1] enforce-unique-host and redundancy-zone properties have no effect for a LonerDistributedSystem.
16-Feb-2019 21:44:06
16-Feb-2019 21:44:06 [warn 2019/02/16 21:44:06.360 UTC <main> tid=0x1] enforce-unique-host and redundancy-zone properties have no effect for a LonerDistributedSystem.
16-Feb-2019 21:44:06
16-Feb-2019 21:44:06 [warn 2019/02/16 21:44:06.360 UTC <main> tid=0x1] enforce-unique-host and redundancy-zone properties have no effect for a LonerDistributedSystem.
16-Feb-2019 21:44:06
16-Feb-2019 21:44:06 [warn 2019/02/16 21:44:06.361 UTC <main> tid=0x1] enforce-unique-host and redundancy-zone properties have no effect for a LonerDistributedSystem.
16-Feb-2019 21:44:06
16-Feb-2019 21:44:06 [warn 2019/02/16 21:44:06.362 UTC <main> tid=0x1] enforce-unique-host and redundancy-zone properties have no effect for a LonerDistributedSystem.
16-Feb-2019 21:44:06
16-Feb-2019 21:44:06 [warn 2019/02/16 21:44:06.363 UTC <main> tid=0x1] enforce-unique-host and redundancy-zone properties have no effect for a LonerDistributedSystem.
16-Feb-2019 21:44:06
16-Feb-2019 21:44:06 [warn 2019/02/16 21:44:06.364 UTC <main> tid=0x1] enforce-unique-host and redundancy-zone properties have no effect for a LonerDistributedSystem.
16-Feb-2019 21:44:06
16-Feb-2019 21:44:06 [warn 2019/02/16 21:44:06.365 UTC <main> tid=0x1] enforce-unique-host and redundancy-zone properties have no effect for a LonerDistributedSystem.
16-Feb-2019 21:44:06
16-Feb-2019 21:44:06 [warn 2019/02/16 21:44:06.366 UTC <main> tid=0x1] enforce-unique-host and redundancy-zone properties have no effect for a LonerDistributedSystem.
16-Feb-2019 21:44:06
16-Feb-2019 21:44:06 [warn 2019/02/16 21:44:06.367 UTC <main> tid=0x1] enforce-unique-host and redundancy-zone properties have no effect for a LonerDistributedSystem.
16-Feb-2019 21:44:06
16-Feb-2019 21:44:06 [warn 2019/02/16 21:44:06.368 UTC <main> tid=0x1] enforce-unique-host and redundancy-zone properties have no effect for a LonerDistributedSystem.
16-Feb-2019 21:44:06
16-Feb-2019 21:44:06 [warn 2019/02/16 21:44:06.369 UTC <main> tid=0x1] enforce-unique-host and redundancy-zone properties have no effect for a LonerDistributedSystem.
16-Feb-2019 21:44:06
16-Feb-2019 21:44:06 [warn 2019/02/16 21:44:06.369 UTC <main> tid=0x1] enforce-unique-host and redundancy-zone properties have no effect for a LonerDistributedSystem.
16-Feb-2019 21:44:06
16-Feb-2019 21:44:06 [warn 2019/02/16 21:44:06.370 UTC <main> tid=0x1] enforce-unique-host and redundancy-zone properties have no effect for a LonerDistributedSystem.
16-Feb-2019 21:44:06
16-Feb-2019 21:44:06 [warn 2019/02/16 21:44:06.371 UTC <main> tid=0x1] enforce-unique-host and redundancy-zone properties have no effect for a LonerDistributedSystem.
16-Feb-2019 21:44:06
16-Feb-2019 21:44:06 [warn 2019/02/16 21:44:06.372 UTC <main> tid=0x1] enforce-unique-host and redundancy-zone properties have no effect for a LonerDistributedSystem.
16-Feb-2019 21:44:06
16-Feb-2019 21:44:06 [warn 2019/02/16 21:44:06.373 UTC <main> tid=0x1] enforce-unique-host and redundancy-zone properties have no effect for a LonerDistributedSystem.
16-Feb-2019 21:44:06
16-Feb-2019 21:44:06 [warn 2019/02/16 21:44:06.374 UTC <main> tid=0x1] enforce-unique-host and redundancy-zone properties have no effect for a LonerDistributedSystem.
16-Feb-2019 21:44:06
16-Feb-2019 21:44:06 [warn 2019/02/16 21:44:06.375 UTC <main> tid=0x1] enforce-unique-host and redundancy-zone properties have no effect for a LonerDistributedSystem.
16-Feb-2019 21:44:06
16-Feb-2019 21:44:06 [warn 2019/02/16 21:44:06.376 UTC <main> tid=0x1] enforce-unique-host and redundancy-zone properties have no effect for a LonerDistributedSystem.
16-Feb-2019 21:44:06
16-Feb-2019 21:44:06 [warn 2019/02/16 21:44:06.377 UTC <main> tid=0x1] enforce-unique-host and redundancy-zone properties have no effect for a LonerDistributedSystem.
16-Feb-2019 21:44:06
16-Feb-2019 21:44:06 [warn 2019/02/16 21:44:06.378 UTC <main> tid=0x1] enforce-unique-host and redundancy-zone properties have no effect for a LonerDistributedSystem.
16-Feb-2019 21:44:06
16-Feb-2019 21:44:06 [warn 2019/02/16 21:44:06.378 UTC <main> tid=0x1] enforce-unique-host and redundancy-zone properties have no effect for a LonerDistributedSystem.
16-Feb-2019 21:44:06
16-Feb-2019 21:44:06 [warn 2019/02/16 21:44:06.379 UTC <main> tid=0x1] enforce-unique-host and redundancy-zone properties have no effect for a LonerDistributedSystem.
16-Feb-2019 21:44:06
16-Feb-2019 21:44:06 [warn 2019/02/16 21:44:06.380 UTC <main> tid=0x1] enforce-unique-host and redundancy-zone properties have no effect for a LonerDistributedSystem.
16-Feb-2019 21:44:06
16-Feb-2019 21:44:06 [warn 2019/02/16 21:44:06.381 UTC <main> tid=0x1] enforce-unique-host and redundancy-zone properties have no effect for a LonerDistributedSystem.
16-Feb-2019 21:44:06
16-Feb-2019 21:44:06 [warn 2019/02/16 21:44:06.382 UTC <main> tid=0x1] enforce-unique-host and redundancy-zone properties have no effect for a LonerDistributedSystem.
16-Feb-2019 21:44:06
16-Feb-2019 21:44:06 [warn 2019/02/16 21:44:06.383 UTC <main> tid=0x1] enforce-unique-host and redundancy-zone properties have no effect for a LonerDistributedSystem.
16-Feb-2019 21:44:06
16-Feb-2019 21:44:06 [warn 2019/02/16 21:44:06.384 UTC <main> tid=0x1] enforce-unique-host and redundancy-zone properties have no effect for a LonerDistributedSystem.
16-Feb-2019 21:44:06
16-Feb-2019 21:44:06 [warn 2019/02/16 21:44:06.385 UTC <main> tid=0x1] enforce-unique-host and redundancy-zone properties have no effect for a LonerDistributedSystem.
16-Feb-2019 21:44:06
16-Feb-2019 21:44:06 [warn 2019/02/16 21:44:06.386 UTC <main> tid=0x1] enforce-unique-host and redundancy-zone properties have no effect for a LonerDistributedSystem.
16-Feb-2019 21:44:06
16-Feb-2019 21:44:06 [warn 2019/02/16 21:44:06.387 UTC <main> tid=0x1] enforce-unique-host and redundancy-zone properties have no effect for a LonerDistributedSystem.
16-Feb-2019 21:44:06
16-Feb-2019 21:44:06 [warn 2019/02/16 21:44:06.388 UTC <main> tid=0x1] enforce-unique-host and redundancy-zone properties have no effect for a LonerDistributedSystem.
16-Feb-2019 21:44:06
16-Feb-2019 21:44:06 [warn 2019/02/16 21:44:06.388 UTC <main> tid=0x1] enforce-unique-host and redundancy-zone properties have no effect for a LonerDistributedSystem.
16-Feb-2019 21:44:06
16-Feb-2019 21:44:06 [warn 2019/02/16 21:44:06.389 UTC <main> tid=0x1] enforce-unique-host and redundancy-zone properties have no effect for a LonerDistributedSystem.
16-Feb-2019 21:44:06
16-Feb-2019 21:44:06 [warn 2019/02/16 21:44:06.390 UTC <main> tid=0x1] enforce-unique-host and redundancy-zone properties have no effect for a LonerDistributedSystem.
16-Feb-2019 21:44:06
16-Feb-2019 21:44:06 [warn 2019/02/16 21:44:06.391 UTC <main> tid=0x1] enforce-unique-host and redundancy-zone properties have no effect for a LonerDistributedSystem.
16-Feb-2019 21:44:06
16-Feb-2019 21:44:06 [warn 2019/02/16 21:44:06.392 UTC <main> tid=0x1] enforce-unique-host and redundancy-zone properties have no effect for a LonerDistributedSystem.
16-Feb-2019 21:44:06
16-Feb-2019 21:44:06 [warn 2019/02/16 21:44:06.393 UTC <main> tid=0x1] enforce-unique-host and redundancy-zone properties have no effect for a LonerDistributedSystem.
16-Feb-2019 21:44:06
16-Feb-2019 21:44:06 [warn 2019/02/16 21:44:06.394 UTC <main> tid=0x1] enforce-unique-host and redundancy-zone properties have no effect for a LonerDistributedSystem.
16-Feb-2019 21:44:06
16-Feb-2019 21:44:06 [warn 2019/02/16 21:44:06.395 UTC <main> tid=0x1] enforce-unique-host and redundancy-zone properties have no effect for a LonerDistributedSystem.
16-Feb-2019 21:44:06
16-Feb-2019 21:44:06 [warn 2019/02/16 21:44:06.396 UTC <main> tid=0x1] enforce-unique-host and redundancy-zone properties have no effect for a LonerDistributedSystem.
16-Feb-2019 21:44:06
16-Feb-2019 21:44:06 [warn 2019/02/16 21:44:06.396 UTC <main> tid=0x1] enforce-unique-host and redundancy-zone properties have no effect for a LonerDistributedSystem.
16-Feb-2019 21:44:06
16-Feb-2019 21:44:06 [warn 2019/02/16 21:44:06.397 UTC <main> tid=0x1] enforce-unique-host and redundancy-zone properties have no effect for a LonerDistributedSystem.
16-Feb-2019 21:44:06
16-Feb-2019 21:44:06 [warn 2019/02/16 21:44:06.398 UTC <main> tid=0x1] enforce-unique-host and redundancy-zone properties have no effect for a LonerDistributedSystem.
16-Feb-2019 21:44:06
16-Feb-2019 21:44:06 [warn 2019/02/16 21:44:06.399 UTC <main> tid=0x1] enforce-unique-host and redundancy-zone properties have no effect for a LonerDistributedSystem.
16-Feb-2019 21:44:06
16-Feb-2019 21:44:06 [warn 2019/02/16 21:44:06.400 UTC <main> tid=0x1] enforce-unique-host and redundancy-zone properties have no effect for a LonerDistributedSystem.
16-Feb-2019 21:44:06
16-Feb-2019 21:44:06 [warn 2019/02/16 21:44:06.401 UTC <main> tid=0x1] enforce-unique-host and redundancy-zone properties have no effect for a LonerDistributedSystem.
16-Feb-2019 21:44:06
16-Feb-2019 21:44:06 [warn 2019/02/16 21:44:06.402 UTC <main> tid=0x1] enforce-unique-host and redundancy-zone properties have no effect for a LonerDistributedSystem.
16-Feb-2019 21:44:06
16-Feb-2019 21:44:06 [warn 2019/02/16 21:44:06.403 UTC <main> tid=0x1] enforce-unique-host and redundancy-zone properties have no effect for a LonerDistributedSystem.
16-Feb-2019 21:44:06
16-Feb-2019 21:44:06 [warn 2019/02/16 21:44:06.404 UTC <main> tid=0x1] enforce-unique-host and redundancy-zone properties have no effect for a LonerDistributedSystem.
16-Feb-2019 21:44:06
16-Feb-2019 21:44:06 [warn 2019/02/16 21:44:06.404 UTC <main> tid=0x1] enforce-unique-host and redundancy-zone properties have no effect for a LonerDistributedSystem.
16-Feb-2019 21:44:06
16-Feb-2019 21:44:07 [warn 2019/02/16 21:44:07.246 UTC <snapshotImportsMonitorScheduler-1> tid=0x25] enforce-unique-host and redundancy-zone properties have no effect for a LonerDistributedSystem.
16-Feb-2019 21:44:07
16-Feb-2019 21:44:07 [warn 2019/02/16 21:44:07.248 UTC <snapshotImportsMonitorScheduler-1> tid=0x25] enforce-unique-host and redundancy-zone properties have no effect for a LonerDistributedSystem.
16-Feb-2019 21:44:07
16-Feb-2019 21:44:07 [warn 2019/02/16 21:44:07.252 UTC <snapshotImportsMonitorScheduler-1> tid=0x25] enforce-unique-host and redundancy-zone properties have no effect for a LonerDistributedSystem.
16-Feb-2019 21:44:07
16-Feb-2019 21:44:07 [warn 2019/02/16 21:44:07.253 UTC <snapshotImportsMonitorScheduler-1> tid=0x25] enforce-unique-host and redundancy-zone properties have no effect for a LonerDistributedSystem.
16-Feb-2019 21:44:07
16-Feb-2019 21:44:07 [warn 2019/02/16 21:44:07.256 UTC <snapshotImportsMonitorScheduler-1> tid=0x25] enforce-unique-host and redundancy-zone properties have no effect for a LonerDistributedSystem.
16-Feb-2019 21:44:07
16-Feb-2019 21:44:08 [warn 2019/02/16 21:44:08.260 UTC <snapshotImportsMonitorScheduler-1> tid=0x25] enforce-unique-host and redundancy-zone properties have no effect for a LonerDistributedSystem.
16-Feb-2019 21:44:08
16-Feb-2019 21:44:08 [warn 2019/02/16 21:44:08.264 UTC <snapshotImportsMonitorScheduler-1> tid=0x25] enforce-unique-host and redundancy-zone properties have no effect for a LonerDistributedSystem.
16-Feb-2019 21:44:08
16-Feb-2019 21:44:08 [warn 2019/02/16 21:44:08.271 UTC <snapshotImportsMonitorScheduler-1> tid=0x25] enforce-unique-host and redundancy-zone properties have no effect for a LonerDistributedSystem.
16-Feb-2019 21:44:08
16-Feb-2019 21:44:08 [warn 2019/02/16 21:44:08.278 UTC <snapshotImportsMonitorScheduler-1> tid=0x25] enforce-unique-host and redundancy-zone properties have no effect for a LonerDistributedSystem.
16-Feb-2019 21:44:08
16-Feb-2019 21:44:08 [warn 2019/02/16 21:44:08.279 UTC <snapshotImportsMonitorScheduler-1> tid=0x25] enforce-unique-host and redundancy-zone properties have no effect for a LonerDistributedSystem.
16-Feb-2019 21:44:08
16-Feb-2019 21:44:08 [warn 2019/02/16 21:44:08.284 UTC <snapshotImportsMonitorScheduler-1> tid=0x25] enforce-unique-host and redundancy-zone properties have no effect for a LonerDistributedSystem.
16-Feb-2019 21:44:08
16-Feb-2019 21:44:08 [warn 2019/02/16 21:44:08.285 UTC <snapshotImportsMonitorScheduler-1> tid=0x25] enforce-unique-host and redundancy-zone properties have no effect for a LonerDistributedSystem.
16-Feb-2019 21:44:08
16-Feb-2019 21:44:09 [warn 2019/02/16 21:44:09.290 UTC <snapshotImportsMonitorScheduler-1> tid=0x25] enforce-unique-host and redundancy-zone properties have no effect for a LonerDistributedSystem.
16-Feb-2019 21:44:09
16-Feb-2019 21:44:09 [warn 2019/02/16 21:44:09.293 UTC <snapshotImportsMonitorScheduler-1> tid=0x25] enforce-unique-host and redundancy-zone properties have no effect for a LonerDistributedSystem.
16-Feb-2019 21:44:09
16-Feb-2019 21:44:09 [warn 2019/02/16 21:44:09.294 UTC <snapshotImportsMonitorScheduler-1> tid=0x25] enforce-unique-host and redundancy-zone properties have no effect for a LonerDistributedSystem.
16-Feb-2019 21:44:09
16-Feb-2019 21:44:09 [warn 2019/02/16 21:44:09.298 UTC <snapshotImportsMonitorScheduler-1> tid=0x25] enforce-unique-host and redundancy-zone properties have no effect for a LonerDistributedSystem.
16-Feb-2019 21:44:09
16-Feb-2019 21:44:09 [INFO] Tests run: 1, Failures: 0, Errors: 0, Skipped: 0, Time elapsed: 6.028 s - in org.springframework.data.gemfire.snapshot.SnapshotApplicationEventTriggeredImportsExportsIntegrationTest
16-Feb-2019 21:44:10 [INFO] Running org.springframework.data.gemfire.snapshot.SnapshotServiceImportExportIntegrationTest
16-Feb-2019 21:44:12 [warn 2019/02/16 21:44:12.635 UTC <main> tid=0x1] enforce-unique-host and redundancy-zone properties have no effect for a LonerDistributedSystem.
16-Feb-2019 21:44:12
16-Feb-2019 21:44:12 [warn 2019/02/16 21:44:12.643 UTC <main> tid=0x1] enforce-unique-host and redundancy-zone properties have no effect for a LonerDistributedSystem.
16-Feb-2019 21:44:12
16-Feb-2019 21:44:12 [warn 2019/02/16 21:44:12.645 UTC <main> tid=0x1] enforce-unique-host and redundancy-zone properties have no effect for a LonerDistributedSystem.
16-Feb-2019 21:44:12
16-Feb-2019 21:44:12 [warn 2019/02/16 21:44:12.646 UTC <main> tid=0x1] enforce-unique-host and redundancy-zone properties have no effect for a LonerDistributedSystem.
16-Feb-2019 21:44:12
16-Feb-2019 21:44:12 [warn 2019/02/16 21:44:12.648 UTC <main> tid=0x1] enforce-unique-host and redundancy-zone properties have no effect for a LonerDistributedSystem.
16-Feb-2019 21:44:12
16-Feb-2019 21:44:12 [warn 2019/02/16 21:44:12.649 UTC <main> tid=0x1] enforce-unique-host and redundancy-zone properties have no effect for a LonerDistributedSystem.
16-Feb-2019 21:44:12
16-Feb-2019 21:44:12 [warn 2019/02/16 21:44:12.650 UTC <main> tid=0x1] enforce-unique-host and redundancy-zone properties have no effect for a LonerDistributedSystem.
16-Feb-2019 21:44:12
16-Feb-2019 21:44:12 [warn 2019/02/16 21:44:12.652 UTC <main> tid=0x1] enforce-unique-host and redundancy-zone properties have no effect for a LonerDistributedSystem.
16-Feb-2019 21:44:12
16-Feb-2019 21:44:12 [warn 2019/02/16 21:44:12.654 UTC <main> tid=0x1] enforce-unique-host and redundancy-zone properties have no effect for a LonerDistributedSystem.
16-Feb-2019 21:44:12
16-Feb-2019 21:44:12 [warn 2019/02/16 21:44:12.690 UTC <main> tid=0x1] enforce-unique-host and redundancy-zone properties have no effect for a LonerDistributedSystem.
16-Feb-2019 21:44:12
16-Feb-2019 21:44:12 [warn 2019/02/16 21:44:12.697 UTC <main> tid=0x1] enforce-unique-host and redundancy-zone properties have no effect for a LonerDistributedSystem.
16-Feb-2019 21:44:12
16-Feb-2019 21:44:12 [warn 2019/02/16 21:44:12.698 UTC <main> tid=0x1] enforce-unique-host and redundancy-zone properties have no effect for a LonerDistributedSystem.
16-Feb-2019 21:44:12
16-Feb-2019 21:44:12 [warn 2019/02/16 21:44:12.699 UTC <main> tid=0x1] enforce-unique-host and redundancy-zone properties have no effect for a LonerDistributedSystem.
16-Feb-2019 21:44:12
16-Feb-2019 21:44:12 [warn 2019/02/16 21:44:12.700 UTC <main> tid=0x1] enforce-unique-host and redundancy-zone properties have no effect for a LonerDistributedSystem.
16-Feb-2019 21:44:12
16-Feb-2019 21:44:12 [warn 2019/02/16 21:44:12.701 UTC <main> tid=0x1] enforce-unique-host and redundancy-zone properties have no effect for a LonerDistributedSystem.
16-Feb-2019 21:44:12
16-Feb-2019 21:44:12 [warn 2019/02/16 21:44:12.702 UTC <main> tid=0x1] enforce-unique-host and redundancy-zone properties have no effect for a LonerDistributedSystem.
16-Feb-2019 21:44:12
16-Feb-2019 21:44:12 [warn 2019/02/16 21:44:12.703 UTC <main> tid=0x1] enforce-unique-host and redundancy-zone properties have no effect for a LonerDistributedSystem.
16-Feb-2019 21:44:12
16-Feb-2019 21:44:12 [warn 2019/02/16 21:44:12.704 UTC <main> tid=0x1] enforce-unique-host and redundancy-zone properties have no effect for a LonerDistributedSystem.
16-Feb-2019 21:44:12
16-Feb-2019 21:44:12 [warn 2019/02/16 21:44:12.705 UTC <main> tid=0x1] enforce-unique-host and redundancy-zone properties have no effect for a LonerDistributedSystem.
16-Feb-2019 21:44:12
16-Feb-2019 21:44:12 [warn 2019/02/16 21:44:12.706 UTC <main> tid=0x1] enforce-unique-host and redundancy-zone properties have no effect for a LonerDistributedSystem.
16-Feb-2019 21:44:12
16-Feb-2019 21:44:12 [warn 2019/02/16 21:44:12.707 UTC <main> tid=0x1] enforce-unique-host and redundancy-zone properties have no effect for a LonerDistributedSystem.
16-Feb-2019 21:44:12
16-Feb-2019 21:44:12 [warn 2019/02/16 21:44:12.708 UTC <main> tid=0x1] enforce-unique-host and redundancy-zone properties have no effect for a LonerDistributedSystem.
16-Feb-2019 21:44:12
16-Feb-2019 21:44:12 [warn 2019/02/16 21:44:12.709 UTC <main> tid=0x1] enforce-unique-host and redundancy-zone properties have no effect for a LonerDistributedSystem.
16-Feb-2019 21:44:12
16-Feb-2019 21:44:12 [warn 2019/02/16 21:44:12.710 UTC <main> tid=0x1] enforce-unique-host and redundancy-zone properties have no effect for a LonerDistributedSystem.
16-Feb-2019 21:44:12
16-Feb-2019 21:44:12 [warn 2019/02/16 21:44:12.711 UTC <main> tid=0x1] enforce-unique-host and redundancy-zone properties have no effect for a LonerDistributedSystem.
16-Feb-2019 21:44:12
16-Feb-2019 21:44:12 [warn 2019/02/16 21:44:12.712 UTC <main> tid=0x1] enforce-unique-host and redundancy-zone properties have no effect for a LonerDistributedSystem.
16-Feb-2019 21:44:12
16-Feb-2019 21:44:12 [warn 2019/02/16 21:44:12.713 UTC <main> tid=0x1] enforce-unique-host and redundancy-zone properties have no effect for a LonerDistributedSystem.
16-Feb-2019 21:44:12
16-Feb-2019 21:44:12 [warn 2019/02/16 21:44:12.714 UTC <main> tid=0x1] enforce-unique-host and redundancy-zone properties have no effect for a LonerDistributedSystem.
16-Feb-2019 21:44:12
16-Feb-2019 21:44:12 [warn 2019/02/16 21:44:12.715 UTC <main> tid=0x1] enforce-unique-host and redundancy-zone properties have no effect for a LonerDistributedSystem.
16-Feb-2019 21:44:12
16-Feb-2019 21:44:12 [warn 2019/02/16 21:44:12.716 UTC <main> tid=0x1] enforce-unique-host and redundancy-zone properties have no effect for a LonerDistributedSystem.
16-Feb-2019 21:44:12
16-Feb-2019 21:44:12 [warn 2019/02/16 21:44:12.717 UTC <main> tid=0x1] enforce-unique-host and redundancy-zone properties have no effect for a LonerDistributedSystem.
16-Feb-2019 21:44:12
16-Feb-2019 21:44:12 [warn 2019/02/16 21:44:12.718 UTC <main> tid=0x1] enforce-unique-host and redundancy-zone properties have no effect for a LonerDistributedSystem.
16-Feb-2019 21:44:12
16-Feb-2019 21:44:12 [warn 2019/02/16 21:44:12.719 UTC <main> tid=0x1] enforce-unique-host and redundancy-zone properties have no effect for a LonerDistributedSystem.
16-Feb-2019 21:44:12
16-Feb-2019 21:44:12 [warn 2019/02/16 21:44:12.720 UTC <main> tid=0x1] enforce-unique-host and redundancy-zone properties have no effect for a LonerDistributedSystem.
16-Feb-2019 21:44:12
16-Feb-2019 21:44:12 [warn 2019/02/16 21:44:12.721 UTC <main> tid=0x1] enforce-unique-host and redundancy-zone properties have no effect for a LonerDistributedSystem.
16-Feb-2019 21:44:12
16-Feb-2019 21:44:12 [warn 2019/02/16 21:44:12.722 UTC <main> tid=0x1] enforce-unique-host and redundancy-zone properties have no effect for a LonerDistributedSystem.
16-Feb-2019 21:44:12
16-Feb-2019 21:44:12 [warn 2019/02/16 21:44:12.723 UTC <main> tid=0x1] enforce-unique-host and redundancy-zone properties have no effect for a LonerDistributedSystem.
16-Feb-2019 21:44:12
16-Feb-2019 21:44:12 [warn 2019/02/16 21:44:12.724 UTC <main> tid=0x1] enforce-unique-host and redundancy-zone properties have no effect for a LonerDistributedSystem.
16-Feb-2019 21:44:12
16-Feb-2019 21:44:12 [warn 2019/02/16 21:44:12.725 UTC <main> tid=0x1] enforce-unique-host and redundancy-zone properties have no effect for a LonerDistributedSystem.
16-Feb-2019 21:44:12
16-Feb-2019 21:44:12 [warn 2019/02/16 21:44:12.726 UTC <main> tid=0x1] enforce-unique-host and redundancy-zone properties have no effect for a LonerDistributedSystem.
16-Feb-2019 21:44:12
16-Feb-2019 21:44:12 [warn 2019/02/16 21:44:12.727 UTC <main> tid=0x1] enforce-unique-host and redundancy-zone properties have no effect for a LonerDistributedSystem.
16-Feb-2019 21:44:12
16-Feb-2019 21:44:12 [warn 2019/02/16 21:44:12.728 UTC <main> tid=0x1] enforce-unique-host and redundancy-zone properties have no effect for a LonerDistributedSystem.
16-Feb-2019 21:44:12
16-Feb-2019 21:44:12 [warn 2019/02/16 21:44:12.728 UTC <main> tid=0x1] enforce-unique-host and redundancy-zone properties have no effect for a LonerDistributedSystem.
16-Feb-2019 21:44:12
16-Feb-2019 21:44:12 [warn 2019/02/16 21:44:12.729 UTC <main> tid=0x1] enforce-unique-host and redundancy-zone properties have no effect for a LonerDistributedSystem.
16-Feb-2019 21:44:12
16-Feb-2019 21:44:12 [warn 2019/02/16 21:44:12.730 UTC <main> tid=0x1] enforce-unique-host and redundancy-zone properties have no effect for a LonerDistributedSystem.
16-Feb-2019 21:44:12
16-Feb-2019 21:44:12 [warn 2019/02/16 21:44:12.731 UTC <main> tid=0x1] enforce-unique-host and redundancy-zone properties have no effect for a LonerDistributedSystem.
16-Feb-2019 21:44:12
16-Feb-2019 21:44:12 [warn 2019/02/16 21:44:12.732 UTC <main> tid=0x1] enforce-unique-host and redundancy-zone properties have no effect for a LonerDistributedSystem.
16-Feb-2019 21:44:12
16-Feb-2019 21:44:12 [warn 2019/02/16 21:44:12.733 UTC <main> tid=0x1] enforce-unique-host and redundancy-zone properties have no effect for a LonerDistributedSystem.
16-Feb-2019 21:44:12
16-Feb-2019 21:44:12 [warn 2019/02/16 21:44:12.734 UTC <main> tid=0x1] enforce-unique-host and redundancy-zone properties have no effect for a LonerDistributedSystem.
16-Feb-2019 21:44:12
16-Feb-2019 21:44:12 [warn 2019/02/16 21:44:12.735 UTC <main> tid=0x1] enforce-unique-host and redundancy-zone properties have no effect for a LonerDistributedSystem.
16-Feb-2019 21:44:12
16-Feb-2019 21:44:12 [warn 2019/02/16 21:44:12.736 UTC <main> tid=0x1] enforce-unique-host and redundancy-zone properties have no effect for a LonerDistributedSystem.
16-Feb-2019 21:44:12
16-Feb-2019 21:44:12 [warn 2019/02/16 21:44:12.737 UTC <main> tid=0x1] enforce-unique-host and redundancy-zone properties have no effect for a LonerDistributedSystem.
16-Feb-2019 21:44:12
16-Feb-2019 21:44:12 [warn 2019/02/16 21:44:12.738 UTC <main> tid=0x1] enforce-unique-host and redundancy-zone properties have no effect for a LonerDistributedSystem.
16-Feb-2019 21:44:12
16-Feb-2019 21:44:12 [warn 2019/02/16 21:44:12.739 UTC <main> tid=0x1] enforce-unique-host and redundancy-zone properties have no effect for a LonerDistributedSystem.
16-Feb-2019 21:44:12
16-Feb-2019 21:44:12 [warn 2019/02/16 21:44:12.740 UTC <main> tid=0x1] enforce-unique-host and redundancy-zone properties have no effect for a LonerDistributedSystem.
16-Feb-2019 21:44:12
16-Feb-2019 21:44:12 [warn 2019/02/16 21:44:12.740 UTC <main> tid=0x1] enforce-unique-host and redundancy-zone properties have no effect for a LonerDistributedSystem.
16-Feb-2019 21:44:12
16-Feb-2019 21:44:12 [warn 2019/02/16 21:44:12.741 UTC <main> tid=0x1] enforce-unique-host and redundancy-zone properties have no effect for a LonerDistributedSystem.
16-Feb-2019 21:44:12
16-Feb-2019 21:44:12 [warn 2019/02/16 21:44:12.742 UTC <main> tid=0x1] enforce-unique-host and redundancy-zone properties have no effect for a LonerDistributedSystem.
16-Feb-2019 21:44:12
16-Feb-2019 21:44:12 [warn 2019/02/16 21:44:12.743 UTC <main> tid=0x1] enforce-unique-host and redundancy-zone properties have no effect for a LonerDistributedSystem.
16-Feb-2019 21:44:12
16-Feb-2019 21:44:12 [warn 2019/02/16 21:44:12.744 UTC <main> tid=0x1] enforce-unique-host and redundancy-zone properties have no effect for a LonerDistributedSystem.
16-Feb-2019 21:44:12
16-Feb-2019 21:44:12 [warn 2019/02/16 21:44:12.745 UTC <main> tid=0x1] enforce-unique-host and redundancy-zone properties have no effect for a LonerDistributedSystem.
16-Feb-2019 21:44:12
16-Feb-2019 21:44:12 [warn 2019/02/16 21:44:12.746 UTC <main> tid=0x1] enforce-unique-host and redundancy-zone properties have no effect for a LonerDistributedSystem.
16-Feb-2019 21:44:12
16-Feb-2019 21:44:12 [warn 2019/02/16 21:44:12.747 UTC <main> tid=0x1] enforce-unique-host and redundancy-zone properties have no effect for a LonerDistributedSystem.
16-Feb-2019 21:44:12
16-Feb-2019 21:44:12 [warn 2019/02/16 21:44:12.748 UTC <main> tid=0x1] enforce-unique-host and redundancy-zone properties have no effect for a LonerDistributedSystem.
16-Feb-2019 21:44:12
16-Feb-2019 21:44:12 [warn 2019/02/16 21:44:12.749 UTC <main> tid=0x1] enforce-unique-host and redundancy-zone properties have no effect for a LonerDistributedSystem.
16-Feb-2019 21:44:12
16-Feb-2019 21:44:12 [warn 2019/02/16 21:44:12.750 UTC <main> tid=0x1] enforce-unique-host and redundancy-zone properties have no effect for a LonerDistributedSystem.
16-Feb-2019 21:44:12
16-Feb-2019 21:44:12 [warn 2019/02/16 21:44:12.751 UTC <main> tid=0x1] enforce-unique-host and redundancy-zone properties have no effect for a LonerDistributedSystem.
16-Feb-2019 21:44:12
16-Feb-2019 21:44:12 [warn 2019/02/16 21:44:12.752 UTC <main> tid=0x1] enforce-unique-host and redundancy-zone properties have no effect for a LonerDistributedSystem.
16-Feb-2019 21:44:12
16-Feb-2019 21:44:12 [warn 2019/02/16 21:44:12.753 UTC <main> tid=0x1] enforce-unique-host and redundancy-zone properties have no effect for a LonerDistributedSystem.
16-Feb-2019 21:44:12
16-Feb-2019 21:44:12 [warn 2019/02/16 21:44:12.753 UTC <main> tid=0x1] enforce-unique-host and redundancy-zone properties have no effect for a LonerDistributedSystem.
16-Feb-2019 21:44:12
16-Feb-2019 21:44:12 [warn 2019/02/16 21:44:12.754 UTC <main> tid=0x1] enforce-unique-host and redundancy-zone properties have no effect for a LonerDistributedSystem.
16-Feb-2019 21:44:12
16-Feb-2019 21:44:12 [warn 2019/02/16 21:44:12.755 UTC <main> tid=0x1] enforce-unique-host and redundancy-zone properties have no effect for a LonerDistributedSystem.
16-Feb-2019 21:44:12
16-Feb-2019 21:44:12 [warn 2019/02/16 21:44:12.756 UTC <main> tid=0x1] enforce-unique-host and redundancy-zone properties have no effect for a LonerDistributedSystem.
16-Feb-2019 21:44:12
16-Feb-2019 21:44:12 [warn 2019/02/16 21:44:12.757 UTC <main> tid=0x1] enforce-unique-host and redundancy-zone properties have no effect for a LonerDistributedSystem.
16-Feb-2019 21:44:12
16-Feb-2019 21:44:12 [warn 2019/02/16 21:44:12.758 UTC <main> tid=0x1] enforce-unique-host and redundancy-zone properties have no effect for a LonerDistributedSystem.
16-Feb-2019 21:44:12
16-Feb-2019 21:44:12 [warn 2019/02/16 21:44:12.759 UTC <main> tid=0x1] enforce-unique-host and redundancy-zone properties have no effect for a LonerDistributedSystem.
16-Feb-2019 21:44:12
16-Feb-2019 21:44:12 [warn 2019/02/16 21:44:12.760 UTC <main> tid=0x1] enforce-unique-host and redundancy-zone properties have no effect for a LonerDistributedSystem.
16-Feb-2019 21:44:12
16-Feb-2019 21:44:12 [warn 2019/02/16 21:44:12.761 UTC <main> tid=0x1] enforce-unique-host and redundancy-zone properties have no effect for a LonerDistributedSystem.
16-Feb-2019 21:44:12
16-Feb-2019 21:44:12 [warn 2019/02/16 21:44:12.762 UTC <main> tid=0x1] enforce-unique-host and redundancy-zone properties have no effect for a LonerDistributedSystem.
16-Feb-2019 21:44:12
16-Feb-2019 21:44:12 [warn 2019/02/16 21:44:12.762 UTC <main> tid=0x1] enforce-unique-host and redundancy-zone properties have no effect for a LonerDistributedSystem.
16-Feb-2019 21:44:12
16-Feb-2019 21:44:12 [warn 2019/02/16 21:44:12.763 UTC <main> tid=0x1] enforce-unique-host and redundancy-zone properties have no effect for a LonerDistributedSystem.
16-Feb-2019 21:44:12
16-Feb-2019 21:44:12 [warn 2019/02/16 21:44:12.764 UTC <main> tid=0x1] enforce-unique-host and redundancy-zone properties have no effect for a LonerDistributedSystem.
16-Feb-2019 21:44:12
16-Feb-2019 21:44:12 [warn 2019/02/16 21:44:12.765 UTC <main> tid=0x1] enforce-unique-host and redundancy-zone properties have no effect for a LonerDistributedSystem.
16-Feb-2019 21:44:12
16-Feb-2019 21:44:12 [warn 2019/02/16 21:44:12.766 UTC <main> tid=0x1] enforce-unique-host and redundancy-zone properties have no effect for a LonerDistributedSystem.
16-Feb-2019 21:44:12
16-Feb-2019 21:44:12 [warn 2019/02/16 21:44:12.767 UTC <main> tid=0x1] enforce-unique-host and redundancy-zone properties have no effect for a LonerDistributedSystem.
16-Feb-2019 21:44:12
16-Feb-2019 21:44:12 [warn 2019/02/16 21:44:12.768 UTC <main> tid=0x1] enforce-unique-host and redundancy-zone properties have no effect for a LonerDistributedSystem.
16-Feb-2019 21:44:12
16-Feb-2019 21:44:12 [warn 2019/02/16 21:44:12.769 UTC <main> tid=0x1] enforce-unique-host and redundancy-zone properties have no effect for a LonerDistributedSystem.
16-Feb-2019 21:44:12
16-Feb-2019 21:44:12 [warn 2019/02/16 21:44:12.769 UTC <main> tid=0x1] enforce-unique-host and redundancy-zone properties have no effect for a LonerDistributedSystem.
16-Feb-2019 21:44:12
16-Feb-2019 21:44:12 [warn 2019/02/16 21:44:12.770 UTC <main> tid=0x1] enforce-unique-host and redundancy-zone properties have no effect for a LonerDistributedSystem.
16-Feb-2019 21:44:12
16-Feb-2019 21:44:12 [warn 2019/02/16 21:44:12.771 UTC <main> tid=0x1] enforce-unique-host and redundancy-zone properties have no effect for a LonerDistributedSystem.
16-Feb-2019 21:44:12
16-Feb-2019 21:44:12 [warn 2019/02/16 21:44:12.772 UTC <main> tid=0x1] enforce-unique-host and redundancy-zone properties have no effect for a LonerDistributedSystem.
16-Feb-2019 21:44:12
16-Feb-2019 21:44:12 [warn 2019/02/16 21:44:12.773 UTC <main> tid=0x1] enforce-unique-host and redundancy-zone properties have no effect for a LonerDistributedSystem.
16-Feb-2019 21:44:12
16-Feb-2019 21:44:12 [warn 2019/02/16 21:44:12.774 UTC <main> tid=0x1] enforce-unique-host and redundancy-zone properties have no effect for a LonerDistributedSystem.
16-Feb-2019 21:44:12
16-Feb-2019 21:44:12 [warn 2019/02/16 21:44:12.775 UTC <main> tid=0x1] enforce-unique-host and redundancy-zone properties have no effect for a LonerDistributedSystem.
16-Feb-2019 21:44:12
16-Feb-2019 21:44:12 [warn 2019/02/16 21:44:12.776 UTC <main> tid=0x1] enforce-unique-host and redundancy-zone properties have no effect for a LonerDistributedSystem.
16-Feb-2019 21:44:12
16-Feb-2019 21:44:12 [warn 2019/02/16 21:44:12.776 UTC <main> tid=0x1] enforce-unique-host and redundancy-zone properties have no effect for a LonerDistributedSystem.
16-Feb-2019 21:44:12
16-Feb-2019 21:44:12 [warn 2019/02/16 21:44:12.777 UTC <main> tid=0x1] enforce-unique-host and redundancy-zone properties have no effect for a LonerDistributedSystem.
16-Feb-2019 21:44:12
16-Feb-2019 21:44:12 [warn 2019/02/16 21:44:12.778 UTC <main> tid=0x1] enforce-unique-host and redundancy-zone properties have no effect for a LonerDistributedSystem.
16-Feb-2019 21:44:12
16-Feb-2019 21:44:12 [warn 2019/02/16 21:44:12.779 UTC <main> tid=0x1] enforce-unique-host and redundancy-zone properties have no effect for a LonerDistributedSystem.
16-Feb-2019 21:44:12
16-Feb-2019 21:44:12 [warn 2019/02/16 21:44:12.780 UTC <main> tid=0x1] enforce-unique-host and redundancy-zone properties have no effect for a LonerDistributedSystem.
16-Feb-2019 21:44:12
16-Feb-2019 21:44:12 [warn 2019/02/16 21:44:12.781 UTC <main> tid=0x1] enforce-unique-host and redundancy-zone properties have no effect for a LonerDistributedSystem.
16-Feb-2019 21:44:12
16-Feb-2019 21:44:12 [warn 2019/02/16 21:44:12.782 UTC <main> tid=0x1] enforce-unique-host and redundancy-zone properties have no effect for a LonerDistributedSystem.
16-Feb-2019 21:44:12
16-Feb-2019 21:44:12 [warn 2019/02/16 21:44:12.782 UTC <main> tid=0x1] enforce-unique-host and redundancy-zone properties have no effect for a LonerDistributedSystem.
16-Feb-2019 21:44:12
16-Feb-2019 21:44:12 [warn 2019/02/16 21:44:12.783 UTC <main> tid=0x1] enforce-unique-host and redundancy-zone properties have no effect for a LonerDistributedSystem.
16-Feb-2019 21:44:12
16-Feb-2019 21:44:12 [warn 2019/02/16 21:44:12.784 UTC <main> tid=0x1] enforce-unique-host and redundancy-zone properties have no effect for a LonerDistributedSystem.
16-Feb-2019 21:44:12
16-Feb-2019 21:44:12 [warn 2019/02/16 21:44:12.785 UTC <main> tid=0x1] enforce-unique-host and redundancy-zone properties have no effect for a LonerDistributedSystem.
16-Feb-2019 21:44:12
16-Feb-2019 21:44:12 [warn 2019/02/16 21:44:12.786 UTC <main> tid=0x1] enforce-unique-host and redundancy-zone properties have no effect for a LonerDistributedSystem.
16-Feb-2019 21:44:12
16-Feb-2019 21:44:12 [warn 2019/02/16 21:44:12.787 UTC <main> tid=0x1] enforce-unique-host and redundancy-zone properties have no effect for a LonerDistributedSystem.
16-Feb-2019 21:44:12
16-Feb-2019 21:44:12 [warn 2019/02/16 21:44:12.788 UTC <main> tid=0x1] enforce-unique-host and redundancy-zone properties have no effect for a LonerDistributedSystem.
16-Feb-2019 21:44:12
16-Feb-2019 21:44:12 [warn 2019/02/16 21:44:12.789 UTC <main> tid=0x1] enforce-unique-host and redundancy-zone properties have no effect for a LonerDistributedSystem.
16-Feb-2019 21:44:12
16-Feb-2019 21:44:12 [warn 2019/02/16 21:44:12.790 UTC <main> tid=0x1] enforce-unique-host and redundancy-zone properties have no effect for a LonerDistributedSystem.
16-Feb-2019 21:44:12
16-Feb-2019 21:44:12 [warn 2019/02/16 21:44:12.790 UTC <main> tid=0x1] enforce-unique-host and redundancy-zone properties have no effect for a LonerDistributedSystem.
16-Feb-2019 21:44:12
16-Feb-2019 21:44:12 [warn 2019/02/16 21:44:12.791 UTC <main> tid=0x1] enforce-unique-host and redundancy-zone properties have no effect for a LonerDistributedSystem.
16-Feb-2019 21:44:12
16-Feb-2019 21:44:12 [INFO] Tests run: 1, Failures: 0, Errors: 0, Skipped: 0, Time elapsed: 2.799 s - in org.springframework.data.gemfire.snapshot.SnapshotServiceImportExportIntegrationTest
16-Feb-2019 21:44:13 [INFO] Running org.springframework.data.gemfire.PartitionAttributesFactoryBeanTest
16-Feb-2019 21:44:14 [INFO] Tests run: 3, Failures: 0, Errors: 0, Skipped: 0, Time elapsed: 1.091 s - in org.springframework.data.gemfire.PartitionAttributesFactoryBeanTest
16-Feb-2019 21:44:14 [INFO] Running org.springframework.data.gemfire.CacheAutoReconnectIntegrationTests
16-Feb-2019 21:44:17 [INFO] Tests run: 2, Failures: 0, Errors: 0, Skipped: 0, Time elapsed: 2.737 s - in org.springframework.data.gemfire.CacheAutoReconnectIntegrationTests
16-Feb-2019 21:44:18 [INFO] Running org.springframework.data.gemfire.server.CacheServerFactoryBeanTest
16-Feb-2019 21:44:19 [INFO] Tests run: 8, Failures: 0, Errors: 0, Skipped: 0, Time elapsed: 1.265 s - in org.springframework.data.gemfire.server.CacheServerFactoryBeanTest
16-Feb-2019 21:44:20 [INFO] Running org.springframework.data.gemfire.server.SubscriptionEvictionPolicyConverterUnitTests
16-Feb-2019 21:44:20 [INFO] Tests run: 4, Failures: 0, Errors: 0, Skipped: 0, Time elapsed: 0.115 s - in org.springframework.data.gemfire.server.SubscriptionEvictionPolicyConverterUnitTests
16-Feb-2019 21:44:20 [INFO] Running org.springframework.data.gemfire.server.SubscriptionEvictionPolicyTest
16-Feb-2019 21:44:21 [INFO] Tests run: 5, Failures: 0, Errors: 0, Skipped: 0, Time elapsed: 0.446 s - in org.springframework.data.gemfire.server.SubscriptionEvictionPolicyTest
16-Feb-2019 21:44:21 [INFO] Running org.springframework.data.gemfire.ScopeTypeTest
16-Feb-2019 21:44:21 [INFO] Tests run: 7, Failures: 0, Errors: 0, Skipped: 0, Time elapsed: 0.051 s - in org.springframework.data.gemfire.ScopeTypeTest
16-Feb-2019 21:44:22 [INFO] Running org.springframework.data.gemfire.cache.config.EnableGemfireCachingIntegrationTests
16-Feb-2019 21:44:23 [info 2019/02/16 21:44:23.016 UTC <main> tid=0x1] Could not detect default resource locations for test class [org.springframework.data.gemfire.cache.config.EnableGemfireCachingIntegrationTests]: no resource found for suffixes {-context.xml}.
16-Feb-2019 21:44:23
16-Feb-2019 21:44:23 [info 2019/02/16 21:44:23.030 UTC <main> tid=0x1] AnnotationConfigContextLoader detected default configuration classes for context configuration [ContextConfigurationAttributes@58695725 declaringClass = 'org.springframework.data.gemfire.cache.config.EnableGemfireCachingIntegrationTests', classes = '{class org.springframework.data.gemfire.cache.config.EnableGemfireCachingIntegrationTests$TestConfiguration}', locations = '{}', inheritLocations = true, initializers = '{}', inheritInitializers = true, name = [null], contextLoaderClass = 'org.springframework.test.context.ContextLoader'].
16-Feb-2019 21:44:23
16-Feb-2019 21:44:23 [info 2019/02/16 21:44:23.044 UTC <main> tid=0x1] Loaded default TestExecutionListener class names from location [META-INF/spring.factories]: [org.springframework.test.context.web.ServletTestExecutionListener, org.springframework.test.context.support.DirtiesContextBeforeModesTestExecutionListener, org.springframework.test.context.support.DependencyInjectionTestExecutionListener, org.springframework.test.context.support.DirtiesContextTestExecutionListener, org.springframework.test.context.transaction.TransactionalTestExecutionListener, org.springframework.test.context.jdbc.SqlScriptsTestExecutionListener]
16-Feb-2019 21:44:23
16-Feb-2019 21:44:23 [info 2019/02/16 21:44:23.052 UTC <main> tid=0x1] Using TestExecutionListeners: [org.springframework.test.context.support.DirtiesContextBeforeModesTestExecutionListener@5824a83d, org.springframework.test.context.support.DependencyInjectionTestExecutionListener@537f60bf, org.springframework.test.context.support.DirtiesContextTestExecutionListener@5677323c, org.springframework.test.context.transaction.TransactionalTestExecutionListener@18df8434, org.springframework.test.context.jdbc.SqlScriptsTestExecutionListener@65c7a252]
16-Feb-2019 21:44:23
16-Feb-2019 21:44:25 [INFO] Tests run: 2, Failures: 0, Errors: 0, Skipped: 0, Time elapsed: 2.898 s - in org.springframework.data.gemfire.cache.config.EnableGemfireCachingIntegrationTests
16-Feb-2019 21:44:25 [INFO] Running org.springframework.data.gemfire.cache.GemfireCacheUnitTests
16-Feb-2019 21:44:26 [INFO] Tests run: 19, Failures: 0, Errors: 0, Skipped: 0, Time elapsed: 0.655 s - in org.springframework.data.gemfire.cache.GemfireCacheUnitTests
16-Feb-2019 21:44:26 [INFO] Running org.springframework.data.gemfire.cache.ClientCacheManagerTest
16-Feb-2019 21:44:27 [info 2019/02/16 21:44:27.672 UTC <main> tid=0x1] Loaded default TestExecutionListener class names from location [META-INF/spring.factories]: [org.springframework.test.context.web.ServletTestExecutionListener, org.springframework.test.context.support.DirtiesContextBeforeModesTestExecutionListener, org.springframework.test.context.support.DependencyInjectionTestExecutionListener, org.springframework.test.context.support.DirtiesContextTestExecutionListener, org.springframework.test.context.transaction.TransactionalTestExecutionListener, org.springframework.test.context.jdbc.SqlScriptsTestExecutionListener]
16-Feb-2019 21:44:27
16-Feb-2019 21:44:27 [info 2019/02/16 21:44:27.682 UTC <main> tid=0x1] Using TestExecutionListeners: [org.springframework.test.context.support.DirtiesContextBeforeModesTestExecutionListener@27f981c6, org.springframework.test.context.support.DependencyInjectionTestExecutionListener@1b11171f, org.springframework.test.context.support.DirtiesContextTestExecutionListener@1151e434, org.springframework.test.context.transaction.TransactionalTestExecutionListener@2dc54ad4, org.springframework.test.context.jdbc.SqlScriptsTestExecutionListener@4659191b]
16-Feb-2019 21:44:27
16-Feb-2019 21:44:28 [INFO] Tests run: 1, Failures: 0, Errors: 0, Skipped: 0, Time elapsed: 2.007 s - in org.springframework.data.gemfire.cache.ClientCacheManagerTest
16-Feb-2019 21:44:29 [INFO] Running org.springframework.data.gemfire.cache.CachingWithGemFireIntegrationTest
16-Feb-2019 21:44:30 [info 2019/02/16 21:44:30.290 UTC <main> tid=0x1] Detected default resource location "classpath:org/springframework/data/gemfire/cache/CachingWithGemFireIntegrationTest-context.xml" for test class [org.springframework.data.gemfire.cache.CachingWithGemFireIntegrationTest]
16-Feb-2019 21:44:30
16-Feb-2019 21:44:30 [info 2019/02/16 21:44:30.293 UTC <main> tid=0x1] GenericXmlContextLoader detected default locations for context configuration [ContextConfigurationAttributes@32ee6fee declaringClass = 'org.springframework.data.gemfire.cache.CachingWithGemFireIntegrationTest', classes = '{}', locations = '{classpath:org/springframework/data/gemfire/cache/CachingWithGemFireIntegrationTest-context.xml}', inheritLocations = true, initializers = '{}', inheritInitializers = true, name = [null], contextLoaderClass = 'org.springframework.test.context.ContextLoader'].
16-Feb-2019 21:44:30
16-Feb-2019 21:44:30 [info 2019/02/16 21:44:30.295 UTC <main> tid=0x1] Could not detect default configuration classes for test class [org.springframework.data.gemfire.cache.CachingWithGemFireIntegrationTest]: CachingWithGemFireIntegrationTest does not declare any static, non-private, non-final, nested classes annotated with @Configuration.
16-Feb-2019 21:44:30
16-Feb-2019 21:44:30 [info 2019/02/16 21:44:30.309 UTC <main> tid=0x1] Loaded default TestExecutionListener class names from location [META-INF/spring.factories]: [org.springframework.test.context.web.ServletTestExecutionListener, org.springframework.test.context.support.DirtiesContextBeforeModesTestExecutionListener, org.springframework.test.context.support.DependencyInjectionTestExecutionListener, org.springframework.test.context.support.DirtiesContextTestExecutionListener, org.springframework.test.context.transaction.TransactionalTestExecutionListener, org.springframework.test.context.jdbc.SqlScriptsTestExecutionListener]
16-Feb-2019 21:44:30
16-Feb-2019 21:44:30 [info 2019/02/16 21:44:30.317 UTC <main> tid=0x1] Using TestExecutionListeners: [org.springframework.test.context.support.DirtiesContextBeforeModesTestExecutionListener@272113c4, org.springframework.test.context.support.DependencyInjectionTestExecutionListener@73e9cf30, org.springframework.test.context.support.DirtiesContextTestExecutionListener@771a660, org.springframework.test.context.transaction.TransactionalTestExecutionListener@2d52216b, org.springframework.test.context.jdbc.SqlScriptsTestExecutionListener@242b836]
16-Feb-2019 21:44:30
16-Feb-2019 21:44:32 [warn 2019/02/16 21:44:32.270 UTC <main> tid=0x1] Region NamedNumbersRegion is being created with scope DISTRIBUTED_NO_ACK but enable-network-partition-detection is enabled in the distributed system.  This can lead to cache inconsistencies if there is a network failure.
16-Feb-2019 21:44:32
16-Feb-2019 21:44:32 [INFO] Tests run: 2, Failures: 0, Errors: 0, Skipped: 0, Time elapsed: 2.889 s - in org.springframework.data.gemfire.cache.CachingWithGemFireIntegrationTest
16-Feb-2019 21:44:32 [INFO] Running org.springframework.data.gemfire.cache.GemfireCacheIntegrationTests
16-Feb-2019 21:44:35 [warn 2019/02/16 21:44:35.065 UTC <main> tid=0x1] Region Example is being created with scope DISTRIBUTED_NO_ACK but enable-network-partition-detection is enabled in the distributed system.  This can lead to cache inconsistencies if there is a network failure.
16-Feb-2019 21:44:35
16-Feb-2019 21:44:35 [INFO] Tests run: 13, Failures: 0, Errors: 0, Skipped: 0, Time elapsed: 2.306 s - in org.springframework.data.gemfire.cache.GemfireCacheIntegrationTests
16-Feb-2019 21:44:35 [INFO] Running org.springframework.data.gemfire.cache.GemfireCacheManagerUnitTests
16-Feb-2019 21:44:36 [INFO] Tests run: 19, Failures: 0, Errors: 0, Skipped: 0, Time elapsed: 0.646 s - in org.springframework.data.gemfire.cache.GemfireCacheManagerUnitTests
16-Feb-2019 21:44:37 [INFO] Running org.springframework.data.gemfire.cache.CallableCacheLoaderAdapterTest
16-Feb-2019 21:44:37 [INFO] Tests run: 9, Failures: 0, Errors: 0, Skipped: 0, Time elapsed: 0.589 s - in org.springframework.data.gemfire.cache.CallableCacheLoaderAdapterTest
16-Feb-2019 21:44:38 [INFO] Running org.springframework.data.gemfire.cache.CompoundCachePutCacheEvictIntegrationTests
16-Feb-2019 21:44:38 [info 2019/02/16 21:44:38.919 UTC <main> tid=0x1] Loaded default TestExecutionListener class names from location [META-INF/spring.factories]: [org.springframework.test.context.web.ServletTestExecutionListener, org.springframework.test.context.support.DirtiesContextBeforeModesTestExecutionListener, org.springframework.test.context.support.DependencyInjectionTestExecutionListener, org.springframework.test.context.support.DirtiesContextTestExecutionListener, org.springframework.test.context.transaction.TransactionalTestExecutionListener, org.springframework.test.context.jdbc.SqlScriptsTestExecutionListener]
16-Feb-2019 21:44:38
16-Feb-2019 21:44:38 [info 2019/02/16 21:44:38.929 UTC <main> tid=0x1] Using TestExecutionListeners: [org.springframework.test.context.support.DirtiesContextBeforeModesTestExecutionListener@4b8ee4de, org.springframework.test.context.support.DependencyInjectionTestExecutionListener@27f981c6, org.springframework.test.context.support.DirtiesContextTestExecutionListener@1b11171f, org.springframework.test.context.transaction.TransactionalTestExecutionListener@1151e434, org.springframework.test.context.jdbc.SqlScriptsTestExecutionListener@2dc54ad4]
16-Feb-2019 21:44:38
16-Feb-2019 21:44:41 [INFO] Tests run: 2, Failures: 0, Errors: 0, Skipped: 0, Time elapsed: 3.138 s - in org.springframework.data.gemfire.cache.CompoundCachePutCacheEvictIntegrationTests
16-Feb-2019 21:44:41 [INFO] Running org.springframework.data.gemfire.RegionLookupIntegrationTests
16-Feb-2019 21:44:43 [warn 2019/02/16 21:44:43.725 UTC <main> tid=0x1] Exception encountered during context initialization - cancelling refresh attempt: org.springframework.beans.factory.BeanCreationException: Error creating bean with name 'NativeClientRegion': Invocation of init method failed; nested exception is org.apache.geode.cache.RegionExistsException: /NativeClientRegion
16-Feb-2019 21:44:43
16-Feb-2019 21:44:44 [warn 2019/02/16 21:44:44.687 UTC <main> tid=0x1] Region NativeReplicateRegion is being created with scope DISTRIBUTED_NO_ACK but enable-network-partition-detection is enabled in the distributed system.  This can lead to cache inconsistencies if there is a network failure.
16-Feb-2019 21:44:44
16-Feb-2019 21:44:44 [warn 2019/02/16 21:44:44.716 UTC <main> tid=0x1] Exception encountered during context initialization - cancelling refresh attempt: org.springframework.beans.factory.BeanCreationException: Error creating bean with name 'NativeReplicateRegion': Invocation of init method failed; nested exception is org.apache.geode.cache.RegionExistsException: /NativeReplicateRegion
16-Feb-2019 21:44:44
16-Feb-2019 21:44:45 [warn 2019/02/16 21:44:45.011 UTC <main> tid=0x1] Region NativeReplicateRegion is being created with scope DISTRIBUTED_NO_ACK but enable-network-partition-detection is enabled in the distributed system.  This can lead to cache inconsistencies if there is a network failure.
16-Feb-2019 21:44:45
16-Feb-2019 21:44:45 [warn 2019/02/16 21:44:45.024 UTC <main> tid=0x1] Exception encountered during context initialization - cancelling refresh attempt: org.springframework.beans.factory.BeanCreationException: Error creating bean with name '/NativeParentRegion/NativeChildRegion': Invocation of init method failed; nested exception is org.apache.geode.cache.RegionExistsException: /NativeParentRegion/NativeChildRegion
16-Feb-2019 21:44:45
16-Feb-2019 21:44:45 [warn 2019/02/16 21:44:45.174 UTC <main> tid=0x1] Region AppDataRegion is being created with scope DISTRIBUTED_NO_ACK but enable-network-partition-detection is enabled in the distributed system.  This can lead to cache inconsistencies if there is a network failure.
16-Feb-2019 21:44:45
16-Feb-2019 21:44:45 [warn 2019/02/16 21:44:45.177 UTC <main> tid=0x1] Exception encountered during context initialization - cancelling refresh attempt: org.springframework.beans.factory.BeanCreationException: Error creating bean with name 'regionTwo': Invocation of init method failed; nested exception is org.apache.geode.cache.RegionExistsException: /AppDataRegion
16-Feb-2019 21:44:45
16-Feb-2019 21:44:45 [warn 2019/02/16 21:44:45.230 UTC <main> tid=0x1] Exception encountered during context initialization - cancelling refresh attempt: org.springframework.beans.factory.BeanCreationException: Error creating bean with name '/NativeClientParentRegion/NativeClientChildRegion': Invocation of init method failed; nested exception is org.apache.geode.cache.RegionExistsException: /NativeClientParentRegion/NativeClientChildRegion
16-Feb-2019 21:44:45
16-Feb-2019 21:44:45 [warn 2019/02/16 21:44:45.489 UTC <main> tid=0x1] Region NativeReplicateRegion is being created with scope DISTRIBUTED_NO_ACK but enable-network-partition-detection is enabled in the distributed system.  This can lead to cache inconsistencies if there is a network failure.
16-Feb-2019 21:44:45
16-Feb-2019 21:44:45 [warn 2019/02/16 21:44:45.512 UTC <main> tid=0x1] Region SpringReplicateRegion is being created with scope DISTRIBUTED_NO_ACK but enable-network-partition-detection is enabled in the distributed system.  This can lead to cache inconsistencies if there is a network failure.
16-Feb-2019 21:44:45
16-Feb-2019 21:44:45 [warn 2019/02/16 21:44:45.683 UTC <main> tid=0x1] Region NativeReplicateRegion is being created with scope DISTRIBUTED_NO_ACK but enable-network-partition-detection is enabled in the distributed system.  This can lead to cache inconsistencies if there is a network failure.
16-Feb-2019 21:44:45
16-Feb-2019 21:44:45 [warn 2019/02/16 21:44:45.690 UTC <main> tid=0x1] Exception encountered during context initialization - cancelling refresh attempt: org.springframework.beans.factory.BeanCreationException: Error creating bean with name 'NativeLocalRegion': Invocation of init method failed; nested exception is org.apache.geode.cache.RegionExistsException: /NativeLocalRegion
16-Feb-2019 21:44:45
16-Feb-2019 21:44:45 [warn 2019/02/16 21:44:45.871 UTC <main> tid=0x1] Region NativeReplicateRegion is being created with scope DISTRIBUTED_NO_ACK but enable-network-partition-detection is enabled in the distributed system.  This can lead to cache inconsistencies if there is a network failure.
16-Feb-2019 21:44:45
16-Feb-2019 21:44:45 [warn 2019/02/16 21:44:45.877 UTC <main> tid=0x1] Exception encountered during context initialization - cancelling refresh attempt: org.springframework.beans.factory.BeanCreationException: Error creating bean with name 'NativePartitionRegion': Invocation of init method failed; nested exception is org.apache.geode.cache.RegionExistsException: /NativePartitionRegion
16-Feb-2019 21:44:45
16-Feb-2019 21:44:46 [INFO] Tests run: 10, Failures: 0, Errors: 0, Skipped: 0, Time elapsed: 4.36 s - in org.springframework.data.gemfire.RegionLookupIntegrationTests
16-Feb-2019 21:44:46 [INFO] Running org.springframework.data.gemfire.RegionDataPolicyShortcutsIntegrationTest
16-Feb-2019 21:44:47 [info 2019/02/16 21:44:47.511 UTC <main> tid=0x1] Loaded default TestExecutionListener class names from location [META-INF/spring.factories]: [org.springframework.test.context.web.ServletTestExecutionListener, org.springframework.test.context.support.DirtiesContextBeforeModesTestExecutionListener, org.springframework.test.context.support.DependencyInjectionTestExecutionListener, org.springframework.test.context.support.DirtiesContextTestExecutionListener, org.springframework.test.context.transaction.TransactionalTestExecutionListener, org.springframework.test.context.jdbc.SqlScriptsTestExecutionListener]
16-Feb-2019 21:44:47
16-Feb-2019 21:44:47 [info 2019/02/16 21:44:47.522 UTC <main> tid=0x1] Using TestExecutionListeners: [org.springframework.test.context.support.DirtiesContextBeforeModesTestExecutionListener@2dc54ad4, org.springframework.test.context.support.DependencyInjectionTestExecutionListener@4659191b, org.springframework.test.context.support.DirtiesContextTestExecutionListener@55634720, org.springframework.test.context.transaction.TransactionalTestExecutionListener@4b0d79fc, org.springframework.test.context.jdbc.SqlScriptsTestExecutionListener@4c1909a3]
16-Feb-2019 21:44:47
16-Feb-2019 21:44:49 [warn 2019/02/16 21:44:49.579 UTC <main> tid=0x1] Region ReplicateWithDataPolicy is being created with scope DISTRIBUTED_NO_ACK but enable-network-partition-detection is enabled in the distributed system.  This can lead to cache inconsistencies if there is a network failure.
16-Feb-2019 21:44:49
16-Feb-2019 21:44:49 [INFO] Tests run: 8, Failures: 0, Errors: 0, Skipped: 0, Time elapsed: 2.997 s - in org.springframework.data.gemfire.RegionDataPolicyShortcutsIntegrationTest
16-Feb-2019 21:44:50 [INFO] Running org.springframework.data.gemfire.dao.GemfireDaoSupportUnitTests
16-Feb-2019 21:44:51 [INFO] Tests run: 4, Failures: 0, Errors: 0, Skipped: 0, Time elapsed: 1.368 s - in org.springframework.data.gemfire.dao.GemfireDaoSupportUnitTests
16-Feb-2019 21:44:52 [INFO] Running org.springframework.data.gemfire.DiskStoreBeanUsingPropertyPlaceholdersIntegrationTest
16-Feb-2019 21:44:52 [info 2019/02/16 21:44:52.984 UTC <main> tid=0x1] Loaded default TestExecutionListener class names from location [META-INF/spring.factories]: [org.springframework.test.context.web.ServletTestExecutionListener, org.springframework.test.context.support.DirtiesContextBeforeModesTestExecutionListener, org.springframework.test.context.support.DependencyInjectionTestExecutionListener, org.springframework.test.context.support.DirtiesContextTestExecutionListener, org.springframework.test.context.transaction.TransactionalTestExecutionListener, org.springframework.test.context.jdbc.SqlScriptsTestExecutionListener]
16-Feb-2019 21:44:52
16-Feb-2019 21:44:52 [info 2019/02/16 21:44:52.994 UTC <main> tid=0x1] Using TestExecutionListeners: [org.springframework.test.context.support.DirtiesContextBeforeModesTestExecutionListener@4659191b, org.springframework.test.context.support.DependencyInjectionTestExecutionListener@55634720, org.springframework.test.context.support.DirtiesContextTestExecutionListener@4b0d79fc, org.springframework.test.context.transaction.TransactionalTestExecutionListener@4c1909a3, org.springframework.test.context.jdbc.SqlScriptsTestExecutionListener@428640fa]
16-Feb-2019 21:44:52
16-Feb-2019 21:44:53 [info 2019/02/16 21:44:53.297 UTC <main> tid=0x1] Replacing the [gemfireCache] bean definition having type [org.springframework.data.gemfire.CacheFactoryBean] with mock [org.springframework.data.gemfire.test.MockCacheFactoryBean]...
16-Feb-2019 21:44:53
16-Feb-2019 21:44:53 [info 2019/02/16 21:44:53.743 UTC <main> tid=0x1] Connected to Distributed System [DiskStoreUsingPropertyPlaceholdersTest] as Member [null] in Group(s) [[]] with Role(s) [[]] on Host [mockDistributedMember.host] having PID [0]
16-Feb-2019 21:44:53
16-Feb-2019 21:44:53 [info 2019/02/16 21:44:53.755 UTC <main> tid=0x1] Found existing Pivotal GemFire version [9.7.0] Cache [DiskStoreUsingPropertyPlaceholdersTest]
16-Feb-2019 21:44:53
16-Feb-2019 21:44:53 Disk Store Configuration: {allowForceCompaction=false, autoCompact=true, compactionThreshold=75, maxOplogSize=16384, queueSize=8192, timeInterval=5000, writeBufferSize=65536}
16-Feb-2019 21:44:53 [INFO] Tests run: 1, Failures: 0, Errors: 0, Skipped: 0, Time elapsed: 1.601 s - in org.springframework.data.gemfire.DiskStoreBeanUsingPropertyPlaceholdersIntegrationTest
16-Feb-2019 21:44:53 [info 2019/02/16 21:44:53.835 UTC <Thread-1> tid=0xe] Invocation of destroy method failed on bean with name 'gemfireCache': org.apache.geode.cache.CacheClosedException: A cache has not yet been created.
16-Feb-2019 21:44:53
16-Feb-2019 21:44:54 [INFO] Running org.springframework.data.gemfire.IndexTypeTest
16-Feb-2019 21:44:54 [INFO] Tests run: 11, Failures: 0, Errors: 0, Skipped: 0, Time elapsed: 0.06 s - in org.springframework.data.gemfire.IndexTypeTest
16-Feb-2019 21:44:54 [INFO] Running org.springframework.data.gemfire.transaction.config.EnableGemfireCacheTransactionsIntegrationTests
16-Feb-2019 21:44:55 [info 2019/02/16 21:44:55.721 UTC <main> tid=0x1] Could not detect default resource locations for test class [org.springframework.data.gemfire.transaction.config.EnableGemfireCacheTransactionsIntegrationTests]: no resource found for suffixes {-context.xml}.
16-Feb-2019 21:44:55
16-Feb-2019 21:44:55 [info 2019/02/16 21:44:55.734 UTC <main> tid=0x1] AnnotationConfigContextLoader detected default configuration classes for context configuration [ContextConfigurationAttributes@bae7dc0 declaringClass = 'org.springframework.data.gemfire.transaction.config.EnableGemfireCacheTransactionsIntegrationTests', classes = '{class org.springframework.data.gemfire.transaction.config.EnableGemfireCacheTransactionsIntegrationTests$TestConfiguration}', locations = '{}', inheritLocations = true, initializers = '{}', inheritInitializers = true, name = [null], contextLoaderClass = 'org.springframework.test.context.ContextLoader'].
16-Feb-2019 21:44:55
16-Feb-2019 21:44:55 [info 2019/02/16 21:44:55.748 UTC <main> tid=0x1] Loaded default TestExecutionListener class names from location [META-INF/spring.factories]: [org.springframework.test.context.web.ServletTestExecutionListener, org.springframework.test.context.support.DirtiesContextBeforeModesTestExecutionListener, org.springframework.test.context.support.DependencyInjectionTestExecutionListener, org.springframework.test.context.support.DirtiesContextTestExecutionListener, org.springframework.test.context.transaction.TransactionalTestExecutionListener, org.springframework.test.context.jdbc.SqlScriptsTestExecutionListener]
16-Feb-2019 21:44:55
16-Feb-2019 21:44:55 [info 2019/02/16 21:44:55.757 UTC <main> tid=0x1] Using TestExecutionListeners: [org.springframework.test.context.support.DirtiesContextBeforeModesTestExecutionListener@e350b40, org.springframework.test.context.support.DependencyInjectionTestExecutionListener@41a0aa7d, org.springframework.test.context.support.DirtiesContextTestExecutionListener@2794eab6, org.springframework.test.context.transaction.TransactionalTestExecutionListener@6340e5f0, org.springframework.test.context.jdbc.SqlScriptsTestExecutionListener@45099dd3]
16-Feb-2019 21:44:55
16-Feb-2019 21:44:56 [info 2019/02/16 21:44:56.016 UTC <main> tid=0x1] Bean 'org.springframework.transaction.annotation.ProxyTransactionManagementConfiguration' of type [org.springframework.transaction.annotation.ProxyTransactionManagementConfiguration$$EnhancerBySpringCGLIB$$f5081419] is not eligible for getting processed by all BeanPostProcessors (for example: not eligible for auto-proxying)
16-Feb-2019 21:44:56
16-Feb-2019 21:44:57 [INFO] Tests run: 3, Failures: 0, Errors: 0, Skipped: 0, Time elapsed: 2.935 s - in org.springframework.data.gemfire.transaction.config.EnableGemfireCacheTransactionsIntegrationTests
16-Feb-2019 21:44:58 [INFO] Running org.springframework.data.gemfire.transaction.GemfireTransactionManagerIntegrationTests
16-Feb-2019 21:44:59 [info 2019/02/16 21:44:59.239 UTC <main> tid=0x1] Could not detect default resource locations for test class [org.springframework.data.gemfire.transaction.GemfireTransactionManagerIntegrationTests]: no resource found for suffixes {-context.xml}.
16-Feb-2019 21:44:59
16-Feb-2019 21:44:59 [info 2019/02/16 21:44:59.254 UTC <main> tid=0x1] AnnotationConfigContextLoader detected default configuration classes for context configuration [ContextConfigurationAttributes@5d7148e2 declaringClass = 'org.springframework.data.gemfire.transaction.GemfireTransactionManagerIntegrationTests', classes = '{class org.springframework.data.gemfire.transaction.GemfireTransactionManagerIntegrationTests$TestConfiguration}', locations = '{}', inheritLocations = true, initializers = '{}', inheritInitializers = true, name = [null], contextLoaderClass = 'org.springframework.test.context.ContextLoader'].
16-Feb-2019 21:44:59
16-Feb-2019 21:44:59 [info 2019/02/16 21:44:59.268 UTC <main> tid=0x1] Loaded default TestExecutionListener class names from location [META-INF/spring.factories]: [org.springframework.test.context.web.ServletTestExecutionListener, org.springframework.test.context.support.DirtiesContextBeforeModesTestExecutionListener, org.springframework.test.context.support.DependencyInjectionTestExecutionListener, org.springframework.test.context.support.DirtiesContextTestExecutionListener, org.springframework.test.context.transaction.TransactionalTestExecutionListener, org.springframework.test.context.jdbc.SqlScriptsTestExecutionListener]
16-Feb-2019 21:44:59
16-Feb-2019 21:44:59 [info 2019/02/16 21:44:59.278 UTC <main> tid=0x1] Using TestExecutionListeners: [org.springframework.test.context.support.DirtiesContextBeforeModesTestExecutionListener@65c7a252, org.springframework.test.context.support.DependencyInjectionTestExecutionListener@4d154ccd, org.springframework.test.context.support.DirtiesContextTestExecutionListener@229c6181, org.springframework.test.context.transaction.TransactionalTestExecutionListener@4686afc2, org.springframework.test.context.jdbc.SqlScriptsTestExecutionListener@1e0b4072]
16-Feb-2019 21:44:59
16-Feb-2019 21:44:59 [info 2019/02/16 21:44:59.548 UTC <main> tid=0x1] Bean 'org.springframework.transaction.annotation.ProxyTransactionManagementConfiguration' of type [org.springframework.transaction.annotation.ProxyTransactionManagementConfiguration$$EnhancerBySpringCGLIB$$1205cdcd] is not eligible for getting processed by all BeanPostProcessors (for example: not eligible for auto-proxying)
16-Feb-2019 21:44:59
16-Feb-2019 21:45:01 [INFO] Tests run: 1, Failures: 0, Errors: 0, Skipped: 0, Time elapsed: 2.943 s - in org.springframework.data.gemfire.transaction.GemfireTransactionManagerIntegrationTests
16-Feb-2019 21:45:01 [INFO] Running org.springframework.data.gemfire.IndexTypeConverterUnitTests
16-Feb-2019 21:45:02 [INFO] Tests run: 4, Failures: 0, Errors: 0, Skipped: 0, Time elapsed: 0.128 s - in org.springframework.data.gemfire.IndexTypeConverterUnitTests
16-Feb-2019 21:45:02 [INFO] Running org.springframework.data.gemfire.JndiDataSourceTypeTest
16-Feb-2019 21:45:02 [INFO] Tests run: 3, Failures: 0, Errors: 0, Skipped: 0, Time elapsed: 0.061 s - in org.springframework.data.gemfire.JndiDataSourceTypeTest
16-Feb-2019 21:45:03 [INFO] Running org.springframework.data.gemfire.IndexFactoryBeanTest
16-Feb-2019 21:45:04 [INFO] Tests run: 72, Failures: 0, Errors: 0, Skipped: 0, Time elapsed: 1.739 s - in org.springframework.data.gemfire.IndexFactoryBeanTest
16-Feb-2019 21:45:05 [INFO] Running org.springframework.data.gemfire.util.RuntimeExceptionFactoryUnitTests
16-Feb-2019 21:45:05 [INFO] Tests run: 8, Failures: 0, Errors: 0, Skipped: 0, Time elapsed: 0.52 s - in org.springframework.data.gemfire.util.RuntimeExceptionFactoryUnitTests
16-Feb-2019 21:45:06 [INFO] Running org.springframework.data.gemfire.util.CollectionUtilsUnitTests
16-Feb-2019 21:45:07 [INFO] Tests run: 61, Failures: 0, Errors: 0, Skipped: 0, Time elapsed: 0.756 s - in org.springframework.data.gemfire.util.CollectionUtilsUnitTests
16-Feb-2019 21:45:07 [INFO] Running org.springframework.data.gemfire.util.SpringUtilsUnitTests
16-Feb-2019 21:45:08 [INFO] Tests run: 35, Failures: 0, Errors: 0, Skipped: 0, Time elapsed: 0.717 s - in org.springframework.data.gemfire.util.SpringUtilsUnitTests
16-Feb-2019 21:45:09 [INFO] Running org.springframework.data.gemfire.util.ArrayUtilsUnitTests
16-Feb-2019 21:45:09 [INFO] Tests run: 22, Failures: 0, Errors: 0, Skipped: 0, Time elapsed: 0.111 s - in org.springframework.data.gemfire.util.ArrayUtilsUnitTests
16-Feb-2019 21:45:09 [INFO] Running org.springframework.data.gemfire.util.PropertiesBuilderTests
16-Feb-2019 21:45:09 [INFO] Tests run: 21, Failures: 0, Errors: 0, Skipped: 0, Time elapsed: 0.151 s - in org.springframework.data.gemfire.util.PropertiesBuilderTests
16-Feb-2019 21:45:10 [INFO] Running org.springframework.data.gemfire.util.FilterUnitTests
16-Feb-2019 21:45:10 [INFO] Tests run: 6, Failures: 0, Errors: 0, Skipped: 0, Time elapsed: 0.554 s - in org.springframework.data.gemfire.util.FilterUnitTests
16-Feb-2019 21:45:11 [INFO] Running org.springframework.data.gemfire.util.RegionUtilsUnitTests
16-Feb-2019 21:45:11 [INFO] Tests run: 5, Failures: 0, Errors: 0, Skipped: 0, Time elapsed: 0.099 s - in org.springframework.data.gemfire.util.RegionUtilsUnitTests
16-Feb-2019 21:45:12 [INFO] Running org.springframework.data.gemfire.util.StreamUtilsTests
16-Feb-2019 21:45:12 [INFO] Tests run: 4, Failures: 0, Errors: 0, Skipped: 0, Time elapsed: 0.124 s - in org.springframework.data.gemfire.util.StreamUtilsTests
16-Feb-2019 21:45:12 [INFO] Running org.springframework.data.gemfire.AutoRegionLookupWithComponentScanningIntegrationTests
16-Feb-2019 21:45:13 [info 2019/02/16 21:45:13.582 UTC <main> tid=0x1] Detected default resource location "classpath:org/springframework/data/gemfire/AutoRegionLookupWithComponentScanningIntegrationTests-context.xml" for test class [org.springframework.data.gemfire.AutoRegionLookupWithComponentScanningIntegrationTests]
16-Feb-2019 21:45:13
16-Feb-2019 21:45:13 [info 2019/02/16 21:45:13.586 UTC <main> tid=0x1] GenericXmlContextLoader detected default locations for context configuration [ContextConfigurationAttributes@4efc180e declaringClass = 'org.springframework.data.gemfire.AutoRegionLookupWithComponentScanningIntegrationTests', classes = '{}', locations = '{classpath:org/springframework/data/gemfire/AutoRegionLookupWithComponentScanningIntegrationTests-context.xml}', inheritLocations = true, initializers = '{}', inheritInitializers = true, name = [null], contextLoaderClass = 'org.springframework.test.context.ContextLoader'].
16-Feb-2019 21:45:13
16-Feb-2019 21:45:13 [info 2019/02/16 21:45:13.589 UTC <main> tid=0x1] Could not detect default configuration classes for test class [org.springframework.data.gemfire.AutoRegionLookupWithComponentScanningIntegrationTests]: AutoRegionLookupWithComponentScanningIntegrationTests does not declare any static, non-private, non-final, nested classes annotated with @Configuration.
16-Feb-2019 21:45:13
16-Feb-2019 21:45:13 [info 2019/02/16 21:45:13.603 UTC <main> tid=0x1] Loaded default TestExecutionListener class names from location [META-INF/spring.factories]: [org.springframework.test.context.web.ServletTestExecutionListener, org.springframework.test.context.support.DirtiesContextBeforeModesTestExecutionListener, org.springframework.test.context.support.DependencyInjectionTestExecutionListener, org.springframework.test.context.support.DirtiesContextTestExecutionListener, org.springframework.test.context.transaction.TransactionalTestExecutionListener, org.springframework.test.context.jdbc.SqlScriptsTestExecutionListener]
16-Feb-2019 21:45:13
16-Feb-2019 21:45:13 [info 2019/02/16 21:45:13.616 UTC <main> tid=0x1] Using TestExecutionListeners: [org.springframework.test.context.support.DirtiesContextBeforeModesTestExecutionListener@59505b48, org.springframework.test.context.support.DependencyInjectionTestExecutionListener@4efac082, org.springframework.test.context.support.DirtiesContextTestExecutionListener@6bd61f98, org.springframework.test.context.transaction.TransactionalTestExecutionListener@48aca48b, org.springframework.test.context.jdbc.SqlScriptsTestExecutionListener@13fd2ccd]
16-Feb-2019 21:45:13
16-Feb-2019 21:45:16 [INFO] Tests run: 1, Failures: 0, Errors: 0, Skipped: 0, Time elapsed: 3.347 s - in org.springframework.data.gemfire.AutoRegionLookupWithComponentScanningIntegrationTests
16-Feb-2019 21:45:16 [INFO] Running org.springframework.data.gemfire.CacheServerIntegrationTest
16-Feb-2019 21:45:17 [info 2019/02/16 21:45:17.568 UTC <main> tid=0x1] Loaded default TestExecutionListener class names from location [META-INF/spring.factories]: [org.springframework.test.context.web.ServletTestExecutionListener, org.springframework.test.context.support.DirtiesContextBeforeModesTestExecutionListener, org.springframework.test.context.support.DependencyInjectionTestExecutionListener, org.springframework.test.context.support.DirtiesContextTestExecutionListener, org.springframework.test.context.transaction.TransactionalTestExecutionListener, org.springframework.test.context.jdbc.SqlScriptsTestExecutionListener]
16-Feb-2019 21:45:17
16-Feb-2019 21:45:17 [info 2019/02/16 21:45:17.579 UTC <main> tid=0x1] Using TestExecutionListeners: [org.springframework.test.context.support.DirtiesContextBeforeModesTestExecutionListener@26e356f0, org.springframework.test.context.support.DependencyInjectionTestExecutionListener@47d9a273, org.springframework.test.context.support.DirtiesContextTestExecutionListener@4b8ee4de, org.springframework.test.context.transaction.TransactionalTestExecutionListener@27f981c6, org.springframework.test.context.jdbc.SqlScriptsTestExecutionListener@1b11171f]
16-Feb-2019 21:45:17
16-Feb-2019 21:45:19 [warn 2019/02/16 21:45:19.559 UTC <main> tid=0x1] Handshaker max Pool size: 4
16-Feb-2019 21:45:19
16-Feb-2019 21:45:19 [INFO] Tests run: 1, Failures: 0, Errors: 0, Skipped: 0, Time elapsed: 2.828 s - in org.springframework.data.gemfire.CacheServerIntegrationTest
16-Feb-2019 21:45:19 [INFO]
16-Feb-2019 21:45:19 [INFO] Results:
16-Feb-2019 21:45:19 [INFO]
16-Feb-2019 21:45:19 [WARNING] Tests run: 2472, Failures: 0, Errors: 0, Skipped: 2
16-Feb-2019 21:45:19 [INFO]
16-Feb-2019 21:45:20 [INFO]
16-Feb-2019 21:45:20 [INFO] --- build-helper-maven-plugin:3.0.0:add-source (add-kotlin-source) @ spring-data-gemfire ---
16-Feb-2019 21:45:20 [INFO] Source directory: /opt/bamboo-home/xml-data/build-dir/SGF-NJDK8-JOB1/src/main/kotlin added.
16-Feb-2019 21:45:20 [INFO]
16-Feb-2019 21:45:20 [INFO] --- maven-jar-plugin:3.1.0:jar (default-jar) @ spring-data-gemfire ---
16-Feb-2019 21:45:20 [INFO] Building jar: /opt/bamboo-home/xml-data/build-dir/SGF-NJDK8-JOB1/target/spring-data-gemfire-2.2.0.BUILD-SNAPSHOT.jar
16-Feb-2019 21:45:20 [INFO]
16-Feb-2019 21:45:20 [INFO] >>> maven-source-plugin:3.0.1:jar (attach-sources) > generate-sources @ spring-data-gemfire >>>
16-Feb-2019 21:45:20 [INFO]
16-Feb-2019 21:45:20 [INFO] --- maven-enforcer-plugin:1.4.1:enforce (enforce-maven-version) @ spring-data-gemfire ---
16-Feb-2019 21:45:20 [INFO]
16-Feb-2019 21:45:20 [INFO] <<< maven-source-plugin:3.0.1:jar (attach-sources) < generate-sources @ spring-data-gemfire <<<
16-Feb-2019 21:45:20 [INFO]
16-Feb-2019 21:45:20 [INFO]
16-Feb-2019 21:45:20 [INFO] --- maven-source-plugin:3.0.1:jar (attach-sources) @ spring-data-gemfire ---
16-Feb-2019 21:45:20 [INFO] Building jar: /opt/bamboo-home/xml-data/build-dir/SGF-NJDK8-JOB1/target/spring-data-gemfire-2.2.0.BUILD-SNAPSHOT-sources.jar
16-Feb-2019 21:45:20 [INFO]
16-Feb-2019 21:45:20 [INFO] --- maven-install-plugin:2.4:install (default-install) @ spring-data-gemfire ---
16-Feb-2019 21:45:20 [INFO] Installing /opt/bamboo-home/xml-data/build-dir/SGF-NJDK8-JOB1/target/spring-data-gemfire-2.2.0.BUILD-SNAPSHOT.jar to /home/bamboo/.m2/repository/org/springframework/data/spring-data-gemfire/2.2.0.BUILD-SNAPSHOT/spring-data-gemfire-2.2.0.BUILD-SNAPSHOT.jar
16-Feb-2019 21:45:20 [INFO] Installing /opt/bamboo-home/xml-data/build-dir/SGF-NJDK8-JOB1/pom.xml to /home/bamboo/.m2/repository/org/springframework/data/spring-data-gemfire/2.2.0.BUILD-SNAPSHOT/spring-data-gemfire-2.2.0.BUILD-SNAPSHOT.pom
16-Feb-2019 21:45:21 [INFO] Installing /opt/bamboo-home/xml-data/build-dir/SGF-NJDK8-JOB1/target/spring-data-gemfire-2.2.0.BUILD-SNAPSHOT-sources.jar to /home/bamboo/.m2/repository/org/springframework/data/spring-data-gemfire/2.2.0.BUILD-SNAPSHOT/spring-data-gemfire-2.2.0.BUILD-SNAPSHOT-sources.jar
16-Feb-2019 21:45:21 [INFO] Artifactory Build Info Recorder: deploy artifacts set to false, artifacts will not be deployed...
16-Feb-2019 21:45:21 [INFO] Artifactory Build Info Recorder: publish build info set to false, build info will not be published...
16-Feb-2019 21:45:21 [INFO] ------------------------------------------------------------------------
16-Feb-2019 21:45:21 [INFO] BUILD SUCCESS
16-Feb-2019 21:45:21 [INFO] ------------------------------------------------------------------------
16-Feb-2019 21:45:21 [INFO] Total time: 15:08 min
16-Feb-2019 21:45:21 [INFO] Finished at: 2019-02-16T21:45:21Z
16-Feb-2019 21:45:21 [INFO] Final Memory: 66M/1625M
16-Feb-2019 21:45:21 [INFO] ------------------------------------------------------------------------
16-Feb-2019 21:45:21 Parsing test results under /opt/bamboo-home/xml-data/build-dir/SGF-NJDK8-JOB1...
16-Feb-2019 21:45:21 Finished task 'Night SDG Maven build on JDK 8 with mocks enabled.' with result: Success
16-Feb-2019 21:45:21 Running post build plugin 'Docker Container Cleanup'
16-Feb-2019 21:45:21 Running post build plugin 'NCover Results Collector'
16-Feb-2019 21:45:21 Running post build plugin 'Artifactory Release Management Staging'
16-Feb-2019 21:45:21 Running post build plugin 'Artifactory Build Info Copier'
16-Feb-2019 21:45:21 Running post build plugin 'Artifactory Gradle Properties Info Copier'
16-Feb-2019 21:45:21 Running post build plugin 'Clover Results Collector'
16-Feb-2019 21:45:21 Running post build plugin 'npm Cache Cleanup'
16-Feb-2019 21:45:21 Running post build plugin 'Artifact Copier'
16-Feb-2019 21:45:21 Successfully removed working directory at '/opt/bamboo-home/xml-data/build-dir/SGF-NJDK8-JOB1'
16-Feb-2019 21:45:21 Finalising the build...
16-Feb-2019 21:45:21 Stopping timer.
16-Feb-2019 21:45:21 Build SGF-NJDK8-JOB1-1305 completed.
16-Feb-2019 21:45:21 Running on server: post build plugin 'NCover Results Collector'
16-Feb-2019 21:45:21 Running on server: post build plugin 'Build Hanging Detection Configuration'
16-Feb-2019 21:45:21 Running on server: post build plugin 'Clover Delta Calculator'
16-Feb-2019 21:45:21 Running on server: post build plugin 'Maven Dependencies Postprocessor'
16-Feb-2019 21:45:21 All post build plugins have finished
16-Feb-2019 21:45:21 Generating build results summary...
16-Feb-2019 21:45:38 Saving build results to disk...
16-Feb-2019 21:45:38 Logging substituted variables...
16-Feb-2019 21:45:38 Indexing build results...
16-Feb-2019 21:45:38 Finished building SGF-NJDK8-JOB1-1305.