Nightly build of Spring Data GemFire master with Mocks enabled.

Build: #1309 was successful

Job: Default Job was successful

Stages & jobs

  1. Default Stage

Build log

The build generated 10,371 lines of output.The output is too long and has been truncated to the last 1,000 lines. Download or view full build log

20-Feb-2019 01:59:00   /home/bamboo/.m2/repository/net/bytebuddy/byte-buddy/1.9.3/byte-buddy-1.9.3.jar
20-Feb-2019 01:59:00   /home/bamboo/.m2/repository/net/bytebuddy/byte-buddy-agent/1.9.3/byte-buddy-agent-1.9.3.jar
20-Feb-2019 01:59:00   /home/bamboo/.m2/repository/org/objenesis/objenesis/2.6/objenesis-2.6.jar
20-Feb-2019 01:59:00   /home/bamboo/.m2/repository/org/springframework/spring-test/5.1.5.RELEASE/spring-test-5.1.5.RELEASE.jar
20-Feb-2019 01:59:00   /home/bamboo/.m2/repository/org/slf4j/slf4j-api/1.7.25/slf4j-api-1.7.25.jar
20-Feb-2019 01:59:00   /home/bamboo/.m2/repository/ch/qos/logback/logback-classic/1.2.3/logback-classic-1.2.3.jar
20-Feb-2019 01:59:00   /home/bamboo/.m2/repository/ch/qos/logback/logback-core/1.2.3/logback-core-1.2.3.jar
20-Feb-2019 01:59:00   /home/bamboo/.m2/repository/org/projectlombok/lombok/1.18.6/lombok-1.18.6.jar
20-Feb-2019 01:59:00   /home/bamboo/.m2/repository/org/apache/maven/surefire/surefire-junit4/2.22.1/surefire-junit4-2.22.1.jar
20-Feb-2019 01:59:00 Library Path:
20-Feb-2019 01:59:00   /usr/java/packages/lib/amd64
20-Feb-2019 01:59:00   /usr/lib64
20-Feb-2019 01:59:00   /lib64
20-Feb-2019 01:59:00   /lib
20-Feb-2019 01:59:00   /usr/lib
20-Feb-2019 01:59:00 System Properties:
20-Feb-2019 01:59:00     artifactory.publish.password = ********
20-Feb-2019 01:59:00     awt.toolkit = sun.awt.X11.XToolkit
20-Feb-2019 01:59:00     basedir = /opt/bamboo-home/xml-data/build-dir/SGF-NJDK8-JOB1
20-Feb-2019 01:59:00     file.encoding = UTF-8
20-Feb-2019 01:59:00     file.encoding.pkg = sun.io
20-Feb-2019 01:59:00     file.separator = /
20-Feb-2019 01:59:00     gemfire.disableShutdownHook = true
20-Feb-2019 01:59:00     java.awt.graphicsenv = sun.awt.X11GraphicsEnvironment
20-Feb-2019 01:59:00     java.awt.printerjob = sun.print.PSPrinterJob
20-Feb-2019 01:59:00     java.class.version = 52.0
20-Feb-2019 01:59:00     java.endorsed.dirs = /opt/jdk1.8.0_144/jre/lib/endorsed
20-Feb-2019 01:59:00     java.ext.dirs = /opt/jdk1.8.0_144/jre/lib/ext:/usr/java/packages/lib/ext
20-Feb-2019 01:59:00     java.home = /opt/jdk1.8.0_144/jre
20-Feb-2019 01:59:00     java.io.tmpdir = /tmp
20-Feb-2019 01:59:00     java.runtime.name = Java(TM) SE Runtime Environment
20-Feb-2019 01:59:00     java.runtime.version = 1.8.0_144-b01
20-Feb-2019 01:59:00     java.specification.name = Java Platform API Specification
20-Feb-2019 01:59:00     java.specification.vendor = Oracle Corporation
20-Feb-2019 01:59:00     java.specification.version = 1.8
20-Feb-2019 01:59:00     java.vendor = Oracle Corporation
20-Feb-2019 01:59:00     java.vendor.url = http://java.oracle.com/
20-Feb-2019 01:59:00     java.vendor.url.bug = http://bugreport.sun.com/bugreport/
20-Feb-2019 01:59:00     java.version = 1.8.0_144
20-Feb-2019 01:59:00     java.vm.info = mixed mode
20-Feb-2019 01:59:00     java.vm.name = Java HotSpot(TM) 64-Bit Server VM
20-Feb-2019 01:59:00     java.vm.specification.name = Java Virtual Machine Specification
20-Feb-2019 01:59:00     java.vm.specification.vendor = Oracle Corporation
20-Feb-2019 01:59:00     java.vm.specification.version = 1.8
20-Feb-2019 01:59:00     java.vm.vendor = Oracle Corporation
20-Feb-2019 01:59:00     java.vm.version = 25.144-b01
20-Feb-2019 01:59:00     javax.net.ssl.keyStore = ********
20-Feb-2019 01:59:00     line.separator =
20-Feb-2019 01:59:00
20-Feb-2019 01:59:00     localRepository = /home/bamboo/.m2/repository
20-Feb-2019 01:59:00     logback.log.level = error
20-Feb-2019 01:59:00     os.version = 4.4.0-141-generic
20-Feb-2019 01:59:00     path.separator = :
20-Feb-2019 01:59:00     spring.profiles.active = apache-geode
20-Feb-2019 01:59:00     sun.arch.data.model = 64
20-Feb-2019 01:59:00     sun.boot.class.path = /opt/jdk1.8.0_144/jre/lib/resources.jar:/opt/jdk1.8.0_144/jre/lib/rt.jar:/opt/jdk1.8.0_144/jre/lib/sunrsasign.jar:/opt/jdk1.8.0_144/jre/lib/jsse.jar:/opt/jdk1.8.0_144/jre/lib/jce.jar:/opt/jdk1.8.0_144/jre/lib/charsets.jar:/opt/jdk1.8.0_144/jre/lib/jfr.jar:/opt/jdk1.8.0_144/jre/classes
20-Feb-2019 01:59:00     sun.boot.library.path = /opt/jdk1.8.0_144/jre/lib/amd64
20-Feb-2019 01:59:00     sun.cpu.endian = little
20-Feb-2019 01:59:00     sun.cpu.isalist =
20-Feb-2019 01:59:00     sun.io.unicode.encoding = UnicodeLittle
20-Feb-2019 01:59:00     sun.java.command = org.apache.maven.surefire.booter.ForkedBooter /opt/bamboo-home/xml-data/build-dir/SGF-NJDK8-JOB1/target/surefire 2019-02-20T01-46-14_432-jvmRun1 surefire3666339979977061687tmp surefire_2915784484890301620744tmp
20-Feb-2019 01:59:00     sun.java.launcher = SUN_STANDARD
20-Feb-2019 01:59:00     sun.jnu.encoding = UTF-8
20-Feb-2019 01:59:00     sun.management.compiler = HotSpot 64-Bit Tiered Compilers
20-Feb-2019 01:59:00     sun.nio.ch.bugLevel =
20-Feb-2019 01:59:00     sun.os.patch.level = unknown
20-Feb-2019 01:59:00     surefire.test.class.path = /opt/bamboo-home/xml-data/build-dir/SGF-NJDK8-JOB1/target/test-classes:/opt/bamboo-home/xml-data/build-dir/SGF-NJDK8-JOB1/target/classes:/home/bamboo/.m2/repository/javax/cache/cache-api/1.0.0/cache-api-1.0.0.jar:/home/bamboo/.m2/repository/org/apache/geronimo/specs/geronimo-jcdi_2.0_spec/1.0.1/geronimo-jcdi_2.0_spec-1.0.1.jar:/home/bamboo/.m2/repository/javax/interceptor/javax.interceptor-api/1.2.1/javax.interceptor-api-1.2.1.jar:/home/bamboo/.m2/repository/javax/el/el-api/2.2/el-api-2.2.jar:/home/bamboo/.m2/repository/javax/enterprise/cdi-api/1.0/cdi-api-1.0.jar:/home/bamboo/.m2/repository/org/jboss/interceptor/jboss-interceptor-api/1.1/jboss-interceptor-api-1.1.jar:/home/bamboo/.m2/repository/javax/annotation/jsr250-api/1.0/jsr250-api-1.0.jar:/home/bamboo/.m2/repository/javax/inject/javax.inject/1/javax.inject-1.jar:/home/bamboo/.m2/repository/org/springframework/spring-context-support/5.1.5.RELEASE/spring-context-support-5.1.5.RELEASE.jar:/home/bamboo/.m2/repository/org/springframework/spring-beans/5.1.5.RELEASE/spring-beans-5.1.5.RELEASE.jar:/home/bamboo/.m2/repository/org/springframework/spring-context/5.1.5.RELEASE/spring-context-5.1.5.RELEASE.jar:/home/bamboo/.m2/repository/org/springframework/spring-aop/5.1.5.RELEASE/spring-aop-5.1.5.RELEASE.jar:/home/bamboo/.m2/repository/org/springframework/spring-expression/5.1.5.RELEASE/spring-expression-5.1.5.RELEASE.jar:/home/bamboo/.m2/repository/org/springframework/spring-core/5.1.5.RELEASE/spring-core-5.1.5.RELEASE.jar:/home/bamboo/.m2/repository/org/springframework/spring-jcl/5.1.5.RELEASE/spring-jcl-5.1.5.RELEASE.jar:/home/bamboo/.m2/repository/org/springframework/spring-tx/5.1.5.RELEASE/spring-tx-5.1.5.RELEASE.jar:/home/bamboo/.m2/repository/org/springframework/spring-web/5.1.5.RELEASE/spring-web-5.1.5.RELEASE.jar:/home/bamboo/.m2/repository/org/springframework/data/spring-data-commons/2.2.0.BUILD-SNAPSHOT/spring-data-commons-2.2.0.BUILD-SNAPSHOT.jar:/home/bamboo/.m2/repository/io/pivotal/gemfire/geode-core/9.7.0/geode-core-9.7.0.jar:/home/bamboo/.m2/repository/com/github/stephenc/findbugs/findbugs-annotations/1.3.9-1/findbugs-annotations-1.3.9-1.jar:/home/bamboo/.m2/repository/org/jgroups/jgroups/3.6.14.Final/jgroups-3.6.14.Final.jar:/home/bamboo/.m2/repository/commons-io/commons-io/2.6/commons-io-2.6.jar:/home/bamboo/.m2/repository/commons-validator/commons-validator/1.6/commons-validator-1.6.jar:/home/bamboo/.m2/repository/commons-beanutils/commons-beanutils/1.9.2/commons-beanutils-1.9.2.jar:/home/bamboo/.m2/repository/commons-logging/commons-logging/1.2/commons-logging-1.2.jar:/home/bamboo/.m2/repository/commons-collections/commons-collections/3.2.2/commons-collections-3.2.2.jar:/home/bamboo/.m2/repository/commons-digester/commons-digester/2.1/commons-digester-2.1.jar:/home/bamboo/.m2/repository/javax/activation/activation/1.1.1/activation-1.1.1.jar:/home/bamboo/.m2/repository/javax/xml/bind/jaxb-api/2.2.11/jaxb-api-2.2.11.jar:/home/bamboo/.m2/repository/com/sun/xml/bind/jaxb-core/2.2.11/jaxb-core-2.2.11.jar:/home/bamboo/.m2/repository/com/sun/xml/bind/jaxb-impl/2.2.11/jaxb-impl-2.2.11.jar:/home/bamboo/.m2/repository/commons-lang/commons-lang/2.6/commons-lang-2.6.jar:/home/bamboo/.m2/repository/it/unimi/dsi/fastutil/8.2.1/fastutil-8.2.1.jar:/home/bamboo/.m2/repository/javax/resource/javax.resource-api/1.7/javax.resource-api-1.7.jar:/home/bamboo/.m2/repository/javax/transaction/javax.transaction-api/1.2/javax.transaction-api-1.2.jar:/home/bamboo/.m2/repository/net/java/dev/jna/jna/4.1.0/jna-4.1.0.jar:/home/bamboo/.m2/repository/net/sf/jopt-simple/jopt-simple/5.0.4/jopt-simple-5.0.4.jar:/home/bamboo/.m2/repository/org/apache/logging/log4j/log4j-api/2.11.0/log4j-api-2.11.0.jar:/home/bamboo/.m2/repository/org/apache/logging/log4j/log4j-core/2.11.0/log4j-core-2.11.0.jar:/home/bamboo/.m2/repository/org/apache/shiro/shiro-core/1.4.0/shiro-core-1.4.0.jar:/home/bamboo/.m2/repository/org/apache/shiro/shiro-lang/1.4.0/shiro-lang-1.4.0.jar:/home/bamboo/.m2/repository/org/apache/shiro/shiro-cache/1.4.0/shiro-cache-1.4.0.jar:/home/bamboo/.m2/repository/org/apache/shiro/shiro-crypto-hash/1.4.0/shiro-crypto-hash-1.4.0.jar:/home/bamboo/.m2/repository/org/apache/shiro/shiro-crypto-core/1.4.0/shiro-crypto-core-1.4.0.jar:/home/bamboo/.m2/repository/org/apache/shiro/shiro-crypto-cipher/1.4.0/shiro-crypto-cipher-1.4.0.jar:/home/bamboo/.m2/repository/org/apache/shiro/shiro-config-core/1.4.0/shiro-config-core-1.4.0.jar:/home/bamboo/.m2/repository/org/apache/shiro/shiro-config-ogdl/1.4.0/shiro-config-ogdl-1.4.0.jar:/home/bamboo/.m2/repository/org/apache/shiro/shiro-event/1.4.0/shiro-event-1.4.0.jar:/home/bamboo/.m2/repository/io/github/classgraph/classgraph/4.0.6/classgraph-4.0.6.jar:/home/bamboo/.m2/repository/com/healthmarketscience/rmiio/rmiio/2.1.2/rmiio-2.1.2.jar:/home/bamboo/.m2/repository/io/pivotal/gemfire/geode-common/9.7.0/geode-common-9.7.0.jar:/home/bamboo/.m2/repository/io/pivotal/gemfire/geode-json/9.7.0/geode-json-9.7.0.jar:/home/bamboo/.m2/repository/io/pivotal/gemfire/geode-cq/9.7.0/geode-cq-9.7.0.jar:/home/bamboo/.m2/repository/io/pivotal/gemfire/geode-lucene/9.7.0/geode-lucene-9.7.0.jar:/home/bamboo/.m2/repository/org/apache/lucene/lucene-core/6.6.2/lucene-core-6.6.2.jar:/home/bamboo/.m2/repository/mx4j/mx4j/3.0.2/mx4j-3.0.2.jar:/home/bamboo/.m2/repository/org/apache/lucene/lucene-analyzers-common/6.6.2/lucene-analyzers-common-6.6.2.jar:/home/bamboo/.m2/repository/org/apache/lucene/lucene-queryparser/6.6.2/lucene-queryparser-6.6.2.jar:/home/bamboo/.m2/repository/org/apache/lucene/lucene-queries/6.6.2/lucene-queries-6.6.2.jar:/home/bamboo/.m2/repository/org/apache/lucene/lucene-analyzers-phonetic/6.6.2/lucene-analyzers-phonetic-6.6.2.jar:/home/bamboo/.m2/repository/commons-codec/commons-codec/1.10/commons-codec-1.10.jar:/home/bamboo/.m2/repository/io/pivotal/gemfire/geode-wan/9.7.0/geode-wan-9.7.0.jar:/home/bamboo/.m2/repository/antlr/antlr/2.7.7/antlr-2.7.7.jar:/home/bamboo/.m2/repository/org/apache/shiro/shiro-spring/1.3.2/shiro-spring-1.3.2.jar:/home/bamboo/.m2/repository/org/apache/shiro/shiro-web/1.3.2/shiro-web-1.3.2.jar:/home/bamboo/.m2/repository/org/aspectj/aspectjweaver/1.9.2/aspectjweaver-1.9.2.jar:/home/bamboo/.m2/repository/com/fasterxml/jackson/core/jackson-annotations/2.9.0/jackson-annotations-2.9.0.jar:/home/bamboo/.m2/repository/com/fasterxml/jackson/core/jackson-databind/2.9.8/jackson-databind-2.9.8.jar:/home/bamboo/.m2/repository/com/fasterxml/jackson/core/jackson-core/2.9.8/jackson-core-2.9.8.jar:/home/bamboo/.m2/repository/org/slf4j/jcl-over-slf4j/1.7.25/jcl-over-slf4j-1.7.25.jar:/home/bamboo/.m2/repository/javax/annotation/javax.annotation-api/1.3/javax.annotation-api-1.3.jar:/home/bamboo/.m2/repository/org/assertj/assertj-core/3.12.0/assertj-core-3.12.0.jar:/home/bamboo/.m2/repository/org/apache/derby/derbyLocale_zh_TW/10.9.1.0/derbyLocale_zh_TW-10.9.1.0.jar:/home/bamboo/.m2/repository/org/apache/derby/derby/10.9.1.0/derby-10.9.1.0.jar:/home/bamboo/.m2/repository/org/apache/openwebbeans/openwebbeans-se/2.0.10/openwebbeans-se-2.0.10.jar:/home/bamboo/.m2/repository/org/apache/openwebbeans/openwebbeans-impl/2.0.10/openwebbeans-impl-2.0.10.jar:/home/bamboo/.m2/repository/org/apache/xbean/xbean-finder-shaded/4.12/xbean-finder-shaded-4.12.jar:/home/bamboo/.m2/repository/org/apache/xbean/xbean-asm7-shaded/4.12/xbean-asm7-shaded-4.12.jar:/home/bamboo/.m2/repository/org/apache/openwebbeans/openwebbeans-spi/2.0.10/openwebbeans-spi-2.0.10.jar:/home/bamboo/.m2/repository/edu/umd/cs/mtc/multithreadedtc/1.01/multithreadedtc-1.01.jar:/home/bamboo/.m2/repository/org/iq80/snappy/snappy/0.4/snappy-0.4.jar:/home/bamboo/.m2/repository/org/springframework/shell/spring-shell/1.2.0.RELEASE/spring-shell-1.2.0.RELEASE.jar:/home/bamboo/.m2/repository/com/google/guava/guava/17.0/guava-17.0.jar:/home/bamboo/.m2/repository/jline/jline/2.12/jline-2.12.jar:/home/bamboo/.m2/repository/org/hamcrest/hamcrest-library/1.3/hamcrest-library-1.3.jar:/home/bamboo/.m2/repository/org/hamcrest/hamcrest-core/1.3/hamcrest-core-1.3.jar:/home/bamboo/.m2/repository/junit/junit/4.12/junit-4.12.jar:/home/bamboo/.m2/repository/org/mockito/mockito-core/2.23.4/mockito-core-2.23.4.jar:/home/bamboo/.m2/repository/net/bytebuddy/byte-buddy/1.9.3/byte-buddy-1.9.3.jar:/home/bamboo/.m2/repository/net/bytebuddy/byte-buddy-agent/1.9.3/byte-buddy-agent-1.9.3.jar:/home/bamboo/.m2/repository/org/objenesis/objenesis/2.6/objenesis-2.6.jar:/home/bamboo/.m2/repository/org/springframework/spring-test/5.1.5.RELEASE/spring-test-5.1.5.RELEASE.jar:/home/bamboo/.m2/repository/org/slf4j/slf4j-api/1.7.25/slf4j-api-1.7.25.jar:/home/bamboo/.m2/repository/ch/qos/logback/logback-classic/1.2.3/logback-classic-1.2.3.jar:/home/bamboo/.m2/repository/ch/qos/logback/logback-core/1.2.3/logback-core-1.2.3.jar:/home/bamboo/.m2/repository/org/projectlombok/lombok/1.18.6/lombok-1.18.6.jar:
20-Feb-2019 01:59:00     user.country = US
20-Feb-2019 01:59:00     user.language = en
20-Feb-2019 01:59:00     user.timezone = Etc/UTC
20-Feb-2019 01:59:00 Log4J 2 Configuration:
20-Feb-2019 01:59:00     jar:file:/opt/users/bamboo/.m2/repository/io/pivotal/gemfire/geode-core/9.7.0/geode-core-9.7.0.jar!/log4j2.xml
20-Feb-2019 01:59:00 ---------------------------------------------------------------------------
20-Feb-2019 01:59:00
20-Feb-2019 01:59:00
20-Feb-2019 01:59:00 [info 2019/02/20 01:59:00.719 UTC <main> tid=0x1] initializing InternalDataSerializer with 3 services
20-Feb-2019 01:59:00
20-Feb-2019 01:59:00 [info 2019/02/20 01:59:00.738 UTC <main> tid=0x1] [ThreadsMonitor] New Monitor object and process were created.
20-Feb-2019 01:59:00
20-Feb-2019 01:59:00
20-Feb-2019 01:59:00 [info 2019/02/20 01:59:00.760 UTC <StatSampler> tid=0x12] Disabling statistic archival.
20-Feb-2019 01:59:00
20-Feb-2019 01:59:00 [info 2019/02/20 01:59:00.796 UTC <main> tid=0x1] Running in local mode since no locators were specified.
20-Feb-2019 01:59:00
20-Feb-2019 01:59:00 [info 2019/02/20 01:59:00.972 UTC <main> tid=0x1] Initializing region _monitoringRegion_10.194.6.22<v-1>0
20-Feb-2019 01:59:00
20-Feb-2019 01:59:00 [info 2019/02/20 01:59:00.979 UTC <main> tid=0x1] Initialization of region _monitoringRegion_10.194.6.22<v-1>0 completed
20-Feb-2019 01:59:00
20-Feb-2019 01:59:01 [info 2019/02/20 01:59:01.639 UTC <main> tid=0x1] Initialized cache service org.apache.geode.cache.lucene.internal.LuceneServiceImpl
20-Feb-2019 01:59:01
20-Feb-2019 01:59:01 [info 2019/02/20 01:59:01.639 UTC <main> tid=0x1] Loading previously deployed jars
20-Feb-2019 01:59:01
20-Feb-2019 01:59:01 [info 2019/02/20 01:59:01.657 UTC <main> tid=0x1] Connected to Distributed System [BasicSubRegionConfig] as Member [bamboo-12(BasicSubRegionConfig:4527:loner):0:78a9a008:BasicSubRegionConfig] in Group(s) [[]] with Role(s) [[]] on Host [bamboo-12.af.pivotal.io] having PID [4527]
20-Feb-2019 01:59:01
20-Feb-2019 01:59:01 [info 2019/02/20 01:59:01.659 UTC <main> tid=0x1] Created new Pivotal GemFire version [9.7.0] Cache [BasicSubRegionConfig]
20-Feb-2019 01:59:01
20-Feb-2019 01:59:01 [info 2019/02/20 01:59:01.675 UTC <main> tid=0x1] Falling back to creating Region [r-region] in Cache [BasicSubRegionConfig]
20-Feb-2019 01:59:01
20-Feb-2019 01:59:01 [info 2019/02/20 01:59:01.682 UTC <main> tid=0x1] Created Region [r-region]
20-Feb-2019 01:59:01
20-Feb-2019 01:59:01 [info 2019/02/20 01:59:01.694 UTC <main> tid=0x1] Falling back to creating Region [c-region] in Cache [BasicSubRegionConfig]
20-Feb-2019 01:59:01
20-Feb-2019 01:59:01 [info 2019/02/20 01:59:01.695 UTC <main> tid=0x1] Created Region [c-region]
20-Feb-2019 01:59:01
20-Feb-2019 01:59:01 [info 2019/02/20 01:59:01.738 UTC <main> tid=0x1] Began transaction (1) for test context [DefaultTestContext@706fe5c6 testClass = TxIntegrationTest, testInstance = org.springframework.data.gemfire.TxIntegrationTest@6c15e8c7, testMethod = testTransactionCommit@TxIntegrationTest, testException = [null], mergedContextConfiguration = [MergedContextConfiguration@56380231 testClass = TxIntegrationTest, locations = '{classpath:/org/springframework/data/gemfire/basic-tx-config.xml}', classes = '{}', contextInitializerClasses = '[]', activeProfiles = '{}', propertySourceLocations = '{}', propertySourceProperties = '{}', contextCustomizers = set[[empty]], contextLoader = 'org.springframework.test.context.support.DelegatingSmartContextLoader', parent = [null]], attributes = map[[empty]]]; transaction manager [org.springframework.data.gemfire.transaction.GemfireTransactionManager@64f1fd08]; rollback [false]
20-Feb-2019 01:59:01
20-Feb-2019 01:59:01 [info 2019/02/20 01:59:01.758 UTC <main> tid=0x1] Committed transaction for test: [DefaultTestContext@706fe5c6 testClass = TxIntegrationTest, testInstance = org.springframework.data.gemfire.TxIntegrationTest@6c15e8c7, testMethod = testTransactionCommit@TxIntegrationTest, testException = [null], mergedContextConfiguration = [MergedContextConfiguration@56380231 testClass = TxIntegrationTest, locations = '{classpath:/org/springframework/data/gemfire/basic-tx-config.xml}', classes = '{}', contextInitializerClasses = '[]', activeProfiles = '{}', propertySourceLocations = '{}', propertySourceProperties = '{}', contextCustomizers = set[[empty]], contextLoader = 'org.springframework.test.context.support.DelegatingSmartContextLoader', parent = [null]], attributes = map[[empty]]]
20-Feb-2019 01:59:01
20-Feb-2019 01:59:01 [info 2019/02/20 01:59:01.765 UTC <main> tid=0x1] Began transaction (1) for test context [DefaultTestContext@706fe5c6 testClass = TxIntegrationTest, testInstance = org.springframework.data.gemfire.TxIntegrationTest@1d5d5621, testMethod = testTransactionRollback@TxIntegrationTest, testException = [null], mergedContextConfiguration = [MergedContextConfiguration@56380231 testClass = TxIntegrationTest, locations = '{classpath:/org/springframework/data/gemfire/basic-tx-config.xml}', classes = '{}', contextInitializerClasses = '[]', activeProfiles = '{}', propertySourceLocations = '{}', propertySourceProperties = '{}', contextCustomizers = set[[empty]], contextLoader = 'org.springframework.test.context.support.DelegatingSmartContextLoader', parent = [null]], attributes = map[[empty]]]; transaction manager [org.springframework.data.gemfire.transaction.GemfireTransactionManager@64f1fd08]; rollback [true]
20-Feb-2019 01:59:01
20-Feb-2019 01:59:01 [info 2019/02/20 01:59:01.766 UTC <main> tid=0x1] Rolled back transaction for test: [DefaultTestContext@706fe5c6 testClass = TxIntegrationTest, testInstance = org.springframework.data.gemfire.TxIntegrationTest@1d5d5621, testMethod = testTransactionRollback@TxIntegrationTest, testException = [null], mergedContextConfiguration = [MergedContextConfiguration@56380231 testClass = TxIntegrationTest, locations = '{classpath:/org/springframework/data/gemfire/basic-tx-config.xml}', classes = '{}', contextInitializerClasses = '[]', activeProfiles = '{}', propertySourceLocations = '{}', propertySourceProperties = '{}', contextCustomizers = set[[empty]], contextLoader = 'org.springframework.test.context.support.DelegatingSmartContextLoader', parent = [null]], attributes = map[[empty]]]
20-Feb-2019 01:59:01
20-Feb-2019 01:59:01 [INFO] Tests run: 2, Failures: 0, Errors: 0, Skipped: 0, Time elapsed: 2.616 s - in org.springframework.data.gemfire.TxIntegrationTest
20-Feb-2019 01:59:01 [info 2019/02/20 01:59:01.784 UTC <Thread-5> tid=0x23] GemFireCache[id = 1256893889; isClosing = true; isShutDownAll = false; created = Wed Feb 20 01:59:00 UTC 2019; server = false; copyOnRead = true; lockLease = 120; lockTimeout = 60]: Now closing.
20-Feb-2019 01:59:01
20-Feb-2019 01:59:02 [INFO] Running org.springframework.data.gemfire.wan.OrderPolicyConverterUnitTests
20-Feb-2019 01:59:02 [INFO] Tests run: 4, Failures: 0, Errors: 0, Skipped: 0, Time elapsed: 0.106 s - in org.springframework.data.gemfire.wan.OrderPolicyConverterUnitTests
20-Feb-2019 01:59:02 [INFO] Running org.springframework.data.gemfire.wan.AsyncEventQueueFactoryBeanTest
20-Feb-2019 01:59:04 [INFO] Tests run: 11, Failures: 0, Errors: 0, Skipped: 0, Time elapsed: 1.24 s - in org.springframework.data.gemfire.wan.AsyncEventQueueFactoryBeanTest
20-Feb-2019 01:59:04 [INFO] Running org.springframework.data.gemfire.wan.ManualGatewayReceiverStartIntegrationTest
20-Feb-2019 01:59:05 [info 2019/02/20 01:59:05.532 UTC <main> tid=0x1] Detected default resource location "classpath:org/springframework/data/gemfire/wan/ManualGatewayReceiverStartIntegrationTest-context.xml" for test class [org.springframework.data.gemfire.wan.ManualGatewayReceiverStartIntegrationTest]
20-Feb-2019 01:59:05
20-Feb-2019 01:59:05 [info 2019/02/20 01:59:05.536 UTC <main> tid=0x1] GenericXmlContextLoader detected default locations for context configuration [ContextConfigurationAttributes@156b88f5 declaringClass = 'org.springframework.data.gemfire.wan.ManualGatewayReceiverStartIntegrationTest', classes = '{}', locations = '{classpath:org/springframework/data/gemfire/wan/ManualGatewayReceiverStartIntegrationTest-context.xml}', inheritLocations = true, initializers = '{class org.springframework.data.gemfire.test.GemfireTestApplicationContextInitializer}', inheritInitializers = true, name = [null], contextLoaderClass = 'org.springframework.test.context.ContextLoader'].
20-Feb-2019 01:59:05
20-Feb-2019 01:59:05 [info 2019/02/20 01:59:05.537 UTC <main> tid=0x1] Could not detect default configuration classes for test class [org.springframework.data.gemfire.wan.ManualGatewayReceiverStartIntegrationTest]: ManualGatewayReceiverStartIntegrationTest does not declare any static, non-private, non-final, nested classes annotated with @Configuration.
20-Feb-2019 01:59:05
20-Feb-2019 01:59:05 [info 2019/02/20 01:59:05.551 UTC <main> tid=0x1] Loaded default TestExecutionListener class names from location [META-INF/spring.factories]: [org.springframework.test.context.web.ServletTestExecutionListener, org.springframework.test.context.support.DirtiesContextBeforeModesTestExecutionListener, org.springframework.test.context.support.DependencyInjectionTestExecutionListener, org.springframework.test.context.support.DirtiesContextTestExecutionListener, org.springframework.test.context.transaction.TransactionalTestExecutionListener, org.springframework.test.context.jdbc.SqlScriptsTestExecutionListener]
20-Feb-2019 01:59:05
20-Feb-2019 01:59:05 [info 2019/02/20 01:59:05.559 UTC <main> tid=0x1] Using TestExecutionListeners: [org.springframework.test.context.support.DirtiesContextBeforeModesTestExecutionListener@48aca48b, org.springframework.test.context.support.DependencyInjectionTestExecutionListener@13fd2ccd, org.springframework.test.context.support.DirtiesContextTestExecutionListener@b9b00e0, org.springframework.test.context.transaction.TransactionalTestExecutionListener@506ae4d4, org.springframework.test.context.jdbc.SqlScriptsTestExecutionListener@7d4f9aae]
20-Feb-2019 01:59:05
20-Feb-2019 01:59:05 [info 2019/02/20 01:59:05.835 UTC <main> tid=0x1] Replacing the [gemfireCache] bean definition having type [org.springframework.data.gemfire.CacheFactoryBean] with mock [org.springframework.data.gemfire.test.MockCacheFactoryBean]...
20-Feb-2019 01:59:05
20-Feb-2019 01:59:06 [info 2019/02/20 01:59:06.306 UTC <main> tid=0x1] Connected to Distributed System [ManualGatewayReceiverStartIntegrationTest] as Member [null] in Group(s) [[]] with Role(s) [[]] on Host [mockDistributedMember.host] having PID [0]
20-Feb-2019 01:59:06
20-Feb-2019 01:59:06 [info 2019/02/20 01:59:06.318 UTC <main> tid=0x1] Found existing Pivotal GemFire version [9.7.0] Cache [ManualGatewayReceiverStartIntegrationTest]
20-Feb-2019 01:59:06
20-Feb-2019 01:59:06 [info 2019/02/20 01:59:06.352 UTC <main> tid=0x1] Falling back to creating Region [Example] in Cache [ManualGatewayReceiverStartIntegrationTest]
20-Feb-2019 01:59:06
20-Feb-2019 01:59:06 [info 2019/02/20 01:59:06.502 UTC <main> tid=0x1] Created Region [Example]
20-Feb-2019 01:59:06
20-Feb-2019 01:59:06 [INFO] Tests run: 2, Failures: 0, Errors: 0, Skipped: 0, Time elapsed: 1.9 s - in org.springframework.data.gemfire.wan.ManualGatewayReceiverStartIntegrationTest
20-Feb-2019 01:59:06 [info 2019/02/20 01:59:06.654 UTC <Thread-1> tid=0xe] Invocation of destroy method failed on bean with name 'gemfireCache': org.apache.geode.cache.CacheClosedException: A cache has not yet been created.
20-Feb-2019 01:59:06
20-Feb-2019 01:59:07 [INFO] Running org.springframework.data.gemfire.wan.OrderPolicyTypeTest
20-Feb-2019 01:59:07 [INFO] Tests run: 6, Failures: 0, Errors: 0, Skipped: 0, Time elapsed: 0.054 s - in org.springframework.data.gemfire.wan.OrderPolicyTypeTest
20-Feb-2019 01:59:07 [INFO] Running org.springframework.data.gemfire.wan.AsyncEventQueueWithListenerIntegrationTest
20-Feb-2019 01:59:08 [info 2019/02/20 01:59:08.555 UTC <main> tid=0x1] Loaded default TestExecutionListener class names from location [META-INF/spring.factories]: [org.springframework.test.context.web.ServletTestExecutionListener, org.springframework.test.context.support.DirtiesContextBeforeModesTestExecutionListener, org.springframework.test.context.support.DependencyInjectionTestExecutionListener, org.springframework.test.context.support.DirtiesContextTestExecutionListener, org.springframework.test.context.transaction.TransactionalTestExecutionListener, org.springframework.test.context.jdbc.SqlScriptsTestExecutionListener]
20-Feb-2019 01:59:08
20-Feb-2019 01:59:08 [info 2019/02/20 01:59:08.566 UTC <main> tid=0x1] Using TestExecutionListeners: [org.springframework.test.context.support.DirtiesContextBeforeModesTestExecutionListener@1b11171f, org.springframework.test.context.support.DependencyInjectionTestExecutionListener@1151e434, org.springframework.test.context.support.DirtiesContextTestExecutionListener@2dc54ad4, org.springframework.test.context.transaction.TransactionalTestExecutionListener@4659191b, org.springframework.test.context.jdbc.SqlScriptsTestExecutionListener@55634720]
20-Feb-2019 01:59:08
20-Feb-2019 01:59:08 [info 2019/02/20 01:59:08.862 UTC <main> tid=0x1] Replacing the [gemfireCache] bean definition having type [org.springframework.data.gemfire.CacheFactoryBean] with mock [org.springframework.data.gemfire.test.MockCacheFactoryBean]...
20-Feb-2019 01:59:08
20-Feb-2019 01:59:09 [info 2019/02/20 01:59:09.310 UTC <main> tid=0x1] Connected to Distributed System [AsyncEventQueueWithListenerTest] as Member [null] in Group(s) [[]] with Role(s) [[]] on Host [mockDistributedMember.host] having PID [0]
20-Feb-2019 01:59:09
20-Feb-2019 01:59:09 [info 2019/02/20 01:59:09.321 UTC <main> tid=0x1] Found existing Pivotal GemFire version [9.7.0] Cache [AsyncEventQueueWithListenerTest]
20-Feb-2019 01:59:09
20-Feb-2019 01:59:09 org.springframework.data.gemfire.wan.AsyncEventQueueWithListenerIntegrationTest$TestAsyncEventListener initialized!
20-Feb-2019 01:59:09 org.springframework.data.gemfire.wan.AsyncEventQueueWithListenerIntegrationTest$TestAsyncEventListener initialized!
20-Feb-2019 01:59:09 [INFO] Tests run: 3, Failures: 0, Errors: 0, Skipped: 0, Time elapsed: 1.617 s - in org.springframework.data.gemfire.wan.AsyncEventQueueWithListenerIntegrationTest
20-Feb-2019 01:59:09 [info 2019/02/20 01:59:09.414 UTC <Thread-1> tid=0xe] Invocation of destroy method failed on bean with name 'gemfireCache': org.apache.geode.cache.CacheClosedException: A cache has not yet been created.
20-Feb-2019 01:59:09
20-Feb-2019 01:59:09 [INFO] Running org.springframework.data.gemfire.wan.GatewayReceiverFactoryBeanTest
20-Feb-2019 01:59:11 [INFO] Tests run: 2, Failures: 0, Errors: 0, Skipped: 0, Time elapsed: 1.207 s - in org.springframework.data.gemfire.wan.GatewayReceiverFactoryBeanTest
20-Feb-2019 01:59:11 [INFO] Running org.springframework.data.gemfire.wan.GatewaySenderFactoryBeanTest
20-Feb-2019 01:59:12 [INFO] Tests run: 7, Failures: 0, Errors: 0, Skipped: 0, Time elapsed: 1.158 s - in org.springframework.data.gemfire.wan.GatewaySenderFactoryBeanTest
20-Feb-2019 01:59:13 [INFO] Running org.springframework.data.gemfire.wan.CachePartitionRegionWithConcurrentParallelAsyncEventQueueAndGatewaySenderIntegrationTest
20-Feb-2019 01:59:14 [info 2019/02/20 01:59:14.170 UTC <main> tid=0x1] Detected default resource location "classpath:org/springframework/data/gemfire/wan/CachePartitionRegionWithConcurrentParallelAsyncEventQueueAndGatewaySenderIntegrationTest-context.xml" for test class [org.springframework.data.gemfire.wan.CachePartitionRegionWithConcurrentParallelAsyncEventQueueAndGatewaySenderIntegrationTest]
20-Feb-2019 01:59:14
20-Feb-2019 01:59:14 [info 2019/02/20 01:59:14.174 UTC <main> tid=0x1] GenericXmlContextLoader detected default locations for context configuration [ContextConfigurationAttributes@4d465b11 declaringClass = 'org.springframework.data.gemfire.wan.CachePartitionRegionWithConcurrentParallelAsyncEventQueueAndGatewaySenderIntegrationTest', classes = '{}', locations = '{classpath:org/springframework/data/gemfire/wan/CachePartitionRegionWithConcurrentParallelAsyncEventQueueAndGatewaySenderIntegrationTest-context.xml}', inheritLocations = true, initializers = '{}', inheritInitializers = true, name = [null], contextLoaderClass = 'org.springframework.test.context.ContextLoader'].
20-Feb-2019 01:59:14
20-Feb-2019 01:59:14 [info 2019/02/20 01:59:14.176 UTC <main> tid=0x1] Could not detect default configuration classes for test class [org.springframework.data.gemfire.wan.CachePartitionRegionWithConcurrentParallelAsyncEventQueueAndGatewaySenderIntegrationTest]: CachePartitionRegionWithConcurrentParallelAsyncEventQueueAndGatewaySenderIntegrationTest does not declare any static, non-private, non-final, nested classes annotated with @Configuration.
20-Feb-2019 01:59:14
20-Feb-2019 01:59:14 [info 2019/02/20 01:59:14.189 UTC <main> tid=0x1] Loaded default TestExecutionListener class names from location [META-INF/spring.factories]: [org.springframework.test.context.web.ServletTestExecutionListener, org.springframework.test.context.support.DirtiesContextBeforeModesTestExecutionListener, org.springframework.test.context.support.DependencyInjectionTestExecutionListener, org.springframework.test.context.support.DirtiesContextTestExecutionListener, org.springframework.test.context.transaction.TransactionalTestExecutionListener, org.springframework.test.context.jdbc.SqlScriptsTestExecutionListener]
20-Feb-2019 01:59:14
20-Feb-2019 01:59:14 [info 2019/02/20 01:59:14.198 UTC <main> tid=0x1] Using TestExecutionListeners: [org.springframework.test.context.support.DirtiesContextBeforeModesTestExecutionListener@783a467b, org.springframework.test.context.support.DependencyInjectionTestExecutionListener@272113c4, org.springframework.test.context.support.DirtiesContextTestExecutionListener@73e9cf30, org.springframework.test.context.transaction.TransactionalTestExecutionListener@771a660, org.springframework.test.context.jdbc.SqlScriptsTestExecutionListener@2d52216b]
20-Feb-2019 01:59:14
20-Feb-2019 01:59:16 [INFO] Tests run: 3, Failures: 0, Errors: 0, Skipped: 0, Time elapsed: 2.914 s - in org.springframework.data.gemfire.wan.CachePartitionRegionWithConcurrentParallelAsyncEventQueueAndGatewaySenderIntegrationTest
20-Feb-2019 01:59:17 [INFO] Running org.springframework.data.gemfire.search.lucene.support.LucenePageUnitTests
20-Feb-2019 01:59:18 [INFO] Tests run: 20, Failures: 0, Errors: 0, Skipped: 0, Time elapsed: 0.75 s - in org.springframework.data.gemfire.search.lucene.support.LucenePageUnitTests
20-Feb-2019 01:59:18 [INFO] Running org.springframework.data.gemfire.search.lucene.support.PdxInstanceMethodInterceptorUnitTests
20-Feb-2019 01:59:20 [INFO] Tests run: 10, Failures: 0, Errors: 0, Skipped: 0, Time elapsed: 1.196 s - in org.springframework.data.gemfire.search.lucene.support.PdxInstanceMethodInterceptorUnitTests
20-Feb-2019 01:59:20 [INFO] Running org.springframework.data.gemfire.search.lucene.support.PdxInstanceMethodInterceptorFactoryUnitTests
20-Feb-2019 01:59:21 [INFO] Tests run: 3, Failures: 0, Errors: 0, Skipped: 0, Time elapsed: 0.499 s - in org.springframework.data.gemfire.search.lucene.support.PdxInstanceMethodInterceptorFactoryUnitTests
20-Feb-2019 01:59:21 [INFO] Running org.springframework.data.gemfire.search.lucene.ProjectingLuceneOperationsUnitTests
20-Feb-2019 01:59:22 [INFO] Tests run: 2, Failures: 0, Errors: 0, Skipped: 0, Time elapsed: 0.502 s - in org.springframework.data.gemfire.search.lucene.ProjectingLuceneOperationsUnitTests
20-Feb-2019 01:59:22 [INFO] Running org.springframework.data.gemfire.search.lucene.LuceneAccessorUnitTests
20-Feb-2019 01:59:23 [INFO] Tests run: 17, Failures: 0, Errors: 0, Skipped: 0, Time elapsed: 0.772 s - in org.springframework.data.gemfire.search.lucene.LuceneAccessorUnitTests
20-Feb-2019 01:59:23 [INFO] Running org.springframework.data.gemfire.search.lucene.LuceneOperationsIntegrationTests
20-Feb-2019 01:59:24 [info 2019/02/20 01:59:24.759 UTC <main> tid=0x1] Could not detect default resource locations for test class [org.springframework.data.gemfire.search.lucene.LuceneOperationsIntegrationTests]: no resource found for suffixes {-context.xml}.
20-Feb-2019 01:59:24
20-Feb-2019 01:59:24 [info 2019/02/20 01:59:24.770 UTC <main> tid=0x1] AnnotationConfigContextLoader detected default configuration classes for context configuration [ContextConfigurationAttributes@1e04fa0a declaringClass = 'org.springframework.data.gemfire.search.lucene.LuceneOperationsIntegrationTests', classes = '{class org.springframework.data.gemfire.search.lucene.LuceneOperationsIntegrationTests$TestConfiguration}', locations = '{}', inheritLocations = true, initializers = '{}', inheritInitializers = true, name = [null], contextLoaderClass = 'org.springframework.test.context.ContextLoader'].
20-Feb-2019 01:59:24
20-Feb-2019 01:59:24 [info 2019/02/20 01:59:24.785 UTC <main> tid=0x1] Loaded default TestExecutionListener class names from location [META-INF/spring.factories]: [org.springframework.test.context.web.ServletTestExecutionListener, org.springframework.test.context.support.DirtiesContextBeforeModesTestExecutionListener, org.springframework.test.context.support.DependencyInjectionTestExecutionListener, org.springframework.test.context.support.DirtiesContextTestExecutionListener, org.springframework.test.context.transaction.TransactionalTestExecutionListener, org.springframework.test.context.jdbc.SqlScriptsTestExecutionListener]
20-Feb-2019 01:59:24
20-Feb-2019 01:59:24 [info 2019/02/20 01:59:24.794 UTC <main> tid=0x1] Using TestExecutionListeners: [org.springframework.test.context.support.DirtiesContextBeforeModesTestExecutionListener@3012646b, org.springframework.test.context.support.DependencyInjectionTestExecutionListener@4a883b15, org.springframework.test.context.support.DirtiesContextTestExecutionListener@25641d39, org.springframework.test.context.transaction.TransactionalTestExecutionListener@7b36aa0c, org.springframework.test.context.jdbc.SqlScriptsTestExecutionListener@5824a83d]
20-Feb-2019 01:59:24
20-Feb-2019 01:59:27 [INFO] Tests run: 2, Failures: 0, Errors: 0, Skipped: 0, Time elapsed: 3.855 s - in org.springframework.data.gemfire.search.lucene.LuceneOperationsIntegrationTests
20-Feb-2019 01:59:29 [INFO] Running org.springframework.data.gemfire.search.lucene.LuceneTemplateUnitTests
20-Feb-2019 01:59:30 [INFO] Tests run: 8, Failures: 0, Errors: 0, Skipped: 0, Time elapsed: 0.667 s - in org.springframework.data.gemfire.search.lucene.LuceneTemplateUnitTests
20-Feb-2019 01:59:30 [INFO] Running org.springframework.data.gemfire.search.lucene.LuceneServiceFactoryBeanUnitTests
20-Feb-2019 01:59:31 [INFO] Tests run: 6, Failures: 0, Errors: 0, Skipped: 0, Time elapsed: 1.231 s - in org.springframework.data.gemfire.search.lucene.LuceneServiceFactoryBeanUnitTests
20-Feb-2019 01:59:32 [INFO] Running org.springframework.data.gemfire.search.lucene.ProjectingLuceneTemplateUnitTests
20-Feb-2019 01:59:32 [INFO] Tests run: 2, Failures: 0, Errors: 0, Skipped: 0, Time elapsed: 0.654 s - in org.springframework.data.gemfire.search.lucene.ProjectingLuceneTemplateUnitTests
20-Feb-2019 01:59:33 [INFO] Running org.springframework.data.gemfire.search.lucene.LuceneOperationsUnitTests
20-Feb-2019 01:59:33 [INFO] Tests run: 6, Failures: 0, Errors: 0, Skipped: 0, Time elapsed: 0.52 s - in org.springframework.data.gemfire.search.lucene.LuceneOperationsUnitTests
20-Feb-2019 01:59:34 [INFO] Running org.springframework.data.gemfire.search.lucene.ProjectingLuceneAccessorUnitTests
20-Feb-2019 01:59:35 [INFO] Tests run: 5, Failures: 0, Errors: 0, Skipped: 0, Time elapsed: 1.403 s - in org.springframework.data.gemfire.search.lucene.ProjectingLuceneAccessorUnitTests
20-Feb-2019 01:59:36 [INFO] Running org.springframework.data.gemfire.search.lucene.LuceneIndexFactoryBeanUnitTests
20-Feb-2019 01:59:37 [INFO] Tests run: 41, Failures: 0, Errors: 0, Skipped: 0, Time elapsed: 1.491 s - in org.springframework.data.gemfire.search.lucene.LuceneIndexFactoryBeanUnitTests
20-Feb-2019 01:59:38 [INFO] Running org.springframework.data.gemfire.CacheClusterConfigurationIntegrationTest
20-Feb-2019 01:59:39 [FORK] - [info 2019/02/20 01:59:39.881 UTC <main> tid=0x1] Starting peer location for Distribution Locator on bamboo-12.af.pivotal.io[38988]
20-Feb-2019 01:59:39 [FORK] -
20-Feb-2019 01:59:39 [FORK] - [info 2019/02/20 01:59:39.885 UTC <main> tid=0x1] Starting Distribution Locator on bamboo-12.af.pivotal.io[38988]
20-Feb-2019 01:59:39 [FORK] -
20-Feb-2019 01:59:39 [FORK] - [info 2019/02/20 01:59:39.887 UTC <main> tid=0x1] Locator was created at Wed Feb 20 01:59:39 UTC 2019
20-Feb-2019 01:59:39 [FORK] -
20-Feb-2019 01:59:39 [FORK] - [info 2019/02/20 01:59:39.888 UTC <main> tid=0x1] Listening on port 38988 bound on address 0.0.0.0/0.0.0.0
20-Feb-2019 01:59:39 [FORK] -
20-Feb-2019 01:59:39 [FORK] - [info 2019/02/20 01:59:39.889 UTC <main> tid=0x1] GemFire peer location service starting.  Other locators:   Locators preferred as coordinators: true  Network partition detection enabled: true  View persistence file: /opt/bamboo-home/xml-data/build-dir/SGF-NJDK8-JOB1/clusterconfiglocator/locator38988view.dat
20-Feb-2019 01:59:39 [FORK] -
20-Feb-2019 01:59:39 [FORK] - [info 2019/02/20 01:59:39.889 UTC <main> tid=0x1] recovery file not found: /opt/bamboo-home/xml-data/build-dir/SGF-NJDK8-JOB1/clusterconfiglocator/locator38988view.dat
20-Feb-2019 01:59:39 [FORK] -
20-Feb-2019 01:59:39 [FORK] - [info 2019/02/20 01:59:39.893 UTC <main> tid=0x1] Starting distributed system
20-Feb-2019 01:59:39 [FORK] -
20-Feb-2019 01:59:47 Feb 20, 2019 1:59:47 AM org.springframework.data.gemfire.process.ProcessWrapper shutdown
20-Feb-2019 01:59:47 INFO: Stopping process [5395]...
20-Feb-2019 01:59:47
20-Feb-2019 01:59:47 [WARNING] Tests run: 2, Failures: 0, Errors: 0, Skipped: 1, Time elapsed: 9.089 s - in org.springframework.data.gemfire.CacheClusterConfigurationIntegrationTest
20-Feb-2019 01:59:48 [INFO] Running org.springframework.data.gemfire.SubRegionIntegrationTest
20-Feb-2019 01:59:48 [info 2019/02/20 01:59:48.971 UTC <main> tid=0x1] Loaded default TestExecutionListener class names from location [META-INF/spring.factories]: [org.springframework.test.context.web.ServletTestExecutionListener, org.springframework.test.context.support.DirtiesContextBeforeModesTestExecutionListener, org.springframework.test.context.support.DependencyInjectionTestExecutionListener, org.springframework.test.context.support.DirtiesContextTestExecutionListener, org.springframework.test.context.transaction.TransactionalTestExecutionListener, org.springframework.test.context.jdbc.SqlScriptsTestExecutionListener]
20-Feb-2019 01:59:48
20-Feb-2019 01:59:48 [info 2019/02/20 01:59:48.982 UTC <main> tid=0x1] Using TestExecutionListeners: [org.springframework.test.context.support.DirtiesContextBeforeModesTestExecutionListener@4efac082, org.springframework.test.context.support.DependencyInjectionTestExecutionListener@6bd61f98, org.springframework.test.context.support.DirtiesContextTestExecutionListener@48aca48b, org.springframework.test.context.transaction.TransactionalTestExecutionListener@13fd2ccd, org.springframework.test.context.jdbc.SqlScriptsTestExecutionListener@b9b00e0]
20-Feb-2019 01:59:48
20-Feb-2019 01:59:49 [info 2019/02/20 01:59:49.264 UTC <main> tid=0x1] Replacing the [gemfireCache] bean definition having type [org.springframework.data.gemfire.CacheFactoryBean] with mock [org.springframework.data.gemfire.test.MockCacheFactoryBean]...
20-Feb-2019 01:59:49
20-Feb-2019 01:59:49 [info 2019/02/20 01:59:49.763 UTC <main> tid=0x1] Connected to Distributed System [ComplexSubRegionConfig] as Member [null] in Group(s) [[]] with Role(s) [[]] on Host [mockDistributedMember.host] having PID [0]
20-Feb-2019 01:59:49
20-Feb-2019 01:59:49 [info 2019/02/20 01:59:49.775 UTC <main> tid=0x1] Found existing Pivotal GemFire version [9.7.0] Cache [ComplexSubRegionConfig]
20-Feb-2019 01:59:49
20-Feb-2019 01:59:49 [info 2019/02/20 01:59:49.778 UTC <main> tid=0x1] Falling back to creating Region [Customers] in Cache [ComplexSubRegionConfig]
20-Feb-2019 01:59:49
20-Feb-2019 01:59:49 [info 2019/02/20 01:59:49.931 UTC <main> tid=0x1] Created Region [Customers]
20-Feb-2019 01:59:49
20-Feb-2019 01:59:50 [info 2019/02/20 01:59:50.005 UTC <main> tid=0x1] Falling back to creating Region [Accounts] in Cache [ComplexSubRegionConfig]
20-Feb-2019 01:59:50
20-Feb-2019 01:59:50 [info 2019/02/20 01:59:50.008 UTC <main> tid=0x1] Creating Subregion [Accounts] with parent Region [Customers]
20-Feb-2019 01:59:50
20-Feb-2019 01:59:50 [INFO] Tests run: 2, Failures: 0, Errors: 0, Skipped: 0, Time elapsed: 1.845 s - in org.springframework.data.gemfire.SubRegionIntegrationTest
20-Feb-2019 01:59:50 [info 2019/02/20 01:59:50.074 UTC <Thread-1> tid=0xe] Invocation of destroy method failed on bean with name 'gemfireCache': org.apache.geode.cache.CacheClosedException: A cache has not yet been created.
20-Feb-2019 01:59:50
20-Feb-2019 01:59:50 [INFO] Running org.springframework.data.gemfire.snapshot.SnapshotServiceFactoryBeanTest
20-Feb-2019 01:59:51 [INFO] Tests run: 58, Failures: 0, Errors: 0, Skipped: 0, Time elapsed: 1.405 s - in org.springframework.data.gemfire.snapshot.SnapshotServiceFactoryBeanTest
20-Feb-2019 01:59:52 [INFO] Running org.springframework.data.gemfire.snapshot.SnapshotServiceFactoryBeanIntegrationTest
20-Feb-2019 01:59:53 [INFO] Tests run: 2, Failures: 0, Errors: 0, Skipped: 0, Time elapsed: 0.743 s - in org.springframework.data.gemfire.snapshot.SnapshotServiceFactoryBeanIntegrationTest
20-Feb-2019 01:59:53 [INFO] Running org.springframework.data.gemfire.snapshot.event.SnapshotApplicationEventTest
20-Feb-2019 01:59:54 [INFO] Tests run: 9, Failures: 0, Errors: 0, Skipped: 0, Time elapsed: 0.587 s - in org.springframework.data.gemfire.snapshot.event.SnapshotApplicationEventTest
20-Feb-2019 01:59:54 [INFO] Running org.springframework.data.gemfire.snapshot.filter.ComposableSnapshotFilterTest
20-Feb-2019 01:59:55 [INFO] Tests run: 9, Failures: 0, Errors: 0, Skipped: 0, Time elapsed: 0.442 s - in org.springframework.data.gemfire.snapshot.filter.ComposableSnapshotFilterTest
20-Feb-2019 01:59:55 [INFO] Running org.springframework.data.gemfire.snapshot.SnapshotApplicationEventTriggeredImportsExportsIntegrationTest
20-Feb-2019 01:59:56 [info 2019/02/20 01:59:56.586 UTC <main> tid=0x1] Detected default resource location "classpath:org/springframework/data/gemfire/snapshot/SnapshotApplicationEventTriggeredImportsExportsIntegrationTest-context.xml" for test class [org.springframework.data.gemfire.snapshot.SnapshotApplicationEventTriggeredImportsExportsIntegrationTest]
20-Feb-2019 01:59:56
20-Feb-2019 01:59:56 [info 2019/02/20 01:59:56.589 UTC <main> tid=0x1] GenericXmlContextLoader detected default locations for context configuration [ContextConfigurationAttributes@4d0f2471 declaringClass = 'org.springframework.data.gemfire.snapshot.SnapshotApplicationEventTriggeredImportsExportsIntegrationTest', classes = '{}', locations = '{classpath:org/springframework/data/gemfire/snapshot/SnapshotApplicationEventTriggeredImportsExportsIntegrationTest-context.xml}', inheritLocations = true, initializers = '{}', inheritInitializers = true, name = [null], contextLoaderClass = 'org.springframework.test.context.ContextLoader'].
20-Feb-2019 01:59:56
20-Feb-2019 01:59:56 [info 2019/02/20 01:59:56.591 UTC <main> tid=0x1] Could not detect default configuration classes for test class [org.springframework.data.gemfire.snapshot.SnapshotApplicationEventTriggeredImportsExportsIntegrationTest]: SnapshotApplicationEventTriggeredImportsExportsIntegrationTest does not declare any static, non-private, non-final, nested classes annotated with @Configuration.
20-Feb-2019 01:59:56
20-Feb-2019 01:59:56 [info 2019/02/20 01:59:56.604 UTC <main> tid=0x1] Loaded default TestExecutionListener class names from location [META-INF/spring.factories]: [org.springframework.test.context.web.ServletTestExecutionListener, org.springframework.test.context.support.DirtiesContextBeforeModesTestExecutionListener, org.springframework.test.context.support.DependencyInjectionTestExecutionListener, org.springframework.test.context.support.DirtiesContextTestExecutionListener, org.springframework.test.context.transaction.TransactionalTestExecutionListener, org.springframework.test.context.jdbc.SqlScriptsTestExecutionListener]
20-Feb-2019 01:59:56
20-Feb-2019 01:59:56 [info 2019/02/20 01:59:56.613 UTC <main> tid=0x1] Using TestExecutionListeners: [org.springframework.test.context.support.DirtiesContextBeforeModesTestExecutionListener@3f6f6701, org.springframework.test.context.support.DependencyInjectionTestExecutionListener@3527942a, org.springframework.test.context.support.DirtiesContextTestExecutionListener@942a29c, org.springframework.test.context.transaction.TransactionalTestExecutionListener@1ed6388a, org.springframework.test.context.jdbc.SqlScriptsTestExecutionListener@5a45133e]
20-Feb-2019 01:59:56
20-Feb-2019 01:59:57 [info 2019/02/20 01:59:57.068 UTC <main> tid=0x1] Initializing ExecutorService 'snapshotImportsMonitorScheduler'
20-Feb-2019 01:59:57
20-Feb-2019 01:59:57 [info 2019/02/20 01:59:57.068 UTC <main> tid=0x1] Bean 'snapshotImportsMonitorScheduler' of type [org.springframework.scheduling.concurrent.ThreadPoolTaskScheduler] is not eligible for getting processed by all BeanPostProcessors (for example: not eligible for auto-proxying)
20-Feb-2019 01:59:57
20-Feb-2019 01:59:58 [warn 2019/02/20 01:59:58.710 UTC <main> tid=0x1] enforce-unique-host and redundancy-zone properties have no effect for a LonerDistributedSystem.
20-Feb-2019 01:59:58
20-Feb-2019 01:59:58 [warn 2019/02/20 01:59:58.719 UTC <main> tid=0x1] enforce-unique-host and redundancy-zone properties have no effect for a LonerDistributedSystem.
20-Feb-2019 01:59:58
20-Feb-2019 01:59:58 [warn 2019/02/20 01:59:58.721 UTC <main> tid=0x1] enforce-unique-host and redundancy-zone properties have no effect for a LonerDistributedSystem.
20-Feb-2019 01:59:58
20-Feb-2019 01:59:58 [warn 2019/02/20 01:59:58.722 UTC <main> tid=0x1] enforce-unique-host and redundancy-zone properties have no effect for a LonerDistributedSystem.
20-Feb-2019 01:59:58
20-Feb-2019 01:59:58 [warn 2019/02/20 01:59:58.724 UTC <main> tid=0x1] enforce-unique-host and redundancy-zone properties have no effect for a LonerDistributedSystem.
20-Feb-2019 01:59:58
20-Feb-2019 01:59:58 [warn 2019/02/20 01:59:58.734 UTC <main> tid=0x1] enforce-unique-host and redundancy-zone properties have no effect for a LonerDistributedSystem.
20-Feb-2019 01:59:58
20-Feb-2019 01:59:58 [warn 2019/02/20 01:59:58.744 UTC <main> tid=0x1] enforce-unique-host and redundancy-zone properties have no effect for a LonerDistributedSystem.
20-Feb-2019 01:59:58
20-Feb-2019 01:59:58 [warn 2019/02/20 01:59:58.745 UTC <main> tid=0x1] enforce-unique-host and redundancy-zone properties have no effect for a LonerDistributedSystem.
20-Feb-2019 01:59:58
20-Feb-2019 01:59:58 [warn 2019/02/20 01:59:58.746 UTC <main> tid=0x1] enforce-unique-host and redundancy-zone properties have no effect for a LonerDistributedSystem.
20-Feb-2019 01:59:58
20-Feb-2019 01:59:58 [warn 2019/02/20 01:59:58.747 UTC <main> tid=0x1] enforce-unique-host and redundancy-zone properties have no effect for a LonerDistributedSystem.
20-Feb-2019 01:59:58
20-Feb-2019 01:59:58 [warn 2019/02/20 01:59:58.748 UTC <main> tid=0x1] enforce-unique-host and redundancy-zone properties have no effect for a LonerDistributedSystem.
20-Feb-2019 01:59:58
20-Feb-2019 01:59:58 [warn 2019/02/20 01:59:58.749 UTC <main> tid=0x1] enforce-unique-host and redundancy-zone properties have no effect for a LonerDistributedSystem.
20-Feb-2019 01:59:58
20-Feb-2019 01:59:58 [warn 2019/02/20 01:59:58.750 UTC <main> tid=0x1] enforce-unique-host and redundancy-zone properties have no effect for a LonerDistributedSystem.
20-Feb-2019 01:59:58
20-Feb-2019 01:59:58 [warn 2019/02/20 01:59:58.751 UTC <main> tid=0x1] enforce-unique-host and redundancy-zone properties have no effect for a LonerDistributedSystem.
20-Feb-2019 01:59:58
20-Feb-2019 01:59:58 [warn 2019/02/20 01:59:58.752 UTC <main> tid=0x1] enforce-unique-host and redundancy-zone properties have no effect for a LonerDistributedSystem.
20-Feb-2019 01:59:58
20-Feb-2019 01:59:58 [warn 2019/02/20 01:59:58.753 UTC <main> tid=0x1] enforce-unique-host and redundancy-zone properties have no effect for a LonerDistributedSystem.
20-Feb-2019 01:59:58
20-Feb-2019 01:59:58 [warn 2019/02/20 01:59:58.754 UTC <main> tid=0x1] enforce-unique-host and redundancy-zone properties have no effect for a LonerDistributedSystem.
20-Feb-2019 01:59:58
20-Feb-2019 01:59:58 [warn 2019/02/20 01:59:58.755 UTC <main> tid=0x1] enforce-unique-host and redundancy-zone properties have no effect for a LonerDistributedSystem.
20-Feb-2019 01:59:58
20-Feb-2019 01:59:58 [warn 2019/02/20 01:59:58.757 UTC <main> tid=0x1] enforce-unique-host and redundancy-zone properties have no effect for a LonerDistributedSystem.
20-Feb-2019 01:59:58
20-Feb-2019 01:59:58 [warn 2019/02/20 01:59:58.758 UTC <main> tid=0x1] enforce-unique-host and redundancy-zone properties have no effect for a LonerDistributedSystem.
20-Feb-2019 01:59:58
20-Feb-2019 01:59:58 [warn 2019/02/20 01:59:58.759 UTC <main> tid=0x1] enforce-unique-host and redundancy-zone properties have no effect for a LonerDistributedSystem.
20-Feb-2019 01:59:58
20-Feb-2019 01:59:58 [warn 2019/02/20 01:59:58.759 UTC <main> tid=0x1] enforce-unique-host and redundancy-zone properties have no effect for a LonerDistributedSystem.
20-Feb-2019 01:59:58
20-Feb-2019 01:59:58 [warn 2019/02/20 01:59:58.761 UTC <main> tid=0x1] enforce-unique-host and redundancy-zone properties have no effect for a LonerDistributedSystem.
20-Feb-2019 01:59:58
20-Feb-2019 01:59:58 [warn 2019/02/20 01:59:58.762 UTC <main> tid=0x1] enforce-unique-host and redundancy-zone properties have no effect for a LonerDistributedSystem.
20-Feb-2019 01:59:58
20-Feb-2019 01:59:58 [warn 2019/02/20 01:59:58.762 UTC <main> tid=0x1] enforce-unique-host and redundancy-zone properties have no effect for a LonerDistributedSystem.
20-Feb-2019 01:59:58
20-Feb-2019 01:59:58 [warn 2019/02/20 01:59:58.763 UTC <main> tid=0x1] enforce-unique-host and redundancy-zone properties have no effect for a LonerDistributedSystem.
20-Feb-2019 01:59:58
20-Feb-2019 01:59:58 [warn 2019/02/20 01:59:58.765 UTC <main> tid=0x1] enforce-unique-host and redundancy-zone properties have no effect for a LonerDistributedSystem.
20-Feb-2019 01:59:58
20-Feb-2019 01:59:58 [warn 2019/02/20 01:59:58.765 UTC <main> tid=0x1] enforce-unique-host and redundancy-zone properties have no effect for a LonerDistributedSystem.
20-Feb-2019 01:59:58
20-Feb-2019 01:59:58 [warn 2019/02/20 01:59:58.766 UTC <main> tid=0x1] enforce-unique-host and redundancy-zone properties have no effect for a LonerDistributedSystem.
20-Feb-2019 01:59:58
20-Feb-2019 01:59:58 [warn 2019/02/20 01:59:58.767 UTC <main> tid=0x1] enforce-unique-host and redundancy-zone properties have no effect for a LonerDistributedSystem.
20-Feb-2019 01:59:58
20-Feb-2019 01:59:58 [warn 2019/02/20 01:59:58.768 UTC <main> tid=0x1] enforce-unique-host and redundancy-zone properties have no effect for a LonerDistributedSystem.
20-Feb-2019 01:59:58
20-Feb-2019 01:59:58 [warn 2019/02/20 01:59:58.769 UTC <main> tid=0x1] enforce-unique-host and redundancy-zone properties have no effect for a LonerDistributedSystem.
20-Feb-2019 01:59:58
20-Feb-2019 01:59:58 [warn 2019/02/20 01:59:58.770 UTC <main> tid=0x1] enforce-unique-host and redundancy-zone properties have no effect for a LonerDistributedSystem.
20-Feb-2019 01:59:58
20-Feb-2019 01:59:58 [warn 2019/02/20 01:59:58.771 UTC <main> tid=0x1] enforce-unique-host and redundancy-zone properties have no effect for a LonerDistributedSystem.
20-Feb-2019 01:59:58
20-Feb-2019 01:59:58 [warn 2019/02/20 01:59:58.772 UTC <main> tid=0x1] enforce-unique-host and redundancy-zone properties have no effect for a LonerDistributedSystem.
20-Feb-2019 01:59:58
20-Feb-2019 01:59:58 [warn 2019/02/20 01:59:58.773 UTC <main> tid=0x1] enforce-unique-host and redundancy-zone properties have no effect for a LonerDistributedSystem.
20-Feb-2019 01:59:58
20-Feb-2019 01:59:58 [warn 2019/02/20 01:59:58.774 UTC <main> tid=0x1] enforce-unique-host and redundancy-zone properties have no effect for a LonerDistributedSystem.
20-Feb-2019 01:59:58
20-Feb-2019 01:59:58 [warn 2019/02/20 01:59:58.775 UTC <main> tid=0x1] enforce-unique-host and redundancy-zone properties have no effect for a LonerDistributedSystem.
20-Feb-2019 01:59:58
20-Feb-2019 01:59:58 [warn 2019/02/20 01:59:58.776 UTC <main> tid=0x1] enforce-unique-host and redundancy-zone properties have no effect for a LonerDistributedSystem.
20-Feb-2019 01:59:58
20-Feb-2019 01:59:58 [warn 2019/02/20 01:59:58.777 UTC <main> tid=0x1] enforce-unique-host and redundancy-zone properties have no effect for a LonerDistributedSystem.
20-Feb-2019 01:59:58
20-Feb-2019 01:59:58 [warn 2019/02/20 01:59:58.778 UTC <main> tid=0x1] enforce-unique-host and redundancy-zone properties have no effect for a LonerDistributedSystem.
20-Feb-2019 01:59:58
20-Feb-2019 01:59:58 [warn 2019/02/20 01:59:58.779 UTC <main> tid=0x1] enforce-unique-host and redundancy-zone properties have no effect for a LonerDistributedSystem.
20-Feb-2019 01:59:58
20-Feb-2019 01:59:58 [warn 2019/02/20 01:59:58.780 UTC <main> tid=0x1] enforce-unique-host and redundancy-zone properties have no effect for a LonerDistributedSystem.
20-Feb-2019 01:59:58
20-Feb-2019 01:59:58 [warn 2019/02/20 01:59:58.781 UTC <main> tid=0x1] enforce-unique-host and redundancy-zone properties have no effect for a LonerDistributedSystem.
20-Feb-2019 01:59:58
20-Feb-2019 01:59:58 [warn 2019/02/20 01:59:58.781 UTC <main> tid=0x1] enforce-unique-host and redundancy-zone properties have no effect for a LonerDistributedSystem.
20-Feb-2019 01:59:58
20-Feb-2019 01:59:58 [warn 2019/02/20 01:59:58.782 UTC <main> tid=0x1] enforce-unique-host and redundancy-zone properties have no effect for a LonerDistributedSystem.
20-Feb-2019 01:59:58
20-Feb-2019 01:59:58 [warn 2019/02/20 01:59:58.783 UTC <main> tid=0x1] enforce-unique-host and redundancy-zone properties have no effect for a LonerDistributedSystem.
20-Feb-2019 01:59:58
20-Feb-2019 01:59:58 [warn 2019/02/20 01:59:58.784 UTC <main> tid=0x1] enforce-unique-host and redundancy-zone properties have no effect for a LonerDistributedSystem.
20-Feb-2019 01:59:58
20-Feb-2019 01:59:58 [warn 2019/02/20 01:59:58.785 UTC <main> tid=0x1] enforce-unique-host and redundancy-zone properties have no effect for a LonerDistributedSystem.
20-Feb-2019 01:59:58
20-Feb-2019 01:59:58 [warn 2019/02/20 01:59:58.786 UTC <main> tid=0x1] enforce-unique-host and redundancy-zone properties have no effect for a LonerDistributedSystem.
20-Feb-2019 01:59:58
20-Feb-2019 01:59:58 [warn 2019/02/20 01:59:58.787 UTC <main> tid=0x1] enforce-unique-host and redundancy-zone properties have no effect for a LonerDistributedSystem.
20-Feb-2019 01:59:58
20-Feb-2019 01:59:58 [warn 2019/02/20 01:59:58.788 UTC <main> tid=0x1] enforce-unique-host and redundancy-zone properties have no effect for a LonerDistributedSystem.
20-Feb-2019 01:59:58
20-Feb-2019 01:59:58 [warn 2019/02/20 01:59:58.789 UTC <main> tid=0x1] enforce-unique-host and redundancy-zone properties have no effect for a LonerDistributedSystem.
20-Feb-2019 01:59:58
20-Feb-2019 01:59:58 [warn 2019/02/20 01:59:58.790 UTC <main> tid=0x1] enforce-unique-host and redundancy-zone properties have no effect for a LonerDistributedSystem.
20-Feb-2019 01:59:58
20-Feb-2019 01:59:58 [warn 2019/02/20 01:59:58.790 UTC <main> tid=0x1] enforce-unique-host and redundancy-zone properties have no effect for a LonerDistributedSystem.
20-Feb-2019 01:59:58
20-Feb-2019 01:59:58 [warn 2019/02/20 01:59:58.791 UTC <main> tid=0x1] enforce-unique-host and redundancy-zone properties have no effect for a LonerDistributedSystem.
20-Feb-2019 01:59:58
20-Feb-2019 01:59:58 [warn 2019/02/20 01:59:58.792 UTC <main> tid=0x1] enforce-unique-host and redundancy-zone properties have no effect for a LonerDistributedSystem.
20-Feb-2019 01:59:58
20-Feb-2019 01:59:58 [warn 2019/02/20 01:59:58.793 UTC <main> tid=0x1] enforce-unique-host and redundancy-zone properties have no effect for a LonerDistributedSystem.
20-Feb-2019 01:59:58
20-Feb-2019 01:59:58 [warn 2019/02/20 01:59:58.794 UTC <main> tid=0x1] enforce-unique-host and redundancy-zone properties have no effect for a LonerDistributedSystem.
20-Feb-2019 01:59:58
20-Feb-2019 01:59:58 [warn 2019/02/20 01:59:58.795 UTC <main> tid=0x1] enforce-unique-host and redundancy-zone properties have no effect for a LonerDistributedSystem.
20-Feb-2019 01:59:58
20-Feb-2019 01:59:58 [warn 2019/02/20 01:59:58.796 UTC <main> tid=0x1] enforce-unique-host and redundancy-zone properties have no effect for a LonerDistributedSystem.
20-Feb-2019 01:59:58
20-Feb-2019 01:59:58 [warn 2019/02/20 01:59:58.796 UTC <main> tid=0x1] enforce-unique-host and redundancy-zone properties have no effect for a LonerDistributedSystem.
20-Feb-2019 01:59:58
20-Feb-2019 01:59:58 [warn 2019/02/20 01:59:58.797 UTC <main> tid=0x1] enforce-unique-host and redundancy-zone properties have no effect for a LonerDistributedSystem.
20-Feb-2019 01:59:58
20-Feb-2019 01:59:58 [warn 2019/02/20 01:59:58.798 UTC <main> tid=0x1] enforce-unique-host and redundancy-zone properties have no effect for a LonerDistributedSystem.
20-Feb-2019 01:59:58
20-Feb-2019 01:59:58 [warn 2019/02/20 01:59:58.799 UTC <main> tid=0x1] enforce-unique-host and redundancy-zone properties have no effect for a LonerDistributedSystem.
20-Feb-2019 01:59:58
20-Feb-2019 01:59:58 [warn 2019/02/20 01:59:58.800 UTC <main> tid=0x1] enforce-unique-host and redundancy-zone properties have no effect for a LonerDistributedSystem.
20-Feb-2019 01:59:58
20-Feb-2019 01:59:58 [warn 2019/02/20 01:59:58.801 UTC <main> tid=0x1] enforce-unique-host and redundancy-zone properties have no effect for a LonerDistributedSystem.
20-Feb-2019 01:59:58
20-Feb-2019 01:59:58 [warn 2019/02/20 01:59:58.802 UTC <main> tid=0x1] enforce-unique-host and redundancy-zone properties have no effect for a LonerDistributedSystem.
20-Feb-2019 01:59:58
20-Feb-2019 01:59:58 [warn 2019/02/20 01:59:58.803 UTC <main> tid=0x1] enforce-unique-host and redundancy-zone properties have no effect for a LonerDistributedSystem.
20-Feb-2019 01:59:58
20-Feb-2019 01:59:58 [warn 2019/02/20 01:59:58.803 UTC <main> tid=0x1] enforce-unique-host and redundancy-zone properties have no effect for a LonerDistributedSystem.
20-Feb-2019 01:59:58
20-Feb-2019 01:59:58 [warn 2019/02/20 01:59:58.804 UTC <main> tid=0x1] enforce-unique-host and redundancy-zone properties have no effect for a LonerDistributedSystem.
20-Feb-2019 01:59:58
20-Feb-2019 01:59:58 [warn 2019/02/20 01:59:58.805 UTC <main> tid=0x1] enforce-unique-host and redundancy-zone properties have no effect for a LonerDistributedSystem.
20-Feb-2019 01:59:58
20-Feb-2019 01:59:58 [warn 2019/02/20 01:59:58.806 UTC <main> tid=0x1] enforce-unique-host and redundancy-zone properties have no effect for a LonerDistributedSystem.
20-Feb-2019 01:59:58
20-Feb-2019 01:59:58 [warn 2019/02/20 01:59:58.807 UTC <main> tid=0x1] enforce-unique-host and redundancy-zone properties have no effect for a LonerDistributedSystem.
20-Feb-2019 01:59:58
20-Feb-2019 01:59:58 [warn 2019/02/20 01:59:58.808 UTC <main> tid=0x1] enforce-unique-host and redundancy-zone properties have no effect for a LonerDistributedSystem.
20-Feb-2019 01:59:58
20-Feb-2019 01:59:58 [warn 2019/02/20 01:59:58.809 UTC <main> tid=0x1] enforce-unique-host and redundancy-zone properties have no effect for a LonerDistributedSystem.
20-Feb-2019 01:59:58
20-Feb-2019 01:59:58 [warn 2019/02/20 01:59:58.809 UTC <main> tid=0x1] enforce-unique-host and redundancy-zone properties have no effect for a LonerDistributedSystem.
20-Feb-2019 01:59:58
20-Feb-2019 01:59:58 [warn 2019/02/20 01:59:58.810 UTC <main> tid=0x1] enforce-unique-host and redundancy-zone properties have no effect for a LonerDistributedSystem.
20-Feb-2019 01:59:58
20-Feb-2019 01:59:58 [warn 2019/02/20 01:59:58.811 UTC <main> tid=0x1] enforce-unique-host and redundancy-zone properties have no effect for a LonerDistributedSystem.
20-Feb-2019 01:59:58
20-Feb-2019 01:59:58 [warn 2019/02/20 01:59:58.812 UTC <main> tid=0x1] enforce-unique-host and redundancy-zone properties have no effect for a LonerDistributedSystem.
20-Feb-2019 01:59:58
20-Feb-2019 01:59:58 [warn 2019/02/20 01:59:58.813 UTC <main> tid=0x1] enforce-unique-host and redundancy-zone properties have no effect for a LonerDistributedSystem.
20-Feb-2019 01:59:58
20-Feb-2019 01:59:58 [warn 2019/02/20 01:59:58.814 UTC <main> tid=0x1] enforce-unique-host and redundancy-zone properties have no effect for a LonerDistributedSystem.
20-Feb-2019 01:59:58
20-Feb-2019 01:59:58 [warn 2019/02/20 01:59:58.815 UTC <main> tid=0x1] enforce-unique-host and redundancy-zone properties have no effect for a LonerDistributedSystem.
20-Feb-2019 01:59:58
20-Feb-2019 01:59:58 [warn 2019/02/20 01:59:58.815 UTC <main> tid=0x1] enforce-unique-host and redundancy-zone properties have no effect for a LonerDistributedSystem.
20-Feb-2019 01:59:58
20-Feb-2019 01:59:58 [warn 2019/02/20 01:59:58.816 UTC <main> tid=0x1] enforce-unique-host and redundancy-zone properties have no effect for a LonerDistributedSystem.
20-Feb-2019 01:59:58
20-Feb-2019 01:59:58 [warn 2019/02/20 01:59:58.817 UTC <main> tid=0x1] enforce-unique-host and redundancy-zone properties have no effect for a LonerDistributedSystem.
20-Feb-2019 01:59:58
20-Feb-2019 01:59:58 [warn 2019/02/20 01:59:58.818 UTC <main> tid=0x1] enforce-unique-host and redundancy-zone properties have no effect for a LonerDistributedSystem.
20-Feb-2019 01:59:58
20-Feb-2019 01:59:58 [warn 2019/02/20 01:59:58.819 UTC <main> tid=0x1] enforce-unique-host and redundancy-zone properties have no effect for a LonerDistributedSystem.
20-Feb-2019 01:59:58
20-Feb-2019 01:59:58 [warn 2019/02/20 01:59:58.819 UTC <main> tid=0x1] enforce-unique-host and redundancy-zone properties have no effect for a LonerDistributedSystem.
20-Feb-2019 01:59:58
20-Feb-2019 01:59:58 [warn 2019/02/20 01:59:58.820 UTC <main> tid=0x1] enforce-unique-host and redundancy-zone properties have no effect for a LonerDistributedSystem.
20-Feb-2019 01:59:58
20-Feb-2019 01:59:58 [warn 2019/02/20 01:59:58.821 UTC <main> tid=0x1] enforce-unique-host and redundancy-zone properties have no effect for a LonerDistributedSystem.
20-Feb-2019 01:59:58
20-Feb-2019 01:59:58 [warn 2019/02/20 01:59:58.822 UTC <main> tid=0x1] enforce-unique-host and redundancy-zone properties have no effect for a LonerDistributedSystem.
20-Feb-2019 01:59:58
20-Feb-2019 01:59:58 [warn 2019/02/20 01:59:58.823 UTC <main> tid=0x1] enforce-unique-host and redundancy-zone properties have no effect for a LonerDistributedSystem.
20-Feb-2019 01:59:58
20-Feb-2019 01:59:58 [warn 2019/02/20 01:59:58.823 UTC <main> tid=0x1] enforce-unique-host and redundancy-zone properties have no effect for a LonerDistributedSystem.
20-Feb-2019 01:59:58
20-Feb-2019 01:59:58 [warn 2019/02/20 01:59:58.824 UTC <main> tid=0x1] enforce-unique-host and redundancy-zone properties have no effect for a LonerDistributedSystem.
20-Feb-2019 01:59:58
20-Feb-2019 01:59:58 [warn 2019/02/20 01:59:58.825 UTC <main> tid=0x1] enforce-unique-host and redundancy-zone properties have no effect for a LonerDistributedSystem.
20-Feb-2019 01:59:58
20-Feb-2019 01:59:58 [warn 2019/02/20 01:59:58.826 UTC <main> tid=0x1] enforce-unique-host and redundancy-zone properties have no effect for a LonerDistributedSystem.
20-Feb-2019 01:59:58
20-Feb-2019 01:59:58 [warn 2019/02/20 01:59:58.827 UTC <main> tid=0x1] enforce-unique-host and redundancy-zone properties have no effect for a LonerDistributedSystem.
20-Feb-2019 01:59:58
20-Feb-2019 01:59:58 [warn 2019/02/20 01:59:58.827 UTC <main> tid=0x1] enforce-unique-host and redundancy-zone properties have no effect for a LonerDistributedSystem.
20-Feb-2019 01:59:58
20-Feb-2019 01:59:58 [warn 2019/02/20 01:59:58.828 UTC <main> tid=0x1] enforce-unique-host and redundancy-zone properties have no effect for a LonerDistributedSystem.
20-Feb-2019 01:59:58
20-Feb-2019 01:59:58 [warn 2019/02/20 01:59:58.829 UTC <main> tid=0x1] enforce-unique-host and redundancy-zone properties have no effect for a LonerDistributedSystem.
20-Feb-2019 01:59:58
20-Feb-2019 01:59:58 [warn 2019/02/20 01:59:58.830 UTC <main> tid=0x1] enforce-unique-host and redundancy-zone properties have no effect for a LonerDistributedSystem.
20-Feb-2019 01:59:58
20-Feb-2019 01:59:58 [warn 2019/02/20 01:59:58.831 UTC <main> tid=0x1] enforce-unique-host and redundancy-zone properties have no effect for a LonerDistributedSystem.
20-Feb-2019 01:59:58
20-Feb-2019 01:59:58 [warn 2019/02/20 01:59:58.831 UTC <main> tid=0x1] enforce-unique-host and redundancy-zone properties have no effect for a LonerDistributedSystem.
20-Feb-2019 01:59:58
20-Feb-2019 01:59:58 [warn 2019/02/20 01:59:58.832 UTC <main> tid=0x1] enforce-unique-host and redundancy-zone properties have no effect for a LonerDistributedSystem.
20-Feb-2019 01:59:58
20-Feb-2019 01:59:58 [warn 2019/02/20 01:59:58.833 UTC <main> tid=0x1] enforce-unique-host and redundancy-zone properties have no effect for a LonerDistributedSystem.
20-Feb-2019 01:59:58
20-Feb-2019 01:59:58 [warn 2019/02/20 01:59:58.834 UTC <main> tid=0x1] enforce-unique-host and redundancy-zone properties have no effect for a LonerDistributedSystem.
20-Feb-2019 01:59:58
20-Feb-2019 01:59:58 [warn 2019/02/20 01:59:58.835 UTC <main> tid=0x1] enforce-unique-host and redundancy-zone properties have no effect for a LonerDistributedSystem.
20-Feb-2019 01:59:58
20-Feb-2019 01:59:58 [warn 2019/02/20 01:59:58.835 UTC <main> tid=0x1] enforce-unique-host and redundancy-zone properties have no effect for a LonerDistributedSystem.
20-Feb-2019 01:59:58
20-Feb-2019 01:59:58 [warn 2019/02/20 01:59:58.836 UTC <main> tid=0x1] enforce-unique-host and redundancy-zone properties have no effect for a LonerDistributedSystem.
20-Feb-2019 01:59:58
20-Feb-2019 01:59:58 [warn 2019/02/20 01:59:58.837 UTC <main> tid=0x1] enforce-unique-host and redundancy-zone properties have no effect for a LonerDistributedSystem.
20-Feb-2019 01:59:58
20-Feb-2019 01:59:58 [warn 2019/02/20 01:59:58.838 UTC <main> tid=0x1] enforce-unique-host and redundancy-zone properties have no effect for a LonerDistributedSystem.
20-Feb-2019 01:59:58
20-Feb-2019 01:59:58 [warn 2019/02/20 01:59:58.838 UTC <main> tid=0x1] enforce-unique-host and redundancy-zone properties have no effect for a LonerDistributedSystem.
20-Feb-2019 01:59:58
20-Feb-2019 01:59:59 [warn 2019/02/20 01:59:59.693 UTC <snapshotImportsMonitorScheduler-1> tid=0x25] enforce-unique-host and redundancy-zone properties have no effect for a LonerDistributedSystem.
20-Feb-2019 01:59:59
20-Feb-2019 01:59:59 [warn 2019/02/20 01:59:59.694 UTC <snapshotImportsMonitorScheduler-1> tid=0x25] enforce-unique-host and redundancy-zone properties have no effect for a LonerDistributedSystem.
20-Feb-2019 01:59:59
20-Feb-2019 01:59:59 [warn 2019/02/20 01:59:59.699 UTC <snapshotImportsMonitorScheduler-1> tid=0x25] enforce-unique-host and redundancy-zone properties have no effect for a LonerDistributedSystem.
20-Feb-2019 01:59:59
20-Feb-2019 01:59:59 [warn 2019/02/20 01:59:59.700 UTC <snapshotImportsMonitorScheduler-1> tid=0x25] enforce-unique-host and redundancy-zone properties have no effect for a LonerDistributedSystem.
20-Feb-2019 01:59:59
20-Feb-2019 01:59:59 [warn 2019/02/20 01:59:59.702 UTC <snapshotImportsMonitorScheduler-1> tid=0x25] enforce-unique-host and redundancy-zone properties have no effect for a LonerDistributedSystem.
20-Feb-2019 01:59:59
20-Feb-2019 02:00:00 [warn 2019/02/20 02:00:00.707 UTC <snapshotImportsMonitorScheduler-1> tid=0x25] enforce-unique-host and redundancy-zone properties have no effect for a LonerDistributedSystem.
20-Feb-2019 02:00:00
20-Feb-2019 02:00:00 [warn 2019/02/20 02:00:00.709 UTC <snapshotImportsMonitorScheduler-1> tid=0x25] enforce-unique-host and redundancy-zone properties have no effect for a LonerDistributedSystem.
20-Feb-2019 02:00:00
20-Feb-2019 02:00:00 [warn 2019/02/20 02:00:00.710 UTC <snapshotImportsMonitorScheduler-1> tid=0x25] enforce-unique-host and redundancy-zone properties have no effect for a LonerDistributedSystem.
20-Feb-2019 02:00:00
20-Feb-2019 02:00:00 [warn 2019/02/20 02:00:00.715 UTC <snapshotImportsMonitorScheduler-1> tid=0x25] enforce-unique-host and redundancy-zone properties have no effect for a LonerDistributedSystem.
20-Feb-2019 02:00:00
20-Feb-2019 02:00:00 [warn 2019/02/20 02:00:00.716 UTC <snapshotImportsMonitorScheduler-1> tid=0x25] enforce-unique-host and redundancy-zone properties have no effect for a LonerDistributedSystem.
20-Feb-2019 02:00:00
20-Feb-2019 02:00:00 [warn 2019/02/20 02:00:00.720 UTC <snapshotImportsMonitorScheduler-1> tid=0x25] enforce-unique-host and redundancy-zone properties have no effect for a LonerDistributedSystem.
20-Feb-2019 02:00:00
20-Feb-2019 02:00:00 [warn 2019/02/20 02:00:00.721 UTC <snapshotImportsMonitorScheduler-1> tid=0x25] enforce-unique-host and redundancy-zone properties have no effect for a LonerDistributedSystem.
20-Feb-2019 02:00:00
20-Feb-2019 02:00:01 [warn 2019/02/20 02:00:01.726 UTC <snapshotImportsMonitorScheduler-1> tid=0x25] enforce-unique-host and redundancy-zone properties have no effect for a LonerDistributedSystem.
20-Feb-2019 02:00:01
20-Feb-2019 02:00:01 [warn 2019/02/20 02:00:01.737 UTC <snapshotImportsMonitorScheduler-1> tid=0x25] enforce-unique-host and redundancy-zone properties have no effect for a LonerDistributedSystem.
20-Feb-2019 02:00:01
20-Feb-2019 02:00:01 [warn 2019/02/20 02:00:01.739 UTC <snapshotImportsMonitorScheduler-1> tid=0x25] enforce-unique-host and redundancy-zone properties have no effect for a LonerDistributedSystem.
20-Feb-2019 02:00:01
20-Feb-2019 02:00:01 [warn 2019/02/20 02:00:01.744 UTC <snapshotImportsMonitorScheduler-1> tid=0x25] enforce-unique-host and redundancy-zone properties have no effect for a LonerDistributedSystem.
20-Feb-2019 02:00:01
20-Feb-2019 02:00:01 [INFO] Tests run: 1, Failures: 0, Errors: 0, Skipped: 0, Time elapsed: 6.112 s - in org.springframework.data.gemfire.snapshot.SnapshotApplicationEventTriggeredImportsExportsIntegrationTest
20-Feb-2019 02:00:02 [INFO] Running org.springframework.data.gemfire.snapshot.SnapshotServiceImportExportIntegrationTest
20-Feb-2019 02:00:05 [warn 2019/02/20 02:00:05.383 UTC <main> tid=0x1] enforce-unique-host and redundancy-zone properties have no effect for a LonerDistributedSystem.
20-Feb-2019 02:00:05
20-Feb-2019 02:00:05 [warn 2019/02/20 02:00:05.390 UTC <main> tid=0x1] enforce-unique-host and redundancy-zone properties have no effect for a LonerDistributedSystem.
20-Feb-2019 02:00:05
20-Feb-2019 02:00:05 [warn 2019/02/20 02:00:05.392 UTC <main> tid=0x1] enforce-unique-host and redundancy-zone properties have no effect for a LonerDistributedSystem.
20-Feb-2019 02:00:05
20-Feb-2019 02:00:05 [warn 2019/02/20 02:00:05.393 UTC <main> tid=0x1] enforce-unique-host and redundancy-zone properties have no effect for a LonerDistributedSystem.
20-Feb-2019 02:00:05
20-Feb-2019 02:00:05 [warn 2019/02/20 02:00:05.394 UTC <main> tid=0x1] enforce-unique-host and redundancy-zone properties have no effect for a LonerDistributedSystem.
20-Feb-2019 02:00:05
20-Feb-2019 02:00:05 [warn 2019/02/20 02:00:05.395 UTC <main> tid=0x1] enforce-unique-host and redundancy-zone properties have no effect for a LonerDistributedSystem.
20-Feb-2019 02:00:05
20-Feb-2019 02:00:05 [warn 2019/02/20 02:00:05.396 UTC <main> tid=0x1] enforce-unique-host and redundancy-zone properties have no effect for a LonerDistributedSystem.
20-Feb-2019 02:00:05
20-Feb-2019 02:00:05 [warn 2019/02/20 02:00:05.397 UTC <main> tid=0x1] enforce-unique-host and redundancy-zone properties have no effect for a LonerDistributedSystem.
20-Feb-2019 02:00:05
20-Feb-2019 02:00:05 [warn 2019/02/20 02:00:05.398 UTC <main> tid=0x1] enforce-unique-host and redundancy-zone properties have no effect for a LonerDistributedSystem.
20-Feb-2019 02:00:05
20-Feb-2019 02:00:05 [warn 2019/02/20 02:00:05.434 UTC <main> tid=0x1] enforce-unique-host and redundancy-zone properties have no effect for a LonerDistributedSystem.
20-Feb-2019 02:00:05
20-Feb-2019 02:00:05 [warn 2019/02/20 02:00:05.440 UTC <main> tid=0x1] enforce-unique-host and redundancy-zone properties have no effect for a LonerDistributedSystem.
20-Feb-2019 02:00:05
20-Feb-2019 02:00:05 [warn 2019/02/20 02:00:05.441 UTC <main> tid=0x1] enforce-unique-host and redundancy-zone properties have no effect for a LonerDistributedSystem.
20-Feb-2019 02:00:05
20-Feb-2019 02:00:05 [warn 2019/02/20 02:00:05.442 UTC <main> tid=0x1] enforce-unique-host and redundancy-zone properties have no effect for a LonerDistributedSystem.
20-Feb-2019 02:00:05
20-Feb-2019 02:00:05 [warn 2019/02/20 02:00:05.443 UTC <main> tid=0x1] enforce-unique-host and redundancy-zone properties have no effect for a LonerDistributedSystem.
20-Feb-2019 02:00:05
20-Feb-2019 02:00:05 [warn 2019/02/20 02:00:05.444 UTC <main> tid=0x1] enforce-unique-host and redundancy-zone properties have no effect for a LonerDistributedSystem.
20-Feb-2019 02:00:05
20-Feb-2019 02:00:05 [warn 2019/02/20 02:00:05.445 UTC <main> tid=0x1] enforce-unique-host and redundancy-zone properties have no effect for a LonerDistributedSystem.
20-Feb-2019 02:00:05
20-Feb-2019 02:00:05 [warn 2019/02/20 02:00:05.446 UTC <main> tid=0x1] enforce-unique-host and redundancy-zone properties have no effect for a LonerDistributedSystem.
20-Feb-2019 02:00:05
20-Feb-2019 02:00:05 [warn 2019/02/20 02:00:05.448 UTC <main> tid=0x1] enforce-unique-host and redundancy-zone properties have no effect for a LonerDistributedSystem.
20-Feb-2019 02:00:05
20-Feb-2019 02:00:05 [warn 2019/02/20 02:00:05.449 UTC <main> tid=0x1] enforce-unique-host and redundancy-zone properties have no effect for a LonerDistributedSystem.
20-Feb-2019 02:00:05
20-Feb-2019 02:00:05 [warn 2019/02/20 02:00:05.450 UTC <main> tid=0x1] enforce-unique-host and redundancy-zone properties have no effect for a LonerDistributedSystem.
20-Feb-2019 02:00:05
20-Feb-2019 02:00:05 [warn 2019/02/20 02:00:05.451 UTC <main> tid=0x1] enforce-unique-host and redundancy-zone properties have no effect for a LonerDistributedSystem.
20-Feb-2019 02:00:05
20-Feb-2019 02:00:05 [warn 2019/02/20 02:00:05.452 UTC <main> tid=0x1] enforce-unique-host and redundancy-zone properties have no effect for a LonerDistributedSystem.
20-Feb-2019 02:00:05
20-Feb-2019 02:00:05 [warn 2019/02/20 02:00:05.453 UTC <main> tid=0x1] enforce-unique-host and redundancy-zone properties have no effect for a LonerDistributedSystem.
20-Feb-2019 02:00:05
20-Feb-2019 02:00:05 [warn 2019/02/20 02:00:05.454 UTC <main> tid=0x1] enforce-unique-host and redundancy-zone properties have no effect for a LonerDistributedSystem.
20-Feb-2019 02:00:05
20-Feb-2019 02:00:05 [warn 2019/02/20 02:00:05.455 UTC <main> tid=0x1] enforce-unique-host and redundancy-zone properties have no effect for a LonerDistributedSystem.
20-Feb-2019 02:00:05
20-Feb-2019 02:00:05 [warn 2019/02/20 02:00:05.456 UTC <main> tid=0x1] enforce-unique-host and redundancy-zone properties have no effect for a LonerDistributedSystem.
20-Feb-2019 02:00:05
20-Feb-2019 02:00:05 [warn 2019/02/20 02:00:05.457 UTC <main> tid=0x1] enforce-unique-host and redundancy-zone properties have no effect for a LonerDistributedSystem.
20-Feb-2019 02:00:05
20-Feb-2019 02:00:05 [warn 2019/02/20 02:00:05.458 UTC <main> tid=0x1] enforce-unique-host and redundancy-zone properties have no effect for a LonerDistributedSystem.
20-Feb-2019 02:00:05
20-Feb-2019 02:00:05 [warn 2019/02/20 02:00:05.459 UTC <main> tid=0x1] enforce-unique-host and redundancy-zone properties have no effect for a LonerDistributedSystem.
20-Feb-2019 02:00:05
20-Feb-2019 02:00:05 [warn 2019/02/20 02:00:05.460 UTC <main> tid=0x1] enforce-unique-host and redundancy-zone properties have no effect for a LonerDistributedSystem.
20-Feb-2019 02:00:05
20-Feb-2019 02:00:05 [warn 2019/02/20 02:00:05.461 UTC <main> tid=0x1] enforce-unique-host and redundancy-zone properties have no effect for a LonerDistributedSystem.
20-Feb-2019 02:00:05
20-Feb-2019 02:00:05 [warn 2019/02/20 02:00:05.462 UTC <main> tid=0x1] enforce-unique-host and redundancy-zone properties have no effect for a LonerDistributedSystem.
20-Feb-2019 02:00:05
20-Feb-2019 02:00:05 [warn 2019/02/20 02:00:05.463 UTC <main> tid=0x1] enforce-unique-host and redundancy-zone properties have no effect for a LonerDistributedSystem.
20-Feb-2019 02:00:05
20-Feb-2019 02:00:05 [warn 2019/02/20 02:00:05.464 UTC <main> tid=0x1] enforce-unique-host and redundancy-zone properties have no effect for a LonerDistributedSystem.
20-Feb-2019 02:00:05
20-Feb-2019 02:00:05 [warn 2019/02/20 02:00:05.465 UTC <main> tid=0x1] enforce-unique-host and redundancy-zone properties have no effect for a LonerDistributedSystem.
20-Feb-2019 02:00:05
20-Feb-2019 02:00:05 [warn 2019/02/20 02:00:05.465 UTC <main> tid=0x1] enforce-unique-host and redundancy-zone properties have no effect for a LonerDistributedSystem.
20-Feb-2019 02:00:05
20-Feb-2019 02:00:05 [warn 2019/02/20 02:00:05.466 UTC <main> tid=0x1] enforce-unique-host and redundancy-zone properties have no effect for a LonerDistributedSystem.
20-Feb-2019 02:00:05
20-Feb-2019 02:00:05 [warn 2019/02/20 02:00:05.467 UTC <main> tid=0x1] enforce-unique-host and redundancy-zone properties have no effect for a LonerDistributedSystem.
20-Feb-2019 02:00:05
20-Feb-2019 02:00:05 [warn 2019/02/20 02:00:05.468 UTC <main> tid=0x1] enforce-unique-host and redundancy-zone properties have no effect for a LonerDistributedSystem.
20-Feb-2019 02:00:05
20-Feb-2019 02:00:05 [warn 2019/02/20 02:00:05.469 UTC <main> tid=0x1] enforce-unique-host and redundancy-zone properties have no effect for a LonerDistributedSystem.
20-Feb-2019 02:00:05
20-Feb-2019 02:00:05 [warn 2019/02/20 02:00:05.470 UTC <main> tid=0x1] enforce-unique-host and redundancy-zone properties have no effect for a LonerDistributedSystem.
20-Feb-2019 02:00:05
20-Feb-2019 02:00:05 [warn 2019/02/20 02:00:05.471 UTC <main> tid=0x1] enforce-unique-host and redundancy-zone properties have no effect for a LonerDistributedSystem.
20-Feb-2019 02:00:05
20-Feb-2019 02:00:05 [warn 2019/02/20 02:00:05.472 UTC <main> tid=0x1] enforce-unique-host and redundancy-zone properties have no effect for a LonerDistributedSystem.
20-Feb-2019 02:00:05
20-Feb-2019 02:00:05 [warn 2019/02/20 02:00:05.473 UTC <main> tid=0x1] enforce-unique-host and redundancy-zone properties have no effect for a LonerDistributedSystem.
20-Feb-2019 02:00:05
20-Feb-2019 02:00:05 [warn 2019/02/20 02:00:05.474 UTC <main> tid=0x1] enforce-unique-host and redundancy-zone properties have no effect for a LonerDistributedSystem.
20-Feb-2019 02:00:05
20-Feb-2019 02:00:05 [warn 2019/02/20 02:00:05.475 UTC <main> tid=0x1] enforce-unique-host and redundancy-zone properties have no effect for a LonerDistributedSystem.
20-Feb-2019 02:00:05
20-Feb-2019 02:00:05 [warn 2019/02/20 02:00:05.476 UTC <main> tid=0x1] enforce-unique-host and redundancy-zone properties have no effect for a LonerDistributedSystem.
20-Feb-2019 02:00:05
20-Feb-2019 02:00:05 [warn 2019/02/20 02:00:05.477 UTC <main> tid=0x1] enforce-unique-host and redundancy-zone properties have no effect for a LonerDistributedSystem.
20-Feb-2019 02:00:05
20-Feb-2019 02:00:05 [warn 2019/02/20 02:00:05.478 UTC <main> tid=0x1] enforce-unique-host and redundancy-zone properties have no effect for a LonerDistributedSystem.
20-Feb-2019 02:00:05
20-Feb-2019 02:00:05 [warn 2019/02/20 02:00:05.479 UTC <main> tid=0x1] enforce-unique-host and redundancy-zone properties have no effect for a LonerDistributedSystem.
20-Feb-2019 02:00:05
20-Feb-2019 02:00:05 [warn 2019/02/20 02:00:05.480 UTC <main> tid=0x1] enforce-unique-host and redundancy-zone properties have no effect for a LonerDistributedSystem.
20-Feb-2019 02:00:05
20-Feb-2019 02:00:05 [warn 2019/02/20 02:00:05.480 UTC <main> tid=0x1] enforce-unique-host and redundancy-zone properties have no effect for a LonerDistributedSystem.
20-Feb-2019 02:00:05
20-Feb-2019 02:00:05 [warn 2019/02/20 02:00:05.481 UTC <main> tid=0x1] enforce-unique-host and redundancy-zone properties have no effect for a LonerDistributedSystem.
20-Feb-2019 02:00:05
20-Feb-2019 02:00:05 [warn 2019/02/20 02:00:05.482 UTC <main> tid=0x1] enforce-unique-host and redundancy-zone properties have no effect for a LonerDistributedSystem.
20-Feb-2019 02:00:05
20-Feb-2019 02:00:05 [warn 2019/02/20 02:00:05.483 UTC <main> tid=0x1] enforce-unique-host and redundancy-zone properties have no effect for a LonerDistributedSystem.
20-Feb-2019 02:00:05
20-Feb-2019 02:00:05 [warn 2019/02/20 02:00:05.484 UTC <main> tid=0x1] enforce-unique-host and redundancy-zone properties have no effect for a LonerDistributedSystem.
20-Feb-2019 02:00:05
20-Feb-2019 02:00:05 [warn 2019/02/20 02:00:05.485 UTC <main> tid=0x1] enforce-unique-host and redundancy-zone properties have no effect for a LonerDistributedSystem.
20-Feb-2019 02:00:05
20-Feb-2019 02:00:05 [warn 2019/02/20 02:00:05.486 UTC <main> tid=0x1] enforce-unique-host and redundancy-zone properties have no effect for a LonerDistributedSystem.
20-Feb-2019 02:00:05
20-Feb-2019 02:00:05 [warn 2019/02/20 02:00:05.487 UTC <main> tid=0x1] enforce-unique-host and redundancy-zone properties have no effect for a LonerDistributedSystem.
20-Feb-2019 02:00:05
20-Feb-2019 02:00:05 [warn 2019/02/20 02:00:05.488 UTC <main> tid=0x1] enforce-unique-host and redundancy-zone properties have no effect for a LonerDistributedSystem.
20-Feb-2019 02:00:05
20-Feb-2019 02:00:05 [warn 2019/02/20 02:00:05.489 UTC <main> tid=0x1] enforce-unique-host and redundancy-zone properties have no effect for a LonerDistributedSystem.
20-Feb-2019 02:00:05
20-Feb-2019 02:00:05 [warn 2019/02/20 02:00:05.489 UTC <main> tid=0x1] enforce-unique-host and redundancy-zone properties have no effect for a LonerDistributedSystem.
20-Feb-2019 02:00:05
20-Feb-2019 02:00:05 [warn 2019/02/20 02:00:05.490 UTC <main> tid=0x1] enforce-unique-host and redundancy-zone properties have no effect for a LonerDistributedSystem.
20-Feb-2019 02:00:05
20-Feb-2019 02:00:05 [warn 2019/02/20 02:00:05.491 UTC <main> tid=0x1] enforce-unique-host and redundancy-zone properties have no effect for a LonerDistributedSystem.
20-Feb-2019 02:00:05
20-Feb-2019 02:00:05 [warn 2019/02/20 02:00:05.492 UTC <main> tid=0x1] enforce-unique-host and redundancy-zone properties have no effect for a LonerDistributedSystem.
20-Feb-2019 02:00:05
20-Feb-2019 02:00:05 [warn 2019/02/20 02:00:05.493 UTC <main> tid=0x1] enforce-unique-host and redundancy-zone properties have no effect for a LonerDistributedSystem.
20-Feb-2019 02:00:05
20-Feb-2019 02:00:05 [warn 2019/02/20 02:00:05.494 UTC <main> tid=0x1] enforce-unique-host and redundancy-zone properties have no effect for a LonerDistributedSystem.
20-Feb-2019 02:00:05
20-Feb-2019 02:00:05 [warn 2019/02/20 02:00:05.495 UTC <main> tid=0x1] enforce-unique-host and redundancy-zone properties have no effect for a LonerDistributedSystem.
20-Feb-2019 02:00:05
20-Feb-2019 02:00:05 [warn 2019/02/20 02:00:05.495 UTC <main> tid=0x1] enforce-unique-host and redundancy-zone properties have no effect for a LonerDistributedSystem.
20-Feb-2019 02:00:05
20-Feb-2019 02:00:05 [warn 2019/02/20 02:00:05.496 UTC <main> tid=0x1] enforce-unique-host and redundancy-zone properties have no effect for a LonerDistributedSystem.
20-Feb-2019 02:00:05
20-Feb-2019 02:00:05 [warn 2019/02/20 02:00:05.497 UTC <main> tid=0x1] enforce-unique-host and redundancy-zone properties have no effect for a LonerDistributedSystem.
20-Feb-2019 02:00:05
20-Feb-2019 02:00:05 [warn 2019/02/20 02:00:05.498 UTC <main> tid=0x1] enforce-unique-host and redundancy-zone properties have no effect for a LonerDistributedSystem.
20-Feb-2019 02:00:05
20-Feb-2019 02:00:05 [warn 2019/02/20 02:00:05.499 UTC <main> tid=0x1] enforce-unique-host and redundancy-zone properties have no effect for a LonerDistributedSystem.
20-Feb-2019 02:00:05
20-Feb-2019 02:00:05 [warn 2019/02/20 02:00:05.500 UTC <main> tid=0x1] enforce-unique-host and redundancy-zone properties have no effect for a LonerDistributedSystem.
20-Feb-2019 02:00:05
20-Feb-2019 02:00:05 [warn 2019/02/20 02:00:05.501 UTC <main> tid=0x1] enforce-unique-host and redundancy-zone properties have no effect for a LonerDistributedSystem.
20-Feb-2019 02:00:05
20-Feb-2019 02:00:05 [warn 2019/02/20 02:00:05.501 UTC <main> tid=0x1] enforce-unique-host and redundancy-zone properties have no effect for a LonerDistributedSystem.
20-Feb-2019 02:00:05
20-Feb-2019 02:00:05 [warn 2019/02/20 02:00:05.505 UTC <main> tid=0x1] enforce-unique-host and redundancy-zone properties have no effect for a LonerDistributedSystem.
20-Feb-2019 02:00:05
20-Feb-2019 02:00:05 [warn 2019/02/20 02:00:05.506 UTC <main> tid=0x1] enforce-unique-host and redundancy-zone properties have no effect for a LonerDistributedSystem.
20-Feb-2019 02:00:05
20-Feb-2019 02:00:05 [warn 2019/02/20 02:00:05.507 UTC <main> tid=0x1] enforce-unique-host and redundancy-zone properties have no effect for a LonerDistributedSystem.
20-Feb-2019 02:00:05
20-Feb-2019 02:00:05 [warn 2019/02/20 02:00:05.508 UTC <main> tid=0x1] enforce-unique-host and redundancy-zone properties have no effect for a LonerDistributedSystem.
20-Feb-2019 02:00:05
20-Feb-2019 02:00:05 [warn 2019/02/20 02:00:05.509 UTC <main> tid=0x1] enforce-unique-host and redundancy-zone properties have no effect for a LonerDistributedSystem.
20-Feb-2019 02:00:05
20-Feb-2019 02:00:05 [warn 2019/02/20 02:00:05.509 UTC <main> tid=0x1] enforce-unique-host and redundancy-zone properties have no effect for a LonerDistributedSystem.
20-Feb-2019 02:00:05
20-Feb-2019 02:00:05 [warn 2019/02/20 02:00:05.510 UTC <main> tid=0x1] enforce-unique-host and redundancy-zone properties have no effect for a LonerDistributedSystem.
20-Feb-2019 02:00:05
20-Feb-2019 02:00:05 [warn 2019/02/20 02:00:05.511 UTC <main> tid=0x1] enforce-unique-host and redundancy-zone properties have no effect for a LonerDistributedSystem.
20-Feb-2019 02:00:05
20-Feb-2019 02:00:05 [warn 2019/02/20 02:00:05.512 UTC <main> tid=0x1] enforce-unique-host and redundancy-zone properties have no effect for a LonerDistributedSystem.
20-Feb-2019 02:00:05
20-Feb-2019 02:00:05 [warn 2019/02/20 02:00:05.513 UTC <main> tid=0x1] enforce-unique-host and redundancy-zone properties have no effect for a LonerDistributedSystem.
20-Feb-2019 02:00:05
20-Feb-2019 02:00:05 [warn 2019/02/20 02:00:05.514 UTC <main> tid=0x1] enforce-unique-host and redundancy-zone properties have no effect for a LonerDistributedSystem.
20-Feb-2019 02:00:05
20-Feb-2019 02:00:05 [warn 2019/02/20 02:00:05.515 UTC <main> tid=0x1] enforce-unique-host and redundancy-zone properties have no effect for a LonerDistributedSystem.
20-Feb-2019 02:00:05
20-Feb-2019 02:00:05 [warn 2019/02/20 02:00:05.516 UTC <main> tid=0x1] enforce-unique-host and redundancy-zone properties have no effect for a LonerDistributedSystem.
20-Feb-2019 02:00:05
20-Feb-2019 02:00:05 [warn 2019/02/20 02:00:05.517 UTC <main> tid=0x1] enforce-unique-host and redundancy-zone properties have no effect for a LonerDistributedSystem.
20-Feb-2019 02:00:05
20-Feb-2019 02:00:05 [warn 2019/02/20 02:00:05.517 UTC <main> tid=0x1] enforce-unique-host and redundancy-zone properties have no effect for a LonerDistributedSystem.
20-Feb-2019 02:00:05
20-Feb-2019 02:00:05 [warn 2019/02/20 02:00:05.518 UTC <main> tid=0x1] enforce-unique-host and redundancy-zone properties have no effect for a LonerDistributedSystem.
20-Feb-2019 02:00:05
20-Feb-2019 02:00:05 [warn 2019/02/20 02:00:05.519 UTC <main> tid=0x1] enforce-unique-host and redundancy-zone properties have no effect for a LonerDistributedSystem.
20-Feb-2019 02:00:05
20-Feb-2019 02:00:05 [warn 2019/02/20 02:00:05.520 UTC <main> tid=0x1] enforce-unique-host and redundancy-zone properties have no effect for a LonerDistributedSystem.
20-Feb-2019 02:00:05
20-Feb-2019 02:00:05 [warn 2019/02/20 02:00:05.521 UTC <main> tid=0x1] enforce-unique-host and redundancy-zone properties have no effect for a LonerDistributedSystem.
20-Feb-2019 02:00:05
20-Feb-2019 02:00:05 [warn 2019/02/20 02:00:05.522 UTC <main> tid=0x1] enforce-unique-host and redundancy-zone properties have no effect for a LonerDistributedSystem.
20-Feb-2019 02:00:05
20-Feb-2019 02:00:05 [warn 2019/02/20 02:00:05.523 UTC <main> tid=0x1] enforce-unique-host and redundancy-zone properties have no effect for a LonerDistributedSystem.
20-Feb-2019 02:00:05
20-Feb-2019 02:00:05 [warn 2019/02/20 02:00:05.524 UTC <main> tid=0x1] enforce-unique-host and redundancy-zone properties have no effect for a LonerDistributedSystem.
20-Feb-2019 02:00:05
20-Feb-2019 02:00:05 [warn 2019/02/20 02:00:05.524 UTC <main> tid=0x1] enforce-unique-host and redundancy-zone properties have no effect for a LonerDistributedSystem.
20-Feb-2019 02:00:05
20-Feb-2019 02:00:05 [warn 2019/02/20 02:00:05.525 UTC <main> tid=0x1] enforce-unique-host and redundancy-zone properties have no effect for a LonerDistributedSystem.
20-Feb-2019 02:00:05
20-Feb-2019 02:00:05 [warn 2019/02/20 02:00:05.526 UTC <main> tid=0x1] enforce-unique-host and redundancy-zone properties have no effect for a LonerDistributedSystem.
20-Feb-2019 02:00:05
20-Feb-2019 02:00:05 [warn 2019/02/20 02:00:05.527 UTC <main> tid=0x1] enforce-unique-host and redundancy-zone properties have no effect for a LonerDistributedSystem.
20-Feb-2019 02:00:05
20-Feb-2019 02:00:05 [warn 2019/02/20 02:00:05.528 UTC <main> tid=0x1] enforce-unique-host and redundancy-zone properties have no effect for a LonerDistributedSystem.
20-Feb-2019 02:00:05
20-Feb-2019 02:00:05 [warn 2019/02/20 02:00:05.529 UTC <main> tid=0x1] enforce-unique-host and redundancy-zone properties have no effect for a LonerDistributedSystem.
20-Feb-2019 02:00:05
20-Feb-2019 02:00:05 [warn 2019/02/20 02:00:05.530 UTC <main> tid=0x1] enforce-unique-host and redundancy-zone properties have no effect for a LonerDistributedSystem.
20-Feb-2019 02:00:05
20-Feb-2019 02:00:05 [warn 2019/02/20 02:00:05.530 UTC <main> tid=0x1] enforce-unique-host and redundancy-zone properties have no effect for a LonerDistributedSystem.
20-Feb-2019 02:00:05
20-Feb-2019 02:00:05 [warn 2019/02/20 02:00:05.531 UTC <main> tid=0x1] enforce-unique-host and redundancy-zone properties have no effect for a LonerDistributedSystem.
20-Feb-2019 02:00:05
20-Feb-2019 02:00:05 [warn 2019/02/20 02:00:05.532 UTC <main> tid=0x1] enforce-unique-host and redundancy-zone properties have no effect for a LonerDistributedSystem.
20-Feb-2019 02:00:05
20-Feb-2019 02:00:05 [warn 2019/02/20 02:00:05.533 UTC <main> tid=0x1] enforce-unique-host and redundancy-zone properties have no effect for a LonerDistributedSystem.
20-Feb-2019 02:00:05
20-Feb-2019 02:00:05 [warn 2019/02/20 02:00:05.534 UTC <main> tid=0x1] enforce-unique-host and redundancy-zone properties have no effect for a LonerDistributedSystem.
20-Feb-2019 02:00:05
20-Feb-2019 02:00:05 [warn 2019/02/20 02:00:05.535 UTC <main> tid=0x1] enforce-unique-host and redundancy-zone properties have no effect for a LonerDistributedSystem.
20-Feb-2019 02:00:05
20-Feb-2019 02:00:05 [warn 2019/02/20 02:00:05.536 UTC <main> tid=0x1] enforce-unique-host and redundancy-zone properties have no effect for a LonerDistributedSystem.
20-Feb-2019 02:00:05
20-Feb-2019 02:00:05 [warn 2019/02/20 02:00:05.537 UTC <main> tid=0x1] enforce-unique-host and redundancy-zone properties have no effect for a LonerDistributedSystem.
20-Feb-2019 02:00:05
20-Feb-2019 02:00:05 [INFO] Tests run: 1, Failures: 0, Errors: 0, Skipped: 0, Time elapsed: 3.081 s - in org.springframework.data.gemfire.snapshot.SnapshotServiceImportExportIntegrationTest
20-Feb-2019 02:00:06 [INFO] Running org.springframework.data.gemfire.PartitionAttributesFactoryBeanTest
20-Feb-2019 02:00:07 [INFO] Tests run: 3, Failures: 0, Errors: 0, Skipped: 0, Time elapsed: 1.118 s - in org.springframework.data.gemfire.PartitionAttributesFactoryBeanTest
20-Feb-2019 02:00:07 [INFO] Running org.springframework.data.gemfire.CacheAutoReconnectIntegrationTests
20-Feb-2019 02:00:10 [INFO] Tests run: 2, Failures: 0, Errors: 0, Skipped: 0, Time elapsed: 2.769 s - in org.springframework.data.gemfire.CacheAutoReconnectIntegrationTests
20-Feb-2019 02:00:11 [INFO] Running org.springframework.data.gemfire.server.CacheServerFactoryBeanTest
20-Feb-2019 02:00:12 [INFO] Tests run: 8, Failures: 0, Errors: 0, Skipped: 0, Time elapsed: 1.227 s - in org.springframework.data.gemfire.server.CacheServerFactoryBeanTest
20-Feb-2019 02:00:12 [INFO] Running org.springframework.data.gemfire.server.SubscriptionEvictionPolicyConverterUnitTests
20-Feb-2019 02:00:12 [INFO] Tests run: 4, Failures: 0, Errors: 0, Skipped: 0, Time elapsed: 0.116 s - in org.springframework.data.gemfire.server.SubscriptionEvictionPolicyConverterUnitTests
20-Feb-2019 02:00:13 [INFO] Running org.springframework.data.gemfire.server.SubscriptionEvictionPolicyTest
20-Feb-2019 02:00:13 [INFO] Tests run: 5, Failures: 0, Errors: 0, Skipped: 0, Time elapsed: 0.448 s - in org.springframework.data.gemfire.server.SubscriptionEvictionPolicyTest
20-Feb-2019 02:00:14 [INFO] Running org.springframework.data.gemfire.ScopeTypeTest
20-Feb-2019 02:00:14 [INFO] Tests run: 7, Failures: 0, Errors: 0, Skipped: 0, Time elapsed: 0.061 s - in org.springframework.data.gemfire.ScopeTypeTest
20-Feb-2019 02:00:14 [INFO] Running org.springframework.data.gemfire.cache.config.EnableGemfireCachingIntegrationTests
20-Feb-2019 02:00:15 [info 2019/02/20 02:00:15.560 UTC <main> tid=0x1] Could not detect default resource locations for test class [org.springframework.data.gemfire.cache.config.EnableGemfireCachingIntegrationTests]: no resource found for suffixes {-context.xml}.
20-Feb-2019 02:00:15
20-Feb-2019 02:00:15 [info 2019/02/20 02:00:15.574 UTC <main> tid=0x1] AnnotationConfigContextLoader detected default configuration classes for context configuration [ContextConfigurationAttributes@618425b5 declaringClass = 'org.springframework.data.gemfire.cache.config.EnableGemfireCachingIntegrationTests', classes = '{class org.springframework.data.gemfire.cache.config.EnableGemfireCachingIntegrationTests$TestConfiguration}', locations = '{}', inheritLocations = true, initializers = '{}', inheritInitializers = true, name = [null], contextLoaderClass = 'org.springframework.test.context.ContextLoader'].
20-Feb-2019 02:00:15
20-Feb-2019 02:00:15 [info 2019/02/20 02:00:15.588 UTC <main> tid=0x1] Loaded default TestExecutionListener class names from location [META-INF/spring.factories]: [org.springframework.test.context.web.ServletTestExecutionListener, org.springframework.test.context.support.DirtiesContextBeforeModesTestExecutionListener, org.springframework.test.context.support.DependencyInjectionTestExecutionListener, org.springframework.test.context.support.DirtiesContextTestExecutionListener, org.springframework.test.context.transaction.TransactionalTestExecutionListener, org.springframework.test.context.jdbc.SqlScriptsTestExecutionListener]
20-Feb-2019 02:00:15
20-Feb-2019 02:00:15 [info 2019/02/20 02:00:15.596 UTC <main> tid=0x1] Using TestExecutionListeners: [org.springframework.test.context.support.DirtiesContextBeforeModesTestExecutionListener@7b36aa0c, org.springframework.test.context.support.DependencyInjectionTestExecutionListener@5824a83d, org.springframework.test.context.support.DirtiesContextTestExecutionListener@537f60bf, org.springframework.test.context.transaction.TransactionalTestExecutionListener@5677323c, org.springframework.test.context.jdbc.SqlScriptsTestExecutionListener@18df8434]
20-Feb-2019 02:00:15
20-Feb-2019 02:00:17 [INFO] Tests run: 2, Failures: 0, Errors: 0, Skipped: 0, Time elapsed: 2.863 s - in org.springframework.data.gemfire.cache.config.EnableGemfireCachingIntegrationTests
20-Feb-2019 02:00:18 [INFO] Running org.springframework.data.gemfire.cache.GemfireCacheUnitTests
20-Feb-2019 02:00:18 [INFO] Tests run: 19, Failures: 0, Errors: 0, Skipped: 0, Time elapsed: 0.647 s - in org.springframework.data.gemfire.cache.GemfireCacheUnitTests
20-Feb-2019 02:00:19 [INFO] Running org.springframework.data.gemfire.cache.ClientCacheManagerTest
20-Feb-2019 02:00:20 [info 2019/02/20 02:00:20.226 UTC <main> tid=0x1] Loaded default TestExecutionListener class names from location [META-INF/spring.factories]: [org.springframework.test.context.web.ServletTestExecutionListener, org.springframework.test.context.support.DirtiesContextBeforeModesTestExecutionListener, org.springframework.test.context.support.DependencyInjectionTestExecutionListener, org.springframework.test.context.support.DirtiesContextTestExecutionListener, org.springframework.test.context.transaction.TransactionalTestExecutionListener, org.springframework.test.context.jdbc.SqlScriptsTestExecutionListener]
20-Feb-2019 02:00:20
20-Feb-2019 02:00:20 [info 2019/02/20 02:00:20.237 UTC <main> tid=0x1] Using TestExecutionListeners: [org.springframework.test.context.support.DirtiesContextBeforeModesTestExecutionListener@4b8ee4de, org.springframework.test.context.support.DependencyInjectionTestExecutionListener@27f981c6, org.springframework.test.context.support.DirtiesContextTestExecutionListener@1b11171f, org.springframework.test.context.transaction.TransactionalTestExecutionListener@1151e434, org.springframework.test.context.jdbc.SqlScriptsTestExecutionListener@2dc54ad4]
20-Feb-2019 02:00:20
20-Feb-2019 02:00:21 [INFO] Tests run: 1, Failures: 0, Errors: 0, Skipped: 0, Time elapsed: 2.013 s - in org.springframework.data.gemfire.cache.ClientCacheManagerTest
20-Feb-2019 02:00:22 [INFO] Running org.springframework.data.gemfire.cache.CachingWithGemFireIntegrationTest
20-Feb-2019 02:00:22 [info 2019/02/20 02:00:22.855 UTC <main> tid=0x1] Detected default resource location "classpath:org/springframework/data/gemfire/cache/CachingWithGemFireIntegrationTest-context.xml" for test class [org.springframework.data.gemfire.cache.CachingWithGemFireIntegrationTest]
20-Feb-2019 02:00:22
20-Feb-2019 02:00:22 [info 2019/02/20 02:00:22.859 UTC <main> tid=0x1] GenericXmlContextLoader detected default locations for context configuration [ContextConfigurationAttributes@32ee6fee declaringClass = 'org.springframework.data.gemfire.cache.CachingWithGemFireIntegrationTest', classes = '{}', locations = '{classpath:org/springframework/data/gemfire/cache/CachingWithGemFireIntegrationTest-context.xml}', inheritLocations = true, initializers = '{}', inheritInitializers = true, name = [null], contextLoaderClass = 'org.springframework.test.context.ContextLoader'].
20-Feb-2019 02:00:22
20-Feb-2019 02:00:22 [info 2019/02/20 02:00:22.861 UTC <main> tid=0x1] Could not detect default configuration classes for test class [org.springframework.data.gemfire.cache.CachingWithGemFireIntegrationTest]: CachingWithGemFireIntegrationTest does not declare any static, non-private, non-final, nested classes annotated with @Configuration.
20-Feb-2019 02:00:22
20-Feb-2019 02:00:22 [info 2019/02/20 02:00:22.876 UTC <main> tid=0x1] Loaded default TestExecutionListener class names from location [META-INF/spring.factories]: [org.springframework.test.context.web.ServletTestExecutionListener, org.springframework.test.context.support.DirtiesContextBeforeModesTestExecutionListener, org.springframework.test.context.support.DependencyInjectionTestExecutionListener, org.springframework.test.context.support.DirtiesContextTestExecutionListener, org.springframework.test.context.transaction.TransactionalTestExecutionListener, org.springframework.test.context.jdbc.SqlScriptsTestExecutionListener]
20-Feb-2019 02:00:22
20-Feb-2019 02:00:22 [info 2019/02/20 02:00:22.885 UTC <main> tid=0x1] Using TestExecutionListeners: [org.springframework.test.context.support.DirtiesContextBeforeModesTestExecutionListener@272113c4, org.springframework.test.context.support.DependencyInjectionTestExecutionListener@73e9cf30, org.springframework.test.context.support.DirtiesContextTestExecutionListener@771a660, org.springframework.test.context.transaction.TransactionalTestExecutionListener@2d52216b, org.springframework.test.context.jdbc.SqlScriptsTestExecutionListener@242b836]
20-Feb-2019 02:00:22
20-Feb-2019 02:00:24 [warn 2019/02/20 02:00:24.893 UTC <main> tid=0x1] Region NamedNumbersRegion is being created with scope DISTRIBUTED_NO_ACK but enable-network-partition-detection is enabled in the distributed system.  This can lead to cache inconsistencies if there is a network failure.
20-Feb-2019 02:00:24
20-Feb-2019 02:00:25 [INFO] Tests run: 2, Failures: 0, Errors: 0, Skipped: 0, Time elapsed: 2.948 s - in org.springframework.data.gemfire.cache.CachingWithGemFireIntegrationTest
20-Feb-2019 02:00:25 [INFO] Running org.springframework.data.gemfire.cache.GemfireCacheIntegrationTests
20-Feb-2019 02:00:27 [warn 2019/02/20 02:00:27.745 UTC <main> tid=0x1] Region Example is being created with scope DISTRIBUTED_NO_ACK but enable-network-partition-detection is enabled in the distributed system.  This can lead to cache inconsistencies if there is a network failure.
20-Feb-2019 02:00:27
20-Feb-2019 02:00:27 [INFO] Tests run: 13, Failures: 0, Errors: 0, Skipped: 0, Time elapsed: 2.387 s - in org.springframework.data.gemfire.cache.GemfireCacheIntegrationTests
20-Feb-2019 02:00:28 [INFO] Running org.springframework.data.gemfire.cache.GemfireCacheManagerUnitTests
20-Feb-2019 02:00:29 [INFO] Tests run: 19, Failures: 0, Errors: 0, Skipped: 0, Time elapsed: 0.665 s - in org.springframework.data.gemfire.cache.GemfireCacheManagerUnitTests
20-Feb-2019 02:00:29 [INFO] Running org.springframework.data.gemfire.cache.CallableCacheLoaderAdapterTest
20-Feb-2019 02:00:30 [INFO] Tests run: 9, Failures: 0, Errors: 0, Skipped: 0, Time elapsed: 0.623 s - in org.springframework.data.gemfire.cache.CallableCacheLoaderAdapterTest
20-Feb-2019 02:00:30 [INFO] Running org.springframework.data.gemfire.cache.CompoundCachePutCacheEvictIntegrationTests
20-Feb-2019 02:00:31 [info 2019/02/20 02:00:31.642 UTC <main> tid=0x1] Loaded default TestExecutionListener class names from location [META-INF/spring.factories]: [org.springframework.test.context.web.ServletTestExecutionListener, org.springframework.test.context.support.DirtiesContextBeforeModesTestExecutionListener, org.springframework.test.context.support.DependencyInjectionTestExecutionListener, org.springframework.test.context.support.DirtiesContextTestExecutionListener, org.springframework.test.context.transaction.TransactionalTestExecutionListener, org.springframework.test.context.jdbc.SqlScriptsTestExecutionListener]
20-Feb-2019 02:00:31
20-Feb-2019 02:00:31 [info 2019/02/20 02:00:31.654 UTC <main> tid=0x1] Using TestExecutionListeners: [org.springframework.test.context.support.DirtiesContextBeforeModesTestExecutionListener@47d9a273, org.springframework.test.context.support.DependencyInjectionTestExecutionListener@4b8ee4de, org.springframework.test.context.support.DirtiesContextTestExecutionListener@27f981c6, org.springframework.test.context.transaction.TransactionalTestExecutionListener@1b11171f, org.springframework.test.context.jdbc.SqlScriptsTestExecutionListener@1151e434]
20-Feb-2019 02:00:31
20-Feb-2019 02:00:34 [INFO] Tests run: 2, Failures: 0, Errors: 0, Skipped: 0, Time elapsed: 3.15 s - in org.springframework.data.gemfire.cache.CompoundCachePutCacheEvictIntegrationTests
20-Feb-2019 02:00:34 [INFO] Running org.springframework.data.gemfire.RegionLookupIntegrationTests
20-Feb-2019 02:00:36 [warn 2019/02/20 02:00:36.499 UTC <main> tid=0x1] Exception encountered during context initialization - cancelling refresh attempt: org.springframework.beans.factory.BeanCreationException: Error creating bean with name 'NativeClientRegion': Invocation of init method failed; nested exception is org.apache.geode.cache.RegionExistsException: /NativeClientRegion
20-Feb-2019 02:00:36
20-Feb-2019 02:00:37 [warn 2019/02/20 02:00:37.414 UTC <main> tid=0x1] Region NativeReplicateRegion is being created with scope DISTRIBUTED_NO_ACK but enable-network-partition-detection is enabled in the distributed system.  This can lead to cache inconsistencies if there is a network failure.
20-Feb-2019 02:00:37
20-Feb-2019 02:00:37 [warn 2019/02/20 02:00:37.437 UTC <main> tid=0x1] Exception encountered during context initialization - cancelling refresh attempt: org.springframework.beans.factory.BeanCreationException: Error creating bean with name 'NativeReplicateRegion': Invocation of init method failed; nested exception is org.apache.geode.cache.RegionExistsException: /NativeReplicateRegion
20-Feb-2019 02:00:37
20-Feb-2019 02:00:37 [warn 2019/02/20 02:00:37.728 UTC <main> tid=0x1] Region NativeReplicateRegion is being created with scope DISTRIBUTED_NO_ACK but enable-network-partition-detection is enabled in the distributed system.  This can lead to cache inconsistencies if there is a network failure.
20-Feb-2019 02:00:37
20-Feb-2019 02:00:37 [warn 2019/02/20 02:00:37.741 UTC <main> tid=0x1] Exception encountered during context initialization - cancelling refresh attempt: org.springframework.beans.factory.BeanCreationException: Error creating bean with name '/NativeParentRegion/NativeChildRegion': Invocation of init method failed; nested exception is org.apache.geode.cache.RegionExistsException: /NativeParentRegion/NativeChildRegion
20-Feb-2019 02:00:37
20-Feb-2019 02:00:37 [warn 2019/02/20 02:00:37.899 UTC <main> tid=0x1] Region AppDataRegion is being created with scope DISTRIBUTED_NO_ACK but enable-network-partition-detection is enabled in the distributed system.  This can lead to cache inconsistencies if there is a network failure.
20-Feb-2019 02:00:37
20-Feb-2019 02:00:37 [warn 2019/02/20 02:00:37.902 UTC <main> tid=0x1] Exception encountered during context initialization - cancelling refresh attempt: org.springframework.beans.factory.BeanCreationException: Error creating bean with name 'regionTwo': Invocation of init method failed; nested exception is org.apache.geode.cache.RegionExistsException: /AppDataRegion
20-Feb-2019 02:00:37
20-Feb-2019 02:00:37 [warn 2019/02/20 02:00:37.949 UTC <main> tid=0x1] Exception encountered during context initialization - cancelling refresh attempt: org.springframework.beans.factory.BeanCreationException: Error creating bean with name '/NativeClientParentRegion/NativeClientChildRegion': Invocation of init method failed; nested exception is org.apache.geode.cache.RegionExistsException: /NativeClientParentRegion/NativeClientChildRegion
20-Feb-2019 02:00:37
20-Feb-2019 02:00:38 [warn 2019/02/20 02:00:38.185 UTC <main> tid=0x1] Region NativeReplicateRegion is being created with scope DISTRIBUTED_NO_ACK but enable-network-partition-detection is enabled in the distributed system.  This can lead to cache inconsistencies if there is a network failure.
20-Feb-2019 02:00:38
20-Feb-2019 02:00:38 [warn 2019/02/20 02:00:38.207 UTC <main> tid=0x1] Region SpringReplicateRegion is being created with scope DISTRIBUTED_NO_ACK but enable-network-partition-detection is enabled in the distributed system.  This can lead to cache inconsistencies if there is a network failure.
20-Feb-2019 02:00:38
20-Feb-2019 02:00:38 [warn 2019/02/20 02:00:38.366 UTC <main> tid=0x1] Region NativeReplicateRegion is being created with scope DISTRIBUTED_NO_ACK but enable-network-partition-detection is enabled in the distributed system.  This can lead to cache inconsistencies if there is a network failure.
20-Feb-2019 02:00:38
20-Feb-2019 02:00:38 [warn 2019/02/20 02:00:38.371 UTC <main> tid=0x1] Exception encountered during context initialization - cancelling refresh attempt: org.springframework.beans.factory.BeanCreationException: Error creating bean with name 'NativeLocalRegion': Invocation of init method failed; nested exception is org.apache.geode.cache.RegionExistsException: /NativeLocalRegion
20-Feb-2019 02:00:38
20-Feb-2019 02:00:38 [warn 2019/02/20 02:00:38.520 UTC <main> tid=0x1] Region NativeReplicateRegion is being created with scope DISTRIBUTED_NO_ACK but enable-network-partition-detection is enabled in the distributed system.  This can lead to cache inconsistencies if there is a network failure.
20-Feb-2019 02:00:38
20-Feb-2019 02:00:38 [warn 2019/02/20 02:00:38.528 UTC <main> tid=0x1] Exception encountered during context initialization - cancelling refresh attempt: org.springframework.beans.factory.BeanCreationException: Error creating bean with name 'NativePartitionRegion': Invocation of init method failed; nested exception is org.apache.geode.cache.RegionExistsException: /NativePartitionRegion
20-Feb-2019 02:00:38
20-Feb-2019 02:00:38 [INFO] Tests run: 10, Failures: 0, Errors: 0, Skipped: 0, Time elapsed: 4.27 s - in org.springframework.data.gemfire.RegionLookupIntegrationTests
20-Feb-2019 02:00:39 [INFO] Running org.springframework.data.gemfire.RegionDataPolicyShortcutsIntegrationTest
20-Feb-2019 02:00:40 [info 2019/02/20 02:00:40.192 UTC <main> tid=0x1] Loaded default TestExecutionListener class names from location [META-INF/spring.factories]: [org.springframework.test.context.web.ServletTestExecutionListener, org.springframework.test.context.support.DirtiesContextBeforeModesTestExecutionListener, org.springframework.test.context.support.DependencyInjectionTestExecutionListener, org.springframework.test.context.support.DirtiesContextTestExecutionListener, org.springframework.test.context.transaction.TransactionalTestExecutionListener, org.springframework.test.context.jdbc.SqlScriptsTestExecutionListener]
20-Feb-2019 02:00:40
20-Feb-2019 02:00:40 [info 2019/02/20 02:00:40.203 UTC <main> tid=0x1] Using TestExecutionListeners: [org.springframework.test.context.support.DirtiesContextBeforeModesTestExecutionListener@2dc54ad4, org.springframework.test.context.support.DependencyInjectionTestExecutionListener@4659191b, org.springframework.test.context.support.DirtiesContextTestExecutionListener@55634720, org.springframework.test.context.transaction.TransactionalTestExecutionListener@4b0d79fc, org.springframework.test.context.jdbc.SqlScriptsTestExecutionListener@4c1909a3]
20-Feb-2019 02:00:40
20-Feb-2019 02:00:42 [warn 2019/02/20 02:00:42.189 UTC <main> tid=0x1] Region ReplicateWithDataPolicy is being created with scope DISTRIBUTED_NO_ACK but enable-network-partition-detection is enabled in the distributed system.  This can lead to cache inconsistencies if there is a network failure.
20-Feb-2019 02:00:42
20-Feb-2019 02:00:42 [INFO] Tests run: 8, Failures: 0, Errors: 0, Skipped: 0, Time elapsed: 2.93 s - in org.springframework.data.gemfire.RegionDataPolicyShortcutsIntegrationTest
20-Feb-2019 02:00:42 [INFO] Running org.springframework.data.gemfire.dao.GemfireDaoSupportUnitTests
20-Feb-2019 02:00:44 [INFO] Tests run: 4, Failures: 0, Errors: 0, Skipped: 0, Time elapsed: 1.231 s - in org.springframework.data.gemfire.dao.GemfireDaoSupportUnitTests
20-Feb-2019 02:00:44 [INFO] Running org.springframework.data.gemfire.DiskStoreBeanUsingPropertyPlaceholdersIntegrationTest
20-Feb-2019 02:00:45 [info 2019/02/20 02:00:45.575 UTC <main> tid=0x1] Loaded default TestExecutionListener class names from location [META-INF/spring.factories]: [org.springframework.test.context.web.ServletTestExecutionListener, org.springframework.test.context.support.DirtiesContextBeforeModesTestExecutionListener, org.springframework.test.context.support.DependencyInjectionTestExecutionListener, org.springframework.test.context.support.DirtiesContextTestExecutionListener, org.springframework.test.context.transaction.TransactionalTestExecutionListener, org.springframework.test.context.jdbc.SqlScriptsTestExecutionListener]
20-Feb-2019 02:00:45
20-Feb-2019 02:00:45 [info 2019/02/20 02:00:45.587 UTC <main> tid=0x1] Using TestExecutionListeners: [org.springframework.test.context.support.DirtiesContextBeforeModesTestExecutionListener@4659191b, org.springframework.test.context.support.DependencyInjectionTestExecutionListener@55634720, org.springframework.test.context.support.DirtiesContextTestExecutionListener@4b0d79fc, org.springframework.test.context.transaction.TransactionalTestExecutionListener@4c1909a3, org.springframework.test.context.jdbc.SqlScriptsTestExecutionListener@428640fa]
20-Feb-2019 02:00:45
20-Feb-2019 02:00:45 [info 2019/02/20 02:00:45.888 UTC <main> tid=0x1] Replacing the [gemfireCache] bean definition having type [org.springframework.data.gemfire.CacheFactoryBean] with mock [org.springframework.data.gemfire.test.MockCacheFactoryBean]...
20-Feb-2019 02:00:45
20-Feb-2019 02:00:46 [info 2019/02/20 02:00:46.336 UTC <main> tid=0x1] Connected to Distributed System [DiskStoreUsingPropertyPlaceholdersTest] as Member [null] in Group(s) [[]] with Role(s) [[]] on Host [mockDistributedMember.host] having PID [0]
20-Feb-2019 02:00:46
20-Feb-2019 02:00:46 [info 2019/02/20 02:00:46.347 UTC <main> tid=0x1] Found existing Pivotal GemFire version [9.7.0] Cache [DiskStoreUsingPropertyPlaceholdersTest]
20-Feb-2019 02:00:46
20-Feb-2019 02:00:46 Disk Store Configuration: {allowForceCompaction=false, autoCompact=true, compactionThreshold=75, maxOplogSize=16384, queueSize=8192, timeInterval=5000, writeBufferSize=65536}
20-Feb-2019 02:00:46 [INFO] Tests run: 1, Failures: 0, Errors: 0, Skipped: 0, Time elapsed: 1.694 s - in org.springframework.data.gemfire.DiskStoreBeanUsingPropertyPlaceholdersIntegrationTest
20-Feb-2019 02:00:46 [info 2019/02/20 02:00:46.426 UTC <Thread-1> tid=0xe] Invocation of destroy method failed on bean with name 'gemfireCache': org.apache.geode.cache.CacheClosedException: A cache has not yet been created.
20-Feb-2019 02:00:46
20-Feb-2019 02:00:46 [INFO] Running org.springframework.data.gemfire.IndexTypeTest
20-Feb-2019 02:00:47 [INFO] Tests run: 11, Failures: 0, Errors: 0, Skipped: 0, Time elapsed: 0.068 s - in org.springframework.data.gemfire.IndexTypeTest
20-Feb-2019 02:00:47 [INFO] Running org.springframework.data.gemfire.transaction.config.EnableGemfireCacheTransactionsIntegrationTests
20-Feb-2019 02:00:48 [info 2019/02/20 02:00:48.333 UTC <main> tid=0x1] Could not detect default resource locations for test class [org.springframework.data.gemfire.transaction.config.EnableGemfireCacheTransactionsIntegrationTests]: no resource found for suffixes {-context.xml}.
20-Feb-2019 02:00:48
20-Feb-2019 02:00:48 [info 2019/02/20 02:00:48.347 UTC <main> tid=0x1] AnnotationConfigContextLoader detected default configuration classes for context configuration [ContextConfigurationAttributes@bae7dc0 declaringClass = 'org.springframework.data.gemfire.transaction.config.EnableGemfireCacheTransactionsIntegrationTests', classes = '{class org.springframework.data.gemfire.transaction.config.EnableGemfireCacheTransactionsIntegrationTests$TestConfiguration}', locations = '{}', inheritLocations = true, initializers = '{}', inheritInitializers = true, name = [null], contextLoaderClass = 'org.springframework.test.context.ContextLoader'].
20-Feb-2019 02:00:48
20-Feb-2019 02:00:48 [info 2019/02/20 02:00:48.361 UTC <main> tid=0x1] Loaded default TestExecutionListener class names from location [META-INF/spring.factories]: [org.springframework.test.context.web.ServletTestExecutionListener, org.springframework.test.context.support.DirtiesContextBeforeModesTestExecutionListener, org.springframework.test.context.support.DependencyInjectionTestExecutionListener, org.springframework.test.context.support.DirtiesContextTestExecutionListener, org.springframework.test.context.transaction.TransactionalTestExecutionListener, org.springframework.test.context.jdbc.SqlScriptsTestExecutionListener]
20-Feb-2019 02:00:48
20-Feb-2019 02:00:48 [info 2019/02/20 02:00:48.370 UTC <main> tid=0x1] Using TestExecutionListeners: [org.springframework.test.context.support.DirtiesContextBeforeModesTestExecutionListener@e350b40, org.springframework.test.context.support.DependencyInjectionTestExecutionListener@41a0aa7d, org.springframework.test.context.support.DirtiesContextTestExecutionListener@2794eab6, org.springframework.test.context.transaction.TransactionalTestExecutionListener@6340e5f0, org.springframework.test.context.jdbc.SqlScriptsTestExecutionListener@45099dd3]
20-Feb-2019 02:00:48
20-Feb-2019 02:00:48 [info 2019/02/20 02:00:48.625 UTC <main> tid=0x1] Bean 'org.springframework.transaction.annotation.ProxyTransactionManagementConfiguration' of type [org.springframework.transaction.annotation.ProxyTransactionManagementConfiguration$$EnhancerBySpringCGLIB$$f5081419] is not eligible for getting processed by all BeanPostProcessors (for example: not eligible for auto-proxying)
20-Feb-2019 02:00:48
20-Feb-2019 02:00:50 [INFO] Tests run: 3, Failures: 0, Errors: 0, Skipped: 0, Time elapsed: 2.829 s - in org.springframework.data.gemfire.transaction.config.EnableGemfireCacheTransactionsIntegrationTests
20-Feb-2019 02:00:50 [INFO] Running org.springframework.data.gemfire.transaction.GemfireTransactionManagerIntegrationTests
20-Feb-2019 02:00:51 [info 2019/02/20 02:00:51.729 UTC <main> tid=0x1] Could not detect default resource locations for test class [org.springframework.data.gemfire.transaction.GemfireTransactionManagerIntegrationTests]: no resource found for suffixes {-context.xml}.
20-Feb-2019 02:00:51
20-Feb-2019 02:00:51 [info 2019/02/20 02:00:51.744 UTC <main> tid=0x1] AnnotationConfigContextLoader detected default configuration classes for context configuration [ContextConfigurationAttributes@5d7148e2 declaringClass = 'org.springframework.data.gemfire.transaction.GemfireTransactionManagerIntegrationTests', classes = '{class org.springframework.data.gemfire.transaction.GemfireTransactionManagerIntegrationTests$TestConfiguration}', locations = '{}', inheritLocations = true, initializers = '{}', inheritInitializers = true, name = [null], contextLoaderClass = 'org.springframework.test.context.ContextLoader'].
20-Feb-2019 02:00:51
20-Feb-2019 02:00:51 [info 2019/02/20 02:00:51.759 UTC <main> tid=0x1] Loaded default TestExecutionListener class names from location [META-INF/spring.factories]: [org.springframework.test.context.web.ServletTestExecutionListener, org.springframework.test.context.support.DirtiesContextBeforeModesTestExecutionListener, org.springframework.test.context.support.DependencyInjectionTestExecutionListener, org.springframework.test.context.support.DirtiesContextTestExecutionListener, org.springframework.test.context.transaction.TransactionalTestExecutionListener, org.springframework.test.context.jdbc.SqlScriptsTestExecutionListener]
20-Feb-2019 02:00:51
20-Feb-2019 02:00:51 [info 2019/02/20 02:00:51.768 UTC <main> tid=0x1] Using TestExecutionListeners: [org.springframework.test.context.support.DirtiesContextBeforeModesTestExecutionListener@65c7a252, org.springframework.test.context.support.DependencyInjectionTestExecutionListener@4d154ccd, org.springframework.test.context.support.DirtiesContextTestExecutionListener@229c6181, org.springframework.test.context.transaction.TransactionalTestExecutionListener@4686afc2, org.springframework.test.context.jdbc.SqlScriptsTestExecutionListener@1e0b4072]
20-Feb-2019 02:00:51
20-Feb-2019 02:00:52 [info 2019/02/20 02:00:52.028 UTC <main> tid=0x1] Bean 'org.springframework.transaction.annotation.ProxyTransactionManagementConfiguration' of type [org.springframework.transaction.annotation.ProxyTransactionManagementConfiguration$$EnhancerBySpringCGLIB$$1205cdcd] is not eligible for getting processed by all BeanPostProcessors (for example: not eligible for auto-proxying)
20-Feb-2019 02:00:52
20-Feb-2019 02:00:53 [INFO] Tests run: 1, Failures: 0, Errors: 0, Skipped: 0, Time elapsed: 2.808 s - in org.springframework.data.gemfire.transaction.GemfireTransactionManagerIntegrationTests
20-Feb-2019 02:00:54 [INFO] Running org.springframework.data.gemfire.IndexTypeConverterUnitTests
20-Feb-2019 02:00:54 [INFO] Tests run: 4, Failures: 0, Errors: 0, Skipped: 0, Time elapsed: 0.114 s - in org.springframework.data.gemfire.IndexTypeConverterUnitTests
20-Feb-2019 02:00:54 [INFO] Running org.springframework.data.gemfire.JndiDataSourceTypeTest
20-Feb-2019 02:00:54 [INFO] Tests run: 3, Failures: 0, Errors: 0, Skipped: 0, Time elapsed: 0.054 s - in org.springframework.data.gemfire.JndiDataSourceTypeTest
20-Feb-2019 02:00:55 [INFO] Running org.springframework.data.gemfire.IndexFactoryBeanTest
20-Feb-2019 02:00:57 [INFO] Tests run: 72, Failures: 0, Errors: 0, Skipped: 0, Time elapsed: 1.714 s - in org.springframework.data.gemfire.IndexFactoryBeanTest
20-Feb-2019 02:00:57 [INFO] Running org.springframework.data.gemfire.util.RuntimeExceptionFactoryUnitTests
20-Feb-2019 02:00:58 [INFO] Tests run: 8, Failures: 0, Errors: 0, Skipped: 0, Time elapsed: 0.506 s - in org.springframework.data.gemfire.util.RuntimeExceptionFactoryUnitTests
20-Feb-2019 02:00:58 [INFO] Running org.springframework.data.gemfire.util.CollectionUtilsUnitTests
20-Feb-2019 02:00:59 [INFO] Tests run: 61, Failures: 0, Errors: 0, Skipped: 0, Time elapsed: 0.783 s - in org.springframework.data.gemfire.util.CollectionUtilsUnitTests
20-Feb-2019 02:00:59 [INFO] Running org.springframework.data.gemfire.util.SpringUtilsUnitTests
20-Feb-2019 02:01:00 [INFO] Tests run: 35, Failures: 0, Errors: 0, Skipped: 0, Time elapsed: 0.689 s - in org.springframework.data.gemfire.util.SpringUtilsUnitTests
20-Feb-2019 02:01:01 [INFO] Running org.springframework.data.gemfire.util.ArrayUtilsUnitTests
20-Feb-2019 02:01:01 [INFO] Tests run: 22, Failures: 0, Errors: 0, Skipped: 0, Time elapsed: 0.107 s - in org.springframework.data.gemfire.util.ArrayUtilsUnitTests
20-Feb-2019 02:01:01 [INFO] Running org.springframework.data.gemfire.util.PropertiesBuilderTests
20-Feb-2019 02:01:01 [INFO] Tests run: 21, Failures: 0, Errors: 0, Skipped: 0, Time elapsed: 0.123 s - in org.springframework.data.gemfire.util.PropertiesBuilderTests
20-Feb-2019 02:01:02 [INFO] Running org.springframework.data.gemfire.util.FilterUnitTests
20-Feb-2019 02:01:03 [INFO] Tests run: 6, Failures: 0, Errors: 0, Skipped: 0, Time elapsed: 0.546 s - in org.springframework.data.gemfire.util.FilterUnitTests
20-Feb-2019 02:01:03 [INFO] Running org.springframework.data.gemfire.util.RegionUtilsUnitTests
20-Feb-2019 02:01:03 [INFO] Tests run: 5, Failures: 0, Errors: 0, Skipped: 0, Time elapsed: 0.106 s - in org.springframework.data.gemfire.util.RegionUtilsUnitTests
20-Feb-2019 02:01:04 [INFO] Running org.springframework.data.gemfire.util.StreamUtilsTests
20-Feb-2019 02:01:04 [INFO] Tests run: 4, Failures: 0, Errors: 0, Skipped: 0, Time elapsed: 0.16 s - in org.springframework.data.gemfire.util.StreamUtilsTests
20-Feb-2019 02:01:04 [INFO] Running org.springframework.data.gemfire.AutoRegionLookupWithComponentScanningIntegrationTests
20-Feb-2019 02:01:05 [info 2019/02/20 02:01:05.675 UTC <main> tid=0x1] Detected default resource location "classpath:org/springframework/data/gemfire/AutoRegionLookupWithComponentScanningIntegrationTests-context.xml" for test class [org.springframework.data.gemfire.AutoRegionLookupWithComponentScanningIntegrationTests]
20-Feb-2019 02:01:05
20-Feb-2019 02:01:05 [info 2019/02/20 02:01:05.681 UTC <main> tid=0x1] GenericXmlContextLoader detected default locations for context configuration [ContextConfigurationAttributes@bd4dc25 declaringClass = 'org.springframework.data.gemfire.AutoRegionLookupWithComponentScanningIntegrationTests', classes = '{}', locations = '{classpath:org/springframework/data/gemfire/AutoRegionLookupWithComponentScanningIntegrationTests-context.xml}', inheritLocations = true, initializers = '{}', inheritInitializers = true, name = [null], contextLoaderClass = 'org.springframework.test.context.ContextLoader'].
20-Feb-2019 02:01:05
20-Feb-2019 02:01:05 [info 2019/02/20 02:01:05.683 UTC <main> tid=0x1] Could not detect default configuration classes for test class [org.springframework.data.gemfire.AutoRegionLookupWithComponentScanningIntegrationTests]: AutoRegionLookupWithComponentScanningIntegrationTests does not declare any static, non-private, non-final, nested classes annotated with @Configuration.
20-Feb-2019 02:01:05
20-Feb-2019 02:01:05 [info 2019/02/20 02:01:05.698 UTC <main> tid=0x1] Loaded default TestExecutionListener class names from location [META-INF/spring.factories]: [org.springframework.test.context.web.ServletTestExecutionListener, org.springframework.test.context.support.DirtiesContextBeforeModesTestExecutionListener, org.springframework.test.context.support.DependencyInjectionTestExecutionListener, org.springframework.test.context.support.DirtiesContextTestExecutionListener, org.springframework.test.context.transaction.TransactionalTestExecutionListener, org.springframework.test.context.jdbc.SqlScriptsTestExecutionListener]
20-Feb-2019 02:01:05
20-Feb-2019 02:01:05 [info 2019/02/20 02:01:05.707 UTC <main> tid=0x1] Using TestExecutionListeners: [org.springframework.test.context.support.DirtiesContextBeforeModesTestExecutionListener@4efac082, org.springframework.test.context.support.DependencyInjectionTestExecutionListener@6bd61f98, org.springframework.test.context.support.DirtiesContextTestExecutionListener@48aca48b, org.springframework.test.context.transaction.TransactionalTestExecutionListener@13fd2ccd, org.springframework.test.context.jdbc.SqlScriptsTestExecutionListener@b9b00e0]
20-Feb-2019 02:01:05
20-Feb-2019 02:01:08 [INFO] Tests run: 1, Failures: 0, Errors: 0, Skipped: 0, Time elapsed: 3.497 s - in org.springframework.data.gemfire.AutoRegionLookupWithComponentScanningIntegrationTests
20-Feb-2019 02:01:08 [INFO] Running org.springframework.data.gemfire.CacheServerIntegrationTest
20-Feb-2019 02:01:09 [info 2019/02/20 02:01:09.730 UTC <main> tid=0x1] Loaded default TestExecutionListener class names from location [META-INF/spring.factories]: [org.springframework.test.context.web.ServletTestExecutionListener, org.springframework.test.context.support.DirtiesContextBeforeModesTestExecutionListener, org.springframework.test.context.support.DependencyInjectionTestExecutionListener, org.springframework.test.context.support.DirtiesContextTestExecutionListener, org.springframework.test.context.transaction.TransactionalTestExecutionListener, org.springframework.test.context.jdbc.SqlScriptsTestExecutionListener]
20-Feb-2019 02:01:09
20-Feb-2019 02:01:09 [info 2019/02/20 02:01:09.741 UTC <main> tid=0x1] Using TestExecutionListeners: [org.springframework.test.context.support.DirtiesContextBeforeModesTestExecutionListener@47d9a273, org.springframework.test.context.support.DependencyInjectionTestExecutionListener@4b8ee4de, org.springframework.test.context.support.DirtiesContextTestExecutionListener@27f981c6, org.springframework.test.context.transaction.TransactionalTestExecutionListener@1b11171f, org.springframework.test.context.jdbc.SqlScriptsTestExecutionListener@1151e434]
20-Feb-2019 02:01:09
20-Feb-2019 02:01:11 [warn 2019/02/20 02:01:11.668 UTC <main> tid=0x1] Handshaker max Pool size: 4
20-Feb-2019 02:01:11
20-Feb-2019 02:01:11 [INFO] Tests run: 1, Failures: 0, Errors: 0, Skipped: 0, Time elapsed: 2.762 s - in org.springframework.data.gemfire.CacheServerIntegrationTest
20-Feb-2019 02:01:12 [INFO]
20-Feb-2019 02:01:12 [INFO] Results:
20-Feb-2019 02:01:12 [INFO]
20-Feb-2019 02:01:12 [WARNING] Tests run: 2472, Failures: 0, Errors: 0, Skipped: 2
20-Feb-2019 02:01:12 [INFO]
20-Feb-2019 02:01:12 [INFO]
20-Feb-2019 02:01:12 [INFO] --- build-helper-maven-plugin:3.0.0:add-source (add-kotlin-source) @ spring-data-gemfire ---
20-Feb-2019 02:01:12 [INFO] Source directory: /opt/bamboo-home/xml-data/build-dir/SGF-NJDK8-JOB1/src/main/kotlin added.
20-Feb-2019 02:01:12 [INFO]
20-Feb-2019 02:01:12 [INFO] --- maven-jar-plugin:3.1.0:jar (default-jar) @ spring-data-gemfire ---
20-Feb-2019 02:01:12 [INFO] Building jar: /opt/bamboo-home/xml-data/build-dir/SGF-NJDK8-JOB1/target/spring-data-gemfire-2.2.0.BUILD-SNAPSHOT.jar
20-Feb-2019 02:01:12 [INFO]
20-Feb-2019 02:01:12 [INFO] >>> maven-source-plugin:3.0.1:jar (attach-sources) > generate-sources @ spring-data-gemfire >>>
20-Feb-2019 02:01:12 [INFO]
20-Feb-2019 02:01:12 [INFO] --- maven-enforcer-plugin:1.4.1:enforce (enforce-maven-version) @ spring-data-gemfire ---
20-Feb-2019 02:01:12 [INFO]
20-Feb-2019 02:01:12 [INFO] <<< maven-source-plugin:3.0.1:jar (attach-sources) < generate-sources @ spring-data-gemfire <<<
20-Feb-2019 02:01:12 [INFO]
20-Feb-2019 02:01:12 [INFO]
20-Feb-2019 02:01:12 [INFO] --- maven-source-plugin:3.0.1:jar (attach-sources) @ spring-data-gemfire ---
20-Feb-2019 02:01:12 [INFO] Building jar: /opt/bamboo-home/xml-data/build-dir/SGF-NJDK8-JOB1/target/spring-data-gemfire-2.2.0.BUILD-SNAPSHOT-sources.jar
20-Feb-2019 02:01:13 [INFO]
20-Feb-2019 02:01:13 [INFO] --- maven-install-plugin:2.4:install (default-install) @ spring-data-gemfire ---
20-Feb-2019 02:01:13 [INFO] Installing /opt/bamboo-home/xml-data/build-dir/SGF-NJDK8-JOB1/target/spring-data-gemfire-2.2.0.BUILD-SNAPSHOT.jar to /home/bamboo/.m2/repository/org/springframework/data/spring-data-gemfire/2.2.0.BUILD-SNAPSHOT/spring-data-gemfire-2.2.0.BUILD-SNAPSHOT.jar
20-Feb-2019 02:01:13 [INFO] Installing /opt/bamboo-home/xml-data/build-dir/SGF-NJDK8-JOB1/pom.xml to /home/bamboo/.m2/repository/org/springframework/data/spring-data-gemfire/2.2.0.BUILD-SNAPSHOT/spring-data-gemfire-2.2.0.BUILD-SNAPSHOT.pom
20-Feb-2019 02:01:13 [INFO] Installing /opt/bamboo-home/xml-data/build-dir/SGF-NJDK8-JOB1/target/spring-data-gemfire-2.2.0.BUILD-SNAPSHOT-sources.jar to /home/bamboo/.m2/repository/org/springframework/data/spring-data-gemfire/2.2.0.BUILD-SNAPSHOT/spring-data-gemfire-2.2.0.BUILD-SNAPSHOT-sources.jar
20-Feb-2019 02:01:13 [INFO] Artifactory Build Info Recorder: deploy artifacts set to false, artifacts will not be deployed...
20-Feb-2019 02:01:13 [INFO] Artifactory Build Info Recorder: publish build info set to false, build info will not be published...
20-Feb-2019 02:01:13 [INFO] ------------------------------------------------------------------------
20-Feb-2019 02:01:13 [INFO] BUILD SUCCESS
20-Feb-2019 02:01:13 [INFO] ------------------------------------------------------------------------
20-Feb-2019 02:01:13 [INFO] Total time: 15:18 min
20-Feb-2019 02:01:13 [INFO] Finished at: 2019-02-20T02:01:13Z
20-Feb-2019 02:01:13 [INFO] Final Memory: 65M/1564M
20-Feb-2019 02:01:13 [INFO] ------------------------------------------------------------------------
20-Feb-2019 02:01:13 Parsing test results under /opt/bamboo-home/xml-data/build-dir/SGF-NJDK8-JOB1...
20-Feb-2019 02:01:13 Finished task 'Night SDG Maven build on JDK 8 with mocks enabled.' with result: Success
20-Feb-2019 02:01:13 Running post build plugin 'Docker Container Cleanup'
20-Feb-2019 02:01:13 Running post build plugin 'NCover Results Collector'
20-Feb-2019 02:01:13 Running post build plugin 'Artifactory Release Management Staging'
20-Feb-2019 02:01:13 Running post build plugin 'Artifactory Build Info Copier'
20-Feb-2019 02:01:13 Running post build plugin 'Artifactory Gradle Properties Info Copier'
20-Feb-2019 02:01:13 Running post build plugin 'Clover Results Collector'
20-Feb-2019 02:01:13 Running post build plugin 'npm Cache Cleanup'
20-Feb-2019 02:01:13 Running post build plugin 'Artifact Copier'
20-Feb-2019 02:01:13 Successfully removed working directory at '/opt/bamboo-home/xml-data/build-dir/SGF-NJDK8-JOB1'
20-Feb-2019 02:01:13 Finalising the build...
20-Feb-2019 02:01:13 Stopping timer.
20-Feb-2019 02:01:13 Build SGF-NJDK8-JOB1-1309 completed.
20-Feb-2019 02:01:14 Running on server: post build plugin 'NCover Results Collector'
20-Feb-2019 02:01:14 Running on server: post build plugin 'Build Hanging Detection Configuration'
20-Feb-2019 02:01:14 Running on server: post build plugin 'Clover Delta Calculator'
20-Feb-2019 02:01:14 Running on server: post build plugin 'Maven Dependencies Postprocessor'
20-Feb-2019 02:01:14 All post build plugins have finished
20-Feb-2019 02:01:14 Generating build results summary...
20-Feb-2019 02:01:16 Saving build results to disk...
20-Feb-2019 02:01:17 Logging substituted variables...
20-Feb-2019 02:01:17 Indexing build results...
20-Feb-2019 02:01:17 Finished building SGF-NJDK8-JOB1-1309.