Build #1,476

Build: #1476 failed Child of SPRINGDATACMNS-DATACMNS-2877

Build result summary

Details

Completed
Duration
13 minutes
Labels
None
Agent
bamboo-01.af.pivotal.io
Revision
cd0f950ad41c715c7848b2cce37ae0aabc854873 cd0f950ad41c715c7848b2cce37ae0aabc854873
Total tests
2473
Failing since
#1475 (Child of SPRINGDATACMNS-DATACMNS-2876)

Responsible

This build has been failing since #1475
No one has taken responsibility

Tests

New test failures 1
Status Test View job Duration
Collapse Failed ApacheGeodeSecurityManagerSecurityIntegrationTests authorizedUser History
Default Job < 1 sec
org.apache.geode.cache.client.ServerOperationException: remote server on bamboo-01(GeodeSecurityIntegrationTestsClient:10597:loner):44110:c7824157:GeodeSecurityIntegrationTestsClient: org.apache.geode.security.NotAuthorizedException: analyst not authorized for DATA:WRITE:Echo:two
Caused by: org.apache.geode.security.NotAuthorizedException: analyst not authorized for DATA:WRITE:Echo:two
Caused by: org.apache.shiro.authz.UnauthorizedException: Subject does not have permission [DATA:WRITE:Echo:two]
Fixed tests 1
Status Test Failing since View job Duration
Successful DurableClientCacheIntegrationTest durableClientGetsUpdatesFromServerWhileClientWasOffline History
Failing since build #1475 (Child of SPRINGDATACMNS-DATACMNS-2876) Default Job < 1 sec