Build: #120 failed Changes by Gary Russell

Build result summary

Details

Completed
Duration
39 seconds
Labels
None
Agent
bamboo-21.af.pivotal.io
Revision
03f14613fd9bed16996eda23693100bbe9bd4e23 03f14613fd9bed16996eda23693100bbe9bd4e23
Fixed in
#121 (Changes by Artem Bilan)
No failed tests found, a possible compilation error occurred.

Responsible

Code commits

Author Commit Message Commit date
Gary Russell Gary Russell 03f14613fd9bed16996eda23693100bbe9bd4e23 03f14613fd9bed16996eda23693100bbe9bd4e23 GH-1145: Backport NPE Fix
Resolves https://github.com/spring-projects/spring-kafka/issues/1145

**cherry-pick to 2.0.x, 1.3.x**

Jira issues

IssueDescriptionStatus
Unknown Issue TypeGH-1145Could not obtain issue details from Jira

Error summary for Default Job

The job generated some errors, drill down into the full build log for more details.

Could not find test result reports in the /opt/bamboo-home/xml-data/build-dir/SK-SK13X-JOB1 directory.
POM relocation to an other version number is not fully supported in Gradle : xml-apis:xml-apis:2.0.2 relocated to xml-apis:xml-apis:1.0.b2.
/opt/bamboo-home/xml-data/build-dir/SK-SK13X-JOB1/spring-kafka/src/main/java/org/springframework/kafka/listener/KafkaMessageListenerContainer.java:569: error: cannot find symbol
                private void seekPartitions(@Nullable Collection<TopicPartition> partitions, boolean idle) {
                                             ^
  symbol:   class Nullable
  location: class KafkaMessageListenerContainer<K,V>.ListenerConsumer
  where K,V are type-variables:
    K extends Object declared in class KafkaMessageListenerContainer
    V extends Object declared in class KafkaMessageListenerContainer
/opt/bamboo-home/xml-data/build-dir/SK-SK13X-JOB1/spring-kafka/src/main/java/org/springframework/kafka/listener/KafkaMessageListenerContainer.java:569: error: cannot find symbol
                private void seekPartitions(@Nullable Collection<TopicPartition> partitions, boolean idle) {
                                             ^
  symbol:   class Nullable
  location: class KafkaMessageListenerContainer<K,V>.ListenerConsumer
  where K,V are type-variables:
    K extends Object declared in class KafkaMessageListenerContainer
    V extends Object declared in class KafkaMessageListenerContainer
1 error

FAILURE: Build failed with an exception.

* What went wrong:
Execution failed for task ':spring-kafka:compileJava'.
> Compilation failed; see the compiler error output for details.

* Try:
Run with --stacktrace option to get the stack trace. Run with --info or --debug option to get more log output.

BUILD FAILED in 34s