Build: #125 failed Changes by Spring Buildmaster

Build result summary

Details

Completed
Duration
3 minutes
Labels
None
Agent
bamboo-21.af.pivotal.io
Revision
e901e4a4c541e9b4c591ee073f496c9afbdedeb6 e901e4a4c541e9b4c591ee073f496c9afbdedeb6
Total tests
92
Fixed in
#126 (Code changes detected)
No failed tests found, a possible compilation error occurred.

Tests

  • 0 New failures
  • 0 Existing failures
  • 0 Fixed

Responsible

Code commits

Author Commit Message Commit date
Spring Buildmaster Spring Buildmaster e901e4a4c541e9b4c591ee073f496c9afbdedeb6 e901e4a4c541e9b4c591ee073f496c9afbdedeb6 [artifactory-release] Next development version
Spring Buildmaster Spring Buildmaster 2a082158247a05c03c26ca4fe586d212c7ef67a1 2a082158247a05c03c26ca4fe586d212c7ef67a1 [artifactory-release] Release version 1.3.10.RELEASE

Error summary for Default Job

The job generated some errors, drill down into the full build log for more details.


FAILURE: Build failed with an exception.

* What went wrong:
Execution failed for task ':artifactoryDeploy'.
> java.io.IOException: Failed to deploy file. Status code: 409 Response message: Artifactory returned the following errors:
  The repository 'libs-snapshot-local' rejected the resolution of an artifact 'libs-snapshot-local:org/springframework/kafka/spring-kafka/1.3.11.BUILD-SNAPSHIT/spring-kafka-1.3.11.BUILD-SNAPSHIT-javadoc.jar' due to conflict in the snapshot release handling policy. Status code: 409

* Try:
Run with --stacktrace option to get the stack trace. Run with --info or --debug option to get more log output.

BUILD FAILED in 3m 17s