Build: #125 failed Changes by Spring Buildmaster

Logs

The following logs have been generated by the jobs in this plan.
  • Expand all
  • Collapse all
Job Logs
Collapse Default Job Default Stage Download or View
02-Aug-2019 13:52:39 :spring-kafka-test:check
02-Aug-2019 13:52:39 :spring-kafka-test:jacocoTestReport
02-Aug-2019 13:52:39 :spring-kafka-test:build
02-Aug-2019 13:52:39 :dist
02-Aug-2019 13:52:39 :spring-kafka:install
02-Aug-2019 13:52:39 :spring-kafka:artifactoryPublish
02-Aug-2019 13:52:39 :spring-kafka-test:install
02-Aug-2019 13:52:39 :spring-kafka-test:artifactoryPublish
02-Aug-2019 13:52:39 :artifactoryPublish
02-Aug-2019 13:52:39 :artifactoryDeploy
02-Aug-2019 13:52:39 Deploying artifact: https://repo.spring.io/libs-snapshot-local/org/springframework/kafka/spring-kafka/1.3.11.BUILD-SNAPSHIT/spring-kafka-1.3.11.BUILD-SNAPSHIT-javadoc.jar
02-Aug-2019 13:52:40 :artifactoryDeploy FAILED
02-Aug-2019 13:52:40
02-Aug-2019 13:52:40 FAILURE: Build failed with an exception.
02-Aug-2019 13:52:40
02-Aug-2019 13:52:40 * What went wrong:
02-Aug-2019 13:52:40 Execution failed for task ':artifactoryDeploy'.
02-Aug-2019 13:52:40 > java.io.IOException: Failed to deploy file. Status code: 409 Response message: Artifactory returned the following errors:
02-Aug-2019 13:52:40   The repository 'libs-snapshot-local' rejected the resolution of an artifact 'libs-snapshot-local:org/springframework/kafka/spring-kafka/1.3.11.BUILD-SNAPSHIT/spring-kafka-1.3.11.BUILD-SNAPSHIT-javadoc.jar' due to conflict in the snapshot release handling policy. Status code: 409
02-Aug-2019 13:52:40
02-Aug-2019 13:52:40 * Try:
02-Aug-2019 13:52:40 Run with --stacktrace option to get the stack trace. Run with --info or --debug option to get more log output.
02-Aug-2019 13:52:40
02-Aug-2019 13:52:40 BUILD FAILED in 3m 17s
02-Aug-2019 13:52:40 39 actionable tasks: 36 executed, 3 up-to-date