Build: #129 failed Changes by Gary Russell

Build result summary

Details

Completed
Duration
37 seconds
Labels
None
Agent
bamboo-20.af.pivotal.io
Revision
902e9b365551302cc03db9b1fe8c996f20f5cf2e 902e9b365551302cc03db9b1fe8c996f20f5cf2e
Fixed in
#130 (Changes by Artem Bilan)
No failed tests found, a possible compilation error occurred.

Responsible

Code commits

Author Commit Message Commit date
Gary Russell Gary Russell 902e9b365551302cc03db9b1fe8c996f20f5cf2e 902e9b365551302cc03db9b1fe8c996f20f5cf2e GH-1283: Unique client.id for each producer
Resolves https://github.com/spring-projects/spring-kafka/issues/1283

Avoid `InstanceAlreadyExistsException` s when the user supplies a custom
`client.id`.

**cherry-pick to all supported branches**

# Conflicts:
#        spring-kafka/src/main/java/org/springframework/kafka/core/DefaultKafkaProducerFactory.java
#        spring-kafka/src/test/java/org/springframework/kafka/core/KafkaTemplateTransactionTests.java

# Conflicts:
#        spring-kafka/src/main/java/org/springframework/kafka/core/DefaultKafkaProducerFactory.java

# Conflicts:
#        spring-kafka/src/main/java/org/springframework/kafka/core/DefaultKafkaProducerFactory.java

Jira issues

IssueDescriptionStatus
Unknown Issue TypeGH-1283Could not obtain issue details from Jira

Error summary for Default Job

The job generated some errors, drill down into the full build log for more details.

Could not find test result reports in the /opt/bamboo-home/xml-data/build-dir/SK-SK13X-JOB1 directory.
POM relocation to an other version number is not fully supported in Gradle : xml-apis:xml-apis:2.0.2 relocated to xml-apis:xml-apis:1.0.b2.
/opt/bamboo-home/xml-data/build-dir/SK-SK13X-JOB1/spring-kafka/src/main/java/org/springframework/kafka/core/DefaultKafkaProducerFactory.java:317: error: cannot find symbol
                        newProducerConfigs.put(ProducerConfig.CLIENT_ID_CONFIG,
                        ^
  symbol:   variable newProducerConfigs
  location: class DefaultKafkaProducerFactory<K,V>
  where K,V are type-variables:
    K extends Object declared in class DefaultKafkaProducerFactory
    V extends Object declared in class DefaultKafkaProducerFactory
1 error

FAILURE: Build failed with an exception.

* What went wrong:
Execution failed for task ':spring-kafka:compileJava'.
> Compilation failed; see the compiler error output for details.

* Try:
Run with --stacktrace option to get the stack trace. Run with --info or --debug option to get more log output.

BUILD FAILED in 32s