Build: #129 failed Changes by Gary Russell

Logs

The following logs have been generated by the jobs in this plan.
  • Expand all
  • Collapse all
Job Logs
Collapse Default Job Default Stage Download or View
28-Oct-2019 19:58:40 Line 1 of a paragraph overflows the available area by 8125mpt. (fo:block, location: 1978/628)
28-Oct-2019 19:58:40 :reference
28-Oct-2019 19:58:40 :docsZip
28-Oct-2019 19:58:42 /opt/bamboo-home/xml-data/build-dir/SK-SK13X-JOB1/spring-kafka/src/main/java/org/springframework/kafka/core/DefaultKafkaProducerFactory.java:317: error: cannot find symbol
28-Oct-2019 19:58:42                         newProducerConfigs.put(ProducerConfig.CLIENT_ID_CONFIG,
28-Oct-2019 19:58:42                         ^
28-Oct-2019 19:58:42   symbol:   variable newProducerConfigs
28-Oct-2019 19:58:42   location: class DefaultKafkaProducerFactory<K,V>
28-Oct-2019 19:58:42   where K,V are type-variables:
28-Oct-2019 19:58:42     K extends Object declared in class DefaultKafkaProducerFactory
28-Oct-2019 19:58:42     V extends Object declared in class DefaultKafkaProducerFactory
28-Oct-2019 19:58:42 1 error
28-Oct-2019 19:58:42 :spring-kafka:compileJava FAILED
28-Oct-2019 19:58:42
28-Oct-2019 19:58:42 FAILURE: Build failed with an exception.
28-Oct-2019 19:58:42
28-Oct-2019 19:58:42 * What went wrong:
28-Oct-2019 19:58:42 Execution failed for task ':spring-kafka:compileJava'.
28-Oct-2019 19:58:42 > Compilation failed; see the compiler error output for details.
28-Oct-2019 19:58:42
28-Oct-2019 19:58:42 * Try:
28-Oct-2019 19:58:42 Run with --stacktrace option to get the stack trace. Run with --info or --debug option to get more log output.
28-Oct-2019 19:58:42
28-Oct-2019 19:58:42 BUILD FAILED in 32s
28-Oct-2019 19:58:42 11 actionable tasks: 8 executed, 3 up-to-date