Build: #129 failed

Job: Default Job failed

Stages & jobs

  1. Default Stage

Job result summary

Completed
Duration
33 seconds
Agent
bamboo-20.af.pivotal.io
Revision
902e9b365551302cc03db9b1fe8c996f20f5cf2e 902e9b365551302cc03db9b1fe8c996f20f5cf2e
Fixed in
#130 (Code changes detected)
No failed test found. A possible compilation error occurred.

Error summary

The build generated some errors. See the full build log for more details.

Could not find test result reports in the /opt/bamboo-home/xml-data/build-dir/SK-SK13X-JOB1 directory.
POM relocation to an other version number is not fully supported in Gradle : xml-apis:xml-apis:2.0.2 relocated to xml-apis:xml-apis:1.0.b2.
/opt/bamboo-home/xml-data/build-dir/SK-SK13X-JOB1/spring-kafka/src/main/java/org/springframework/kafka/core/DefaultKafkaProducerFactory.java:317: error: cannot find symbol
                        newProducerConfigs.put(ProducerConfig.CLIENT_ID_CONFIG,
                        ^
  symbol:   variable newProducerConfigs
  location: class DefaultKafkaProducerFactory<K,V>
  where K,V are type-variables:
    K extends Object declared in class DefaultKafkaProducerFactory
    V extends Object declared in class DefaultKafkaProducerFactory
1 error

FAILURE: Build failed with an exception.

* What went wrong:
Execution failed for task ':spring-kafka:compileJava'.
> Compilation failed; see the compiler error output for details.

* Try:
Run with --stacktrace option to get the stack trace. Run with --info or --debug option to get more log output.

BUILD FAILED in 32s