Build: #129 failed

Job: Default Job failed

Stages & jobs

  1. Default Stage

Build log

The build generated 146 lines of output. Download or view full build log

28-Oct-2019 19:58:04 Build Spring Kafka - 1.3.x - Default Job #129 (SK-SK13X-JOB1-129) started building on agent bamboo-20.af.pivotal.io
28-Oct-2019 19:58:04 Remote agent on host bamboo-20.af.pivotal.io
28-Oct-2019 19:58:04 Build working directory is /opt/bamboo-home/xml-data/build-dir/SK-SK13X-JOB1
28-Oct-2019 19:58:04 Executing build Spring Kafka - 1.3.x - Default Job #129 (SK-SK13X-JOB1-129)
28-Oct-2019 19:58:04 Starting task 'Checkout Default Repository' of type 'com.atlassian.bamboo.plugins.vcs:task.vcs.checkout'
28-Oct-2019 19:58:04 Build always requires a clean checkout
28-Oct-2019 19:58:04 Cleaning build directory '/opt/bamboo-home/xml-data/build-dir/SK-SK13X-JOB1'
28-Oct-2019 19:58:04 Checking out into /opt/bamboo-home/xml-data/build-dir/SK-SK13X-JOB1
28-Oct-2019 19:58:04 Updating source code to revision: 902e9b365551302cc03db9b1fe8c996f20f5cf2e
28-Oct-2019 19:58:04 Creating local git repository in '/opt/bamboo-home/xml-data/build-dir/SK-SK13X-JOB1/.git'.
28-Oct-2019 19:58:04 Initialized empty Git repository in /opt/bamboo-home/xml-data/build-dir/SK-SK13X-JOB1/.git/
28-Oct-2019 19:58:05 Fetching 'refs/heads/1.3.x' from 'https://github.com/spring-projects/spring-kafka.git'.
28-Oct-2019 19:58:09 From https://github.com/spring-projects/spring-kafka
28-Oct-2019 19:58:09 * [new branch]      1.3.x      -> 1.3.x
28-Oct-2019 19:58:09 * [new tag]         v1.0.0.M1       -> v1.0.0.M1
28-Oct-2019 19:58:09 * [new tag]         v1.0.0.M2       -> v1.0.0.M2
28-Oct-2019 19:58:09 * [new tag]         v1.0.0.RC1      -> v1.0.0.RC1
28-Oct-2019 19:58:09 * [new tag]         v1.0.0.RELEASE  -> v1.0.0.RELEASE
28-Oct-2019 19:58:09 * [new tag]         v1.1.0.M1       -> v1.1.0.M1
28-Oct-2019 19:58:09 * [new tag]         v1.1.0.M2       -> v1.1.0.M2
28-Oct-2019 19:58:09 * [new tag]         v1.1.0.RELEASE  -> v1.1.0.RELEASE
28-Oct-2019 19:58:09 * [new tag]         v1.1.1.RELEASE  -> v1.1.1.RELEASE
28-Oct-2019 19:58:09 * [new tag]         v1.1.2.RELEASE  -> v1.1.2.RELEASE
28-Oct-2019 19:58:09 * [new tag]         v1.1.3.RELEASE  -> v1.1.3.RELEASE
28-Oct-2019 19:58:09 * [new tag]         v1.2.0.RELEASE  -> v1.2.0.RELEASE
28-Oct-2019 19:58:09 * [new tag]         v1.2.1.RELEASE  -> v1.2.1.RELEASE
28-Oct-2019 19:58:09 * [new tag]         v1.2.2.RELEASE  -> v1.2.2.RELEASE
28-Oct-2019 19:58:09 * [new tag]         v1.3.0.M1       -> v1.3.0.M1
28-Oct-2019 19:58:09 * [new tag]         v1.3.0.M2       -> v1.3.0.M2
28-Oct-2019 19:58:09 * [new tag]         v1.3.0.RC1      -> v1.3.0.RC1
28-Oct-2019 19:58:09 * [new tag]         v1.3.0.RELEASE  -> v1.3.0.RELEASE
28-Oct-2019 19:58:09 * [new tag]         v1.3.1.RELEASE  -> v1.3.1.RELEASE
28-Oct-2019 19:58:09 * [new tag]         v1.3.10.RELEASE -> v1.3.10.RELEASE
28-Oct-2019 19:58:09 * [new tag]         v1.3.2.RELEASE  -> v1.3.2.RELEASE
28-Oct-2019 19:58:09 * [new tag]         v1.3.3.RELEASE  -> v1.3.3.RELEASE
28-Oct-2019 19:58:09 * [new tag]         v1.3.4.RELEASE  -> v1.3.4.RELEASE
28-Oct-2019 19:58:09 * [new tag]         v1.3.5.RELEASE  -> v1.3.5.RELEASE
28-Oct-2019 19:58:09 * [new tag]         v1.3.6.RELEASE  -> v1.3.6.RELEASE
28-Oct-2019 19:58:09 * [new tag]         v1.3.7.RELEASE  -> v1.3.7.RELEASE
28-Oct-2019 19:58:09 * [new tag]         v1.3.8.RELEASE  -> v1.3.8.RELEASE
28-Oct-2019 19:58:09 * [new tag]         v1.3.9.RELEASE  -> v1.3.9.RELEASE
28-Oct-2019 19:58:09 Checking out revision 902e9b365551302cc03db9b1fe8c996f20f5cf2e.
28-Oct-2019 19:58:09 Switched to branch '1.3.x'
28-Oct-2019 19:58:09 Updated source code to revision: 902e9b365551302cc03db9b1fe8c996f20f5cf2e
28-Oct-2019 19:58:09 Finished task 'Checkout Default Repository' with result: Success
28-Oct-2019 19:58:09 Running pre-build action: Artifactory Release Staging
28-Oct-2019 19:58:09 Running pre-build action: VCS Version Collector
28-Oct-2019 19:58:09 Starting task 'Artifactory Gradle' of type 'org.jfrog.bamboo.bamboo-artifactory-plugin:artifactoryGradleTask'
28-Oct-2019 19:58:09 Bamboo Artifactory Plugin version: 2.6.3
28-Oct-2019 19:58:09
Beginning to execute external process for build 'Spring Kafka - 1.3.x - Default Job #129 (SK-SK13X-JOB1-129)'
... running command line:
./gradlew clean build dist --no-daemon -I /tmp/artifactory.init.script5745734524407082558gradle -DbuildInfoConfig.propertiesFile=/tmp/buildinfo497742722660120747properties artifactoryPublish -Dartifactory.resolve.password=******** -Dartifactory.publish.password=********
... in: /opt/bamboo-home/xml-data/build-dir/SK-SK13X-JOB1
... using extra environment variables:
bamboo_planRepository_1_branch=1.3.x
bamboo_repository_251625607_branch_name=1.3.x
bamboo_********_username_password=********
bamboo_signing_store_password=********
bamboo_capability_system_builder_ant_Ant_1_9=/opt/ant-1.9
bamboo_capability_system_builder_ant_Ant_1_8=/opt/ant-1.8
bamboo_planRepository_1_branchDisplayName=1.3.x
bamboo_artifactory_override_resolve_repo=libs-milestone
bamboo_capability_system_builder_node_Node_js_10_16=/opt/node-10.16/bin/node
bamboo_repository_revision_number=902e9b365551302cc03db9b1fe8c996f20f5cf2e
bamboo_RIAK_BIN=/usr/sbin/riak
WRAPPER_BITS=32
bamboo_buildKey=SK-SK13X-JOB1
bamboo_bintray_password=********
bamboo_sonar_token_password=********
PWD=/opt/bamboo-home/bin
bamboo_shortJobName=Default Job
bamboo_artifactory_override_resolver_password=********
bamboo_sonatype_token=RSJChaox
bamboo_capability_system_builder_gradle___gradlew=./gradlew
bamboo_buildResultsUrl=https://build.spring.io/browse/SK-SK13X-JOB1-129
bamboo_capability_system_builder_mvn3_Maven_3_3=/opt/maven-3.3
bamboo_capability_system_builder_mvn3_Maven_3_2=/opt/maven-3.2
bamboo_capability_system_builder_mvn3_Maven_3_1=/opt/maven-3.1
bamboo_planRepository_repositoryUrl=https://github.com/spring-projects/spring-kafka.git
bamboo_capability_system_builder_mvn3_Maven_3_6=/opt/maven-3.6
bamboo_agentId=286195713
bamboo_capability_system_builder_mvn3_Maven_3_5=/opt/maven-3.5
bamboo_capability_system_builder_mvn3_Maven_3_0=/opt/maven-3.0
bamboo_planRepository_revision=902e9b365551302cc03db9b1fe8c996f20f5cf2e
bamboo_repository_251625607_git_branch=1.3.x
bamboo_planRepository_previousRevision=54d83f3c10b3bc697d585f07bf7df3d45e2d7082
bamboo_capability_remote_build=true
bamboo_repository_branch_name=1.3.x
bamboo_sonatype_token_password=********
bamboo_sonatype_user=springsource
SHLVL=1
bamboo_org_jfrog_bamboo_buildInfo_serverUrl=https://repo.spring.io
bamboo_scdf_acceptance_tests_password=********
WRAPPER_OS=linux
JAVA_HOME=/opt/jdk-8/
TERM=linux
XDG_SESSION_ID=c1
bamboo_planRepository_branch=1.3.x
bamboo_org_jfrog_bamboo_release_activated=false
bamboo_capability_system_jdk_JDK_13=/opt/jdk-13
bamboo_planRepository_1_type=gitv2
bamboo_planRepository_branchName=1.3.x
bamboo_capability_system_jdk_JDK_12=/opt/jdk-12
WRAPPER_FILE_SEPARATOR=/
_=/opt/bamboo-home/bin/bamboo-agent.sh
bamboo_capability_system_builder_gradlew_gradlew=./
bamboo_capability_system_builder_ant_Ant_1_10=/opt/ant-1.10
WRAPPER_PATH_SEPARATOR=:
bamboo_sonar_password=********
bamboo_hg_cache_directory=/opt/bamboo-home/xml-data/build-dir/_hg-repositories-cache
bamboo_planRepository_1_username=spring-buildmaster
bamboo_planRepository_type=gitv2
bamboo_git_cache_directory=/opt/bamboo-home/xml-data/build-dir/_git-repositories-cache
bamboo_repository_251625607_previous_revision_number=54d83f3c10b3bc697d585f07bf7df3d45e2d7082
bamboo_artifactory_username=buildmaster
bamboo_tmp_directory=/opt/bamboo-home/temp
bamboo_planKey=SK-SK13X
bamboo_planRepository_username=spring-buildmaster
bamboo_JDK8_HOME=/opt/jdk-8
bamboo_repository_251625607_name=Plan Repository
bamboo_planRepository_1_branchName=1.3.x
bamboo_sonar_version=5.6.3
bamboo_sonar_jdbc_password=********
bamboo_bintray_api_key_password=********
GRADLE_OPTS= -Xms128m -Xmx1024m
XDG_DATA_DIRS=/usr/local/share:/usr/share:/var/lib/snapd/desktop
bamboo_capability_system_jdk_JDK_1_11=/opt/jdk-11
bamboo_resultsUrl=https://build.spring.io/browse/SK-SK13X-JOB1-129
bamboo_capability_system_jdk_JDK_1_10=/opt/jdk-10
bamboo_build_working_directory=/opt/bamboo-home/xml-data/build-dir/SK-SK13X-JOB1
bamboo_planRepository_1_name=Plan Repository
bamboo_capability_system_os=ubuntu1804
bamboo_nexusPush_stagingProfile=buildmaster
bamboo_shortPlanName=1.3.x
MAIL=/var/mail/bamboo
bamboo_planRepository_name=Plan Repository
LOGNAME=bamboo
bamboo_repository_251625607_revision_number=902e9b365551302cc03db9b1fe8c996f20f5cf2e
bamboo_buildNumber=129
SHELL=/bin/bash
bamboo_planName=Spring Kafka - 1.3.x
bamboo_JDK7_HOME=/opt/jdk-7
bamboo_shortPlanKey=SK13X
OLDPWD=/opt/users/bamboo
bamboo_shortJobKey=JOB1
bamboo_artifactory_password=********
bamboo_buildTimeStamp=2019-10-28T19:58:13.745Z
bamboo_repository_previous_revision_number=54d83f3c10b3bc697d585f07bf7df3d45e2d7082
bamboo_sonar_username=buildmaster
bamboo_********_password=********
bamboo_repository_git_branch=1.3.x
bamboo_buildResultKey=SK-SK13X-JOB1-129
bamboo_nexusPush_close=true
bamboo_artifactory_override_resolver_username=buildmaster
bamboo_buildPlanName=Spring Kafka - 1.3.x - Default Job
bamboo_planRepository_1_revision=902e9b365551302cc03db9b1fe8c996f20f5cf2e
bamboo_repository_name=Plan Repository
bamboo_signing_key_password=********
bamboo_capability_system_builder_groovy_Groovy_2_5=/opt/groovy-2.5
LANG=en_US.UTF-8
bamboo_buildFailed=false
bamboo_capability_system_docker_executable=/usr/bin/docker
DISPLAY=localhost:1.0
bamboo_capability_system_jdk_OpenJDK_7=/opt/jdk-7
bamboo_capability_system_builder_groovy_Groovy_2_4=/opt/groovy-2.4
bamboo_artifactory_override_deployer_username=buildmaster
bamboo_artifactory_password_mask_b=********
bamboo_capability_system_builder_command_Bash=/bin/bash
bamboo_artifactory_password_mask_a=********
bamboo_agentWorkingDirectory=/opt/bamboo-home/xml-data/build-dir
bamboo_capability_system_git_executable=/usr/bin/git
bamboo_repository_git_username=spring-buildmaster
bamboo_planRepository_1_previousRevision=54d83f3c10b3bc697d585f07bf7df3d45e2d7082
bamboo_capability_os_family=unix
bamboo_planRepository_branchDisplayName=1.3.x
bamboo_repository_251625607_git_repositoryUrl=https://github.com/spring-projects/spring-kafka.git
bamboo_capability_system_builder_maven_Artifactory_Maven_3_6=/opt/maven-3.6
bamboo_capability_system_builder_maven_Artifactory_Maven_3_5=/opt/maven-3.5
GIT_SSL_NO_VERIFY=true
bamboo_capability_system_builder_maven_Artifactory_Maven_3_3=/opt/maven-3.3
bamboo_capability_system_builder_maven_Artifactory_Maven_3_2=/opt/maven-3.2
bamboo_s3_properties=/home/bamboo/tools/s3.properties
bamboo_capability_system_builder_maven_Artifactory_Maven_3_1=/opt/maven-3.1
bamboo_artifactory_override_deploy_repo=libs-snapshot-local
bamboo_capability_system_builder_maven_Artifactory_Maven_3_0=/opt/maven-3.0
bamboo_plan_storageTag=plan-251429135
bamboo_bintray_username_password=********
USER=bamboo
bamboo_repository_git_repositoryUrl=https://github.com/spring-projects/spring-kafka.git
bamboo_working_directory=/opt/bamboo-home/xml-data/build-dir/SK-SK13X-JOB1
bamboo_org_jfrog_bamboo_buildInfo_activated=true
bamboo_planRepository_1_repositoryUrl=https://github.com/spring-projects/spring-kafka.git
bamboo_capability_system_jdk_JDK_1_8=/opt/jdk-8
bamboo_artifactory_override_deployer_password=********
bamboo_capability_system_jdk_JDK_1_9=/opt/jdk-9
WRAPPER_ARCH=x86
bamboo_capability_system_jdk_JDK_1_6=/opt/jdk-6
bamboo_sonatype_password=********
bamboo_capability_system_jdk_JDK_1_7=/opt/jdk-7
bamboo_sonar_ip=10.194.6.9
XDG_RUNTIME_DIR=/run/user/1002
bamboo_repository_251625607_git_username=spring-buildmaster
HOME=/home/bamboo
PATH=/bin:/home/bamboo/bin:/usr/local/sbin:/usr/local/bin:/usr/sbin:/usr/bin:/sbin:/bin:/usr/games:/usr/local/games:/snap/bin:/home/bamboo/bin:/usr/local/bin:/bin:/home/bamboo/bin:/usr/local/sbin:/usr/local/bin:/usr/sbin:/usr/bin:/sbin:/bin:/usr/games:/usr/local/games:/snap/bin:/home/bamboo/bin:/usr/local/bin
28-Oct-2019 19:58:09 Downloading https://services.gradle.org/distributions/gradle-4.0.1-bin.zip
28-Oct-2019 19:58:11 ................................................................
28-Oct-2019 19:58:11 Unzipping /home/bamboo/.gradle/wrapper/dists/gradle-4.0.1-bin/82ajq2mkcvzmyzskx3tahg8op/gradle-4.0.1-bin.zip to /home/bamboo/.gradle/wrapper/dists/gradle-4.0.1-bin/82ajq2mkcvzmyzskx3tahg8op
28-Oct-2019 19:58:12 Set executable permissions for: /home/bamboo/.gradle/wrapper/dists/gradle-4.0.1-bin/82ajq2mkcvzmyzskx3tahg8op/gradle-4.0.1/bin/gradle
28-Oct-2019 19:58:17 POM relocation to an other version number is not fully supported in Gradle : xml-apis:xml-apis:2.0.2 relocated to xml-apis:xml-apis:1.0.b2.
28-Oct-2019 19:58:17 Please update your dependency to directly use the correct version 'xml-apis:xml-apis:1.0.b2'.
28-Oct-2019 19:58:17 Resolution will only pick dependencies of the relocated element.  Artifacts and other metadata will be ignored.
28-Oct-2019 19:58:20 Cannot publish pom for project ':' since it does not contain the Maven plugin install task and task ':artifactoryPublish' does not specify a custom pom path.
28-Oct-2019 19:58:20 :clean UP-TO-DATE
28-Oct-2019 19:58:20 :spring-kafka:clean UP-TO-DATE
28-Oct-2019 19:58:20 :spring-kafka-test:clean UP-TO-DATE
28-Oct-2019 19:58:20 :api
28-Oct-2019 19:58:20 Download https://repo.spring.io/libs-release/org/apache/kafka/kafka-clients/0.11.0.2/kafka-clients-0.11.0.2.pom
28-Oct-2019 19:58:21 Download https://repo.spring.io/libs-release/org/apache/kafka/kafka-streams/0.11.0.2/kafka-streams-0.11.0.2.pom
28-Oct-2019 19:58:21 Download https://repo.spring.io/libs-release/org/rocksdb/rocksdbjni/5.0.1/rocksdbjni-5.0.1.pom
28-Oct-2019 19:58:21 Download https://repo.spring.io/libs-release/org/apache/kafka/connect-json/0.11.0.2/connect-json-0.11.0.2.pom
28-Oct-2019 19:58:21 Download https://repo.spring.io/libs-release/org/apache/kafka/connect-api/0.11.0.2/connect-api-0.11.0.2.pom
28-Oct-2019 19:58:22 Download https://repo.spring.io/libs-release/org/apache/kafka/kafka-streams/0.11.0.2/kafka-streams-0.11.0.2.jar
28-Oct-2019 19:58:22 Download https://repo.spring.io/libs-release/org/apache/kafka/kafka-clients/0.11.0.2/kafka-clients-0.11.0.2.jar
28-Oct-2019 19:58:22 Download https://repo.spring.io/libs-release/org/apache/kafka/connect-json/0.11.0.2/connect-json-0.11.0.2.jar
28-Oct-2019 19:58:22 Download https://repo.spring.io/libs-release/org/apache/kafka/connect-api/0.11.0.2/connect-api-0.11.0.2.jar
28-Oct-2019 19:58:23 Download https://repo.spring.io/libs-release/org/rocksdb/rocksdbjni/5.0.1/rocksdbjni-5.0.1.jar
28-Oct-2019 19:58:24 Download https://repo.spring.io/libs-release/org/apache/kafka/kafka_2.11/0.11.0.2/kafka_2.11-0.11.0.2.pom
28-Oct-2019 19:58:24 Download https://repo.spring.io/libs-release/org/scala-lang/scala-library/2.11.11/scala-library-2.11.11.pom
28-Oct-2019 19:58:24 Download https://repo.spring.io/libs-release/org/scala-lang/modules/scala-parser-combinators_2.11/1.0.4/scala-parser-combinators_2.11-1.0.4.pom
28-Oct-2019 19:58:25 Download https://repo.spring.io/libs-release/org/apache/kafka/kafka-clients/0.11.0.2/kafka-clients-0.11.0.2-test.jar
28-Oct-2019 19:58:25 Download https://repo.spring.io/libs-release/org/apache/kafka/kafka_2.11/0.11.0.2/kafka_2.11-0.11.0.2.jar
28-Oct-2019 19:58:25 Download https://repo.spring.io/libs-release/org/apache/kafka/kafka_2.11/0.11.0.2/kafka_2.11-0.11.0.2-test.jar
28-Oct-2019 19:58:25 Download https://repo.spring.io/libs-release/org/scala-lang/modules/scala-parser-combinators_2.11/1.0.4/scala-parser-combinators_2.11-1.0.4.jar
28-Oct-2019 19:58:26 Download https://repo.spring.io/libs-release/org/scala-lang/scala-library/2.11.11/scala-library-2.11.11.jar
28-Oct-2019 19:58:32 :asciidoctor
28-Oct-2019 19:58:32 Converting /opt/bamboo-home/xml-data/build-dir/SK-SK13X-JOB1/src/reference/asciidoc/index.adoc
28-Oct-2019 19:58:33 Converting /opt/bamboo-home/xml-data/build-dir/SK-SK13X-JOB1/src/reference/asciidoc/index.adoc
28-Oct-2019 19:58:35 :referenceEpub
28-Oct-2019 19:58:37 :referenceHtmlMulti
28-Oct-2019 19:58:37 :referenceHtmlSingle
28-Oct-2019 19:58:39 :referencePdf
28-Oct-2019 19:58:39 Font 'Symbol,normal,700' not found. Substituting with 'Symbol,normal,400'.
28-Oct-2019 19:58:39 Font 'ZapfDingbats,normal,700' not found. Substituting with 'ZapfDingbats,normal,400'.
28-Oct-2019 19:58:39 Font 'ZapfDingbats,italic,400' not found. Substituting with 'ZapfDingbats,normal,400'.
28-Oct-2019 19:58:39 Line 1 of a paragraph overflows the available area by more than 50 points. (fo:block, location: 667/627)
28-Oct-2019 19:58:39 Content of the region-body on page 35 overflows the available area in block-progression dimension. (fo:page-sequence, location: 316/304)
28-Oct-2019 19:58:40 Line 1 of a paragraph overflows the available area by 8125mpt. (fo:block, location: 1978/628)
28-Oct-2019 19:58:40 :reference
28-Oct-2019 19:58:40 :docsZip
28-Oct-2019 19:58:42 /opt/bamboo-home/xml-data/build-dir/SK-SK13X-JOB1/spring-kafka/src/main/java/org/springframework/kafka/core/DefaultKafkaProducerFactory.java:317: error: cannot find symbol
28-Oct-2019 19:58:42                         newProducerConfigs.put(ProducerConfig.CLIENT_ID_CONFIG,
28-Oct-2019 19:58:42                         ^
28-Oct-2019 19:58:42   symbol:   variable newProducerConfigs
28-Oct-2019 19:58:42   location: class DefaultKafkaProducerFactory<K,V>
28-Oct-2019 19:58:42   where K,V are type-variables:
28-Oct-2019 19:58:42     K extends Object declared in class DefaultKafkaProducerFactory
28-Oct-2019 19:58:42     V extends Object declared in class DefaultKafkaProducerFactory
28-Oct-2019 19:58:42 1 error
28-Oct-2019 19:58:42 :spring-kafka:compileJava FAILED
28-Oct-2019 19:58:42
28-Oct-2019 19:58:42 FAILURE: Build failed with an exception.
28-Oct-2019 19:58:42
28-Oct-2019 19:58:42 * What went wrong:
28-Oct-2019 19:58:42 Execution failed for task ':spring-kafka:compileJava'.
28-Oct-2019 19:58:42 > Compilation failed; see the compiler error output for details.
28-Oct-2019 19:58:42
28-Oct-2019 19:58:42 * Try:
28-Oct-2019 19:58:42 Run with --stacktrace option to get the stack trace. Run with --info or --debug option to get more log output.
28-Oct-2019 19:58:42
28-Oct-2019 19:58:42 BUILD FAILED in 32s
28-Oct-2019 19:58:42 11 actionable tasks: 8 executed, 3 up-to-date
28-Oct-2019 19:58:42
28-Oct-2019 19:58:42 Failing task since return code of [./gradlew clean build dist --no-daemon -I /tmp/artifactory.init.script5745734524407082558gradle -DbuildInfoConfig.propertiesFile=/tmp/buildinfo497742722660120747properties artifactoryPublish -Dartifactory.resolve.password=******** -Dartifactory.publish.password=********] was 1 while expected 0
28-Oct-2019 19:58:42 Parsing test results under /opt/bamboo-home/xml-data/build-dir/SK-SK13X-JOB1...
28-Oct-2019 19:58:42 Finished task 'Artifactory Gradle' with result: Failed
28-Oct-2019 19:58:42 Running post build plugin 'Docker Container Cleanup'
28-Oct-2019 19:58:42 Running post build plugin 'NCover Results Collector'
28-Oct-2019 19:58:42 Running post build plugin 'Artifactory Release Management Staging'
28-Oct-2019 19:58:42 Running post build plugin 'Artifactory Build Info Copier'
28-Oct-2019 19:58:42 Running post build plugin 'Artifactory Gradle Properties Info Copier'
28-Oct-2019 19:58:42 Running post build plugin 'Clover Results Collector'
28-Oct-2019 19:58:42 Running post build plugin 'npm Cache Cleanup'
28-Oct-2019 19:58:42 Running post build plugin 'Artifact Copier'
28-Oct-2019 19:58:42 Publishing an artifact: Test Results
28-Oct-2019 19:58:42 Finished publishing of artifact Non required job artifact: [Test Results], pattern: [*/build/reports/tests/**/*.*] in 5.778 ms
28-Oct-2019 19:58:42 Successfully removed working directory at '/opt/bamboo-home/xml-data/build-dir/SK-SK13X-JOB1'
28-Oct-2019 19:58:42 Finalising the build...
28-Oct-2019 19:58:42 Stopping timer.
28-Oct-2019 19:58:42 Build SK-SK13X-JOB1-129 completed.
28-Oct-2019 19:58:51 Running on server: post build plugin 'NCover Results Collector'
28-Oct-2019 19:58:51 Running on server: post build plugin 'Build Hanging Detection Configuration'
28-Oct-2019 19:58:51 Running on server: post build plugin 'Bamboo project link creator'
28-Oct-2019 19:58:51 Running on server: post build plugin 'Clover Delta Calculator'
28-Oct-2019 19:58:51 Running on server: post build plugin 'Maven Dependencies Postprocessor'
28-Oct-2019 19:58:51 All post build plugins have finished
28-Oct-2019 19:58:51 Generating build results summary...
28-Oct-2019 19:58:51 Saving build results to disk...
28-Oct-2019 19:58:51 Logging substituted variables...
28-Oct-2019 19:58:51 Indexing build results...
28-Oct-2019 19:58:51 Finished building SK-SK13X-JOB1-129.