Logs

The following logs have been generated by the jobs in this plan.
  • Expand all
  • Collapse all
Job Logs
Collapse Default Job Default Stage Download or View
04-Apr-2019 18:24:05
04-Apr-2019 18:24:05 org.springframework.social.oauth1.OAuth1TemplateTest > buildAuthorizeUrl FAILED
04-Apr-2019 18:24:05     org.junit.ComparisonFailure at OAuth1TemplateTest.java:67
04-Apr-2019 18:24:05
04-Apr-2019 18:24:05 org.springframework.social.oauth1.OAuth1TemplateTest > buildAuthorizeUrl_customAuthorizeParameters FAILED
04-Apr-2019 18:24:05     org.junit.ComparisonFailure at OAuth1TemplateTest.java:75
04-Apr-2019 18:24:05
04-Apr-2019 18:24:05 org.springframework.social.oauth1.OAuth1TemplateTest > fetchNewRequestToken_OAuth10a FAILED
04-Apr-2019 18:24:05     java.lang.AssertionError at OAuth1TemplateTest.java:97
04-Apr-2019 18:24:05
04-Apr-2019 18:24:05 186 tests completed, 21 failed, 3 skipped
04-Apr-2019 18:24:05 :spring-social-core:springReleaseTest FAILED
04-Apr-2019 18:24:05
04-Apr-2019 18:24:05 FAILURE: Build failed with an exception.
04-Apr-2019 18:24:05
04-Apr-2019 18:24:05 * What went wrong:
04-Apr-2019 18:24:05 Execution failed for task ':spring-social-core:springReleaseTest'.
04-Apr-2019 18:24:05 > There were failing tests. See the report at: file:///opt/bamboo-home/xml-data/build-dir/SOCIAL-DEF-JOB1/spring-social-core/build/reports/spring-release-tests/index.html
04-Apr-2019 18:24:05
04-Apr-2019 18:24:05 * Try:
04-Apr-2019 18:24:05 Run with --stacktrace option to get the stack trace. Run with --info or --debug option to get more log output.
04-Apr-2019 18:24:05
04-Apr-2019 18:24:05 BUILD FAILED
04-Apr-2019 18:24:05
04-Apr-2019 18:24:05 Total time: 1 mins 27.916 secs