Snapshot build for Spring Social LinkedIn module

Build: #2212 failed Manual run by Craig Walls

Logs

The following logs have been generated by the jobs in this plan.
  • Expand all
  • Collapse all
Job Logs
Collapse Default Job Default Stage Download or View
27-Apr-2017 17:34:46         Caused by: java.lang.ClassNotFoundException
27-Apr-2017 17:34:46
27-Apr-2017 17:34:46 org.springframework.social.linkedin.api.impl.GroupTemplateTest > getPosts FAILED
27-Apr-2017 17:34:46     java.lang.NoClassDefFoundError
27-Apr-2017 17:34:46         Caused by: java.lang.ClassNotFoundException
27-Apr-2017 17:34:46
27-Apr-2017 17:34:46 org.springframework.social.linkedin.api.impl.GroupTemplateTest > deleteGroupSuggestion FAILED
27-Apr-2017 17:34:46     java.lang.NoClassDefFoundError
27-Apr-2017 17:34:46         Caused by: java.lang.ClassNotFoundException
27-Apr-2017 17:34:47
27-Apr-2017 17:34:47 57 tests completed, 55 failed
27-Apr-2017 17:34:47 :spring-social-linkedin:test FAILED
27-Apr-2017 17:34:47
27-Apr-2017 17:34:47 FAILURE: Build failed with an exception.
27-Apr-2017 17:34:47
27-Apr-2017 17:34:47 * What went wrong:
27-Apr-2017 17:34:47 Execution failed for task ':spring-social-linkedin:test'.
27-Apr-2017 17:34:47 > There were failing tests. See the report at: file:///opt/bamboo-home/xml-data/build-dir/SOCIAL-LINKEDINSNAPSHOT-JOB1/spring-social-linkedin/build/reports/tests/test/index.html
27-Apr-2017 17:34:47
27-Apr-2017 17:34:47 * Try:
27-Apr-2017 17:34:47 Run with --stacktrace option to get the stack trace. Run with --info or --debug option to get more log output.
27-Apr-2017 17:34:47
27-Apr-2017 17:34:47 BUILD FAILED
27-Apr-2017 17:34:47
27-Apr-2017 17:34:47 Total time: 1 mins 7.89 secs