Build: #546 failed

Job: Default Job failed

Stages & jobs

  1. Default Stage

Build log

The build generated 401 lines of output. Download or view full build log

19-May-2019 01:15:01 Build Spring Social - Nightly Snapshot 1.1.x - Default Job #546 (SOCIAL-NS1-JOB1-546) started building on agent bamboo-12.af.pivotal.io
19-May-2019 01:15:01 Remote agent on host bamboo-12.af.pivotal.io
19-May-2019 01:15:01 Build working directory is /opt/bamboo-home/xml-data/build-dir/SOCIAL-NS1-JOB1
19-May-2019 01:15:01 Executing build Spring Social - Nightly Snapshot 1.1.x - Default Job #546 (SOCIAL-NS1-JOB1-546)
19-May-2019 01:15:01 Starting task 'Checkout Default Repository' of type 'com.atlassian.bamboo.plugins.vcs:task.vcs.checkout'
19-May-2019 01:15:01 Build always requires a clean checkout
19-May-2019 01:15:01 Cleaning build directory '/opt/bamboo-home/xml-data/build-dir/SOCIAL-NS1-JOB1'
19-May-2019 01:15:01 Checking out into /opt/bamboo-home/xml-data/build-dir/SOCIAL-NS1-JOB1
19-May-2019 01:15:01 Updating source code to revision: fd6c57f4840bbf7219d44bf0b054148cb1cc30f5
19-May-2019 01:15:01 Creating local git repository in '/opt/bamboo-home/xml-data/build-dir/SOCIAL-NS1-JOB1/.git'.
19-May-2019 01:15:01 Initialized empty Git repository in /opt/bamboo-home/xml-data/build-dir/SOCIAL-NS1-JOB1/.git/
19-May-2019 01:15:01 Fetching 'refs/heads/1.1.x.dev' from 'git://github.com/SpringSource/spring-social.git'.
19-May-2019 01:15:09 From git://github.com/SpringSource/spring-social
19-May-2019 01:15:09 * [new branch]      1.1.x.dev  -> 1.1.x.dev
19-May-2019 01:15:09 * [new tag]         v1.0.0.M1  -> v1.0.0.M1
19-May-2019 01:15:09 * [new tag]         v1.0.0.M2  -> v1.0.0.M2
19-May-2019 01:15:09 * [new tag]         v1.0.0.M3  -> v1.0.0.M3
19-May-2019 01:15:09 * [new tag]         v1.0.0.RC1 -> v1.0.0.RC1
19-May-2019 01:15:09 * [new tag]         v1.0.0.RC2 -> v1.0.0.RC2
19-May-2019 01:15:09 * [new tag]         v1.0.0.RC3 -> v1.0.0.RC3
19-May-2019 01:15:09 * [new tag]         v1.0.0.RELEASE -> v1.0.0.RELEASE
19-May-2019 01:15:09 * [new tag]         v1.0.1.RELEASE -> v1.0.1.RELEASE
19-May-2019 01:15:09 * [new tag]         v1.0.2.RELEASE -> v1.0.2.RELEASE
19-May-2019 01:15:09 * [new tag]         v1.1.0.M2  -> v1.1.0.M2
19-May-2019 01:15:09 * [new tag]         v1.1.0.M4  -> v1.1.0.M4
19-May-2019 01:15:09 * [new tag]         v1.1.2.RELEASE -> v1.1.2.RELEASE
19-May-2019 01:15:09 * [new tag]         v1.1.4.RELEASE -> v1.1.4.RELEASE
19-May-2019 01:15:09 Checking out revision fd6c57f4840bbf7219d44bf0b054148cb1cc30f5.
19-May-2019 01:15:09 Switched to branch '1.1.x.dev'
19-May-2019 01:15:09 Updated source code to revision: fd6c57f4840bbf7219d44bf0b054148cb1cc30f5
19-May-2019 01:15:09 Finished task 'Checkout Default Repository' with result: Success
19-May-2019 01:15:09 Running pre-build action: Artifactory Release Staging
19-May-2019 01:15:09 Running pre-build action: VCS Version Collector
19-May-2019 01:15:09 Starting task 'Publish Snapshot Build' of type 'org.jfrog.bamboo.bamboo-artifactory-plugin:artifactoryGradleTask'
19-May-2019 01:15:09 Bamboo Artifactory Plugin version: 2.5.x-SNAPSHOT
19-May-2019 01:15:09
Beginning to execute external process for build 'Spring Social - Nightly Snapshot 1.1.x - Default Job #546 (SOCIAL-NS1-JOB1-546)'
... running command line:
./gradlew --refresh-dependencies --stacktrace clean build -I /tmp/artifactory.init.script4813790559010090208gradle -DbuildInfoConfig.propertiesFile=/tmp/buildinfo7058169724031048491properties artifactoryPublish -Dartifactory.resolve.password=******** -Dartifactory.publish.password=********
... in: /opt/bamboo-home/xml-data/build-dir/SOCIAL-NS1-JOB1
... using extra environment variables:
bamboo_planRepository_1_branch=1.1.x.dev
IRBRC=/home/bamboo/.rvm/rubies/ruby-2.3.0/.irbrc
bamboo_********_username_password=********
bamboo_signing_store_password=********
bamboo_capability_system_builder_ant_Ant_1_9=/opt/ant-1.9
bamboo_capability_system_builder_ant_Ant_1_8=/opt/ant-1.8
bamboo_planRepository_1_branchDisplayName=1.1.x.dev
bamboo_capability_system_jdk_OpenJDK_7u181=/opt/openjdk-7
bamboo_repository_revision_number=fd6c57f4840bbf7219d44bf0b054148cb1cc30f5
bamboo_capability_system_builder_node_Node_js_6=/usr/bin/node
bamboo_RIAK_BIN=/usr/sbin/riak
WRAPPER_BITS=32
bamboo_buildKey=SOCIAL-NS1-JOB1
rvm_loaded_flag=1
bamboo_bintray_password=********
bamboo_sonar_token_password=********
rvm_version=1.27.0 (latest)
PWD=/opt/bamboo-home/bin
bamboo_shortJobName=Default Job
bamboo_capability_system_builder_gradle___gradlew=./gradlew
bamboo_buildResultsUrl=https://build.spring.io/browse/SOCIAL-NS1-JOB1-546
bamboo_capability_system_builder_mvn3_Maven_3_3=/opt/maven-3.3
bamboo_capability_system_builder_mvn3_Maven_3_2=/opt/maven-3.2
bamboo_capability_system_builder_mvn3_Maven_3_1=/opt/maven-3.1
bamboo_planRepository_repositoryUrl=git://github.com/SpringSource/spring-social.git
bamboo_agentId=208568336
bamboo_capability_system_builder_mvn3_Maven_3_5=/opt/maven-3.5
MY_RUBY_HOME=/home/bamboo/.rvm/rubies/ruby-2.3.0
bamboo_capability_system_builder_mvn3_Maven_3_0=/opt/maven-3.0
bamboo_repository_256180263_git_branch=1.1.x.dev
rvm_path=/home/bamboo/.rvm
bamboo_planRepository_revision=fd6c57f4840bbf7219d44bf0b054148cb1cc30f5
bamboo_repository_256180263_name=Plan Repository
bamboo_planRepository_previousRevision=fd6c57f4840bbf7219d44bf0b054148cb1cc30f5
bamboo_capability_remote_build=true
bamboo_repository_branch_name=1.1.x.dev
bamboo_sonatype_token_password=********
bamboo_repository_256180263_branch_name=1.1.x.dev
SHLVL=1
bamboo_org_jfrog_bamboo_buildInfo_serverUrl=https://repo.spring.io
bamboo_scdf_acceptance_tests_password=********
WRAPPER_OS=linux
JAVA_HOME=/opt/jdk-8/
bamboo_repository_256180263_git_username=
EC2_HOME=/opt/ec2-api-tools
XDG_SESSION_ID=c1
bamboo_capability_Agent=bamboo-12.af.pivotal.io
bamboo_planRepository_branch=1.1.x.dev
bamboo_org_jfrog_bamboo_release_activated=false
bamboo_repository_256180263_git_repositoryUrl=git://github.com/SpringSource/spring-social.git
bamboo_planRepository_1_type=gitv2
bamboo_planRepository_branchName=1.1.x.dev
bamboo_capability_system_jdk_JDK_12=/opt/jdk-12
WRAPPER_FILE_SEPARATOR=/
_=/opt/bamboo-home/bin/bamboo-agent.sh
bamboo_repository_256180263_previous_revision_number=fd6c57f4840bbf7219d44bf0b054148cb1cc30f5
WRAPPER_PATH_SEPARATOR=:
bamboo_sonar_password=********
bamboo_hg_cache_directory=/opt/bamboo-home/xml-data/build-dir/_hg-repositories-cache
bamboo_planRepository_1_username=
bamboo_planRepository_type=gitv2
bamboo_git_cache_directory=/opt/bamboo-home/xml-data/build-dir/_git-repositories-cache
bamboo_repository_256180263_revision_number=fd6c57f4840bbf7219d44bf0b054148cb1cc30f5
bamboo_artifactory_username=buildmaster
rvm_stored_umask=0002
bamboo_tmp_directory=/opt/bamboo-home/temp
GEM_PATH=/home/bamboo/.rvm/gems/ruby-2.3.0:/home/bamboo/.rvm/gems/ruby-2.3.0@global
bamboo_planKey=SOCIAL-NS1
bamboo_planRepository_username=
bamboo_JDK8_HOME=/opt/jdk-8
bamboo_planRepository_1_branchName=1.1.x.dev
bamboo_sonar_version=5.6.3
XDG_DATA_DIRS=/usr/local/share:/usr/share:/var/lib/snapd/desktop
bamboo_capability_system_jdk_JDK_1_11=/opt/jdk-11
bamboo_resultsUrl=https://build.spring.io/browse/SOCIAL-NS1-JOB1-546
bamboo_capability_system_jdk_JDK_1_10=/opt/jdk-10
bamboo_build_working_directory=/opt/bamboo-home/xml-data/build-dir/SOCIAL-NS1-JOB1
bamboo_planRepository_1_name=Plan Repository
bamboo_capability_system_os=ubuntu1604
bamboo_nexusPush_stagingProfile=buildmaster
bamboo_shortPlanName=Nightly Snapshot 1.1.x
MAIL=/var/mail/bamboo
bamboo_planRepository_name=Plan Repository
LOGNAME=bamboo
bamboo_buildNumber=546
rvm_user_install_flag=1
SHELL=/bin/bash
bamboo_planName=Spring Social - Nightly Snapshot 1.1.x
bamboo_JDK7_HOME=/opt/jdk-7
bamboo_shortPlanKey=NS1
OLDPWD=/opt/users/bamboo
GEM_HOME=/home/bamboo/.rvm/gems/ruby-2.3.0
bamboo_shortJobKey=JOB1
bamboo_artifactory_password=********
bamboo_buildTimeStamp=2019-05-19T01:15:00.970Z
bamboo_repository_previous_revision_number=fd6c57f4840bbf7219d44bf0b054148cb1cc30f5
RUBY_VERSION=ruby-2.3.0
bamboo_sonar_username=buildmaster
_system_name=Ubuntu
bamboo_********_password=********
bamboo_repository_git_branch=1.1.x.dev
bamboo_buildResultKey=SOCIAL-NS1-JOB1-546
bamboo_nexusPush_close=true
bamboo_buildPlanName=Spring Social - Nightly Snapshot 1.1.x - Default Job
bamboo_planRepository_1_revision=fd6c57f4840bbf7219d44bf0b054148cb1cc30f5
_system_arch=x86_64
bamboo_repository_name=Plan Repository
rvm_bin_path=/home/bamboo/.rvm/bin
bamboo_signing_key_password=********
rvm_prefix=/home/bamboo
LANG=en_US.UTF-8
bamboo_buildFailed=false
bamboo_capability_system_docker_executable=/usr/bin/docker
DISPLAY=localhost:1.0
bamboo_capability_system_builder_groovy_Groovy_2_4=/opt/groovy-2.4
bamboo_artifactory_password_mask_b=********
bamboo_capability_system_builder_command_Bash=/bin/bash
bamboo_artifactory_password_mask_a=********
bamboo_agentWorkingDirectory=/opt/bamboo-home/xml-data/build-dir
bamboo_capability_system_git_executable=/usr/bin/git
bamboo_repository_git_username=
bamboo_planRepository_1_previousRevision=fd6c57f4840bbf7219d44bf0b054148cb1cc30f5
bamboo_capability_os_family=unix
NVM_NODEJS_ORG_MIRROR=http://nodejs.org/dist
bamboo_planRepository_branchDisplayName=1.1.x.dev
NODE_PATH=/usr/lib/nodejs:/usr/lib/node_modules:/usr/share/javascript
bamboo_capability_system_builder_maven_Artifactory_Maven_3_5=/opt/maven-3.5
GIT_SSL_NO_VERIFY=true
bamboo_capability_system_builder_maven_Artifactory_Maven_3_3=/opt/maven-3.3
NVM_DIR=/home/bamboo/.nvm
bamboo_capability_system_builder_maven_Artifactory_Maven_3_2=/opt/maven-3.2
bamboo_s3_properties=/home/bamboo/tools/s3.properties
bamboo_capability_system_builder_maven_Artifactory_Maven_3_1=/opt/maven-3.1
bamboo_capability_system_builder_maven_Artifactory_Maven_3_0=/opt/maven-3.0
_system_type=Linux
bamboo_plan_storageTag=plan-255983679
bamboo_bintray_username_password=********
_system_version=16.04
USER=bamboo
bamboo_repository_git_repositoryUrl=git://github.com/SpringSource/spring-social.git
bamboo_working_directory=/opt/bamboo-home/xml-data/build-dir/SOCIAL-NS1-JOB1
bamboo_org_jfrog_bamboo_buildInfo_activated=true
bamboo_planRepository_1_repositoryUrl=git://github.com/SpringSource/spring-social.git
bamboo_capability_system_jdk_JDK_1_8=/opt/jdk-8
bamboo_capability_system_jdk_JDK_1_9=/opt/jdk-9
WRAPPER_ARCH=x86
bamboo_capability_system_jdk_JDK_1_6=/opt/jdk-6
bamboo_sonatype_password=********
bamboo_capability_system_jdk_JDK_1_7=/opt/jdk-7
bamboo_sonar_ip=10.194.6.9
XDG_RUNTIME_DIR=/run/user/505
HOME=/home/bamboo
PATH=/bin:/home/bamboo/.rvm/gems/ruby-2.3.0/bin:/home/bamboo/.rvm/gems/ruby-2.3.0@global/bin:/home/bamboo/.rvm/rubies/ruby-2.3.0/bin:/home/bamboo/bin:/usr/local/bin:/usr/bin:/bin:/usr/local/games:/usr/games:/snap/bin:/home/bamboo/bin:/usr/local/bin:/opt/ec2-api-tools/bin:/home/bamboo/.rvm/bin:/bin:/home/bamboo/.rvm/gems/ruby-2.3.0/bin:/home/bamboo/.rvm/gems/ruby-2.3.0@global/bin:/home/bamboo/.rvm/rubies/ruby-2.3.0/bin:/home/bamboo/bin:/usr/local/bin:/usr/bin:/bin:/usr/local/games:/usr/games:/snap/bin:/home/bamboo/bin:/usr/local/bin:/opt/ec2-api-tools/bin:/home/bamboo/.rvm/bin
19-May-2019 01:15:09 Downloading https://services.gradle.org/distributions/gradle-4.4-bin.zip
19-May-2019 01:15:11 ........................................................................
19-May-2019 01:15:11 Unzipping /home/bamboo/.gradle/wrapper/dists/gradle-4.4-bin/bgaq7vklkazwgxox0hdadxbvi/gradle-4.4-bin.zip to /home/bamboo/.gradle/wrapper/dists/gradle-4.4-bin/bgaq7vklkazwgxox0hdadxbvi
19-May-2019 01:15:12 Set executable permissions for: /home/bamboo/.gradle/wrapper/dists/gradle-4.4-bin/bgaq7vklkazwgxox0hdadxbvi/gradle-4.4/bin/gradle
19-May-2019 01:15:12 Starting a Gradle Daemon (subsequent builds will be faster)
19-May-2019 01:15:20 Generating JAR file 'gradle-api-4.4.jar'
19-May-2019 01:15:21 :buildSrc:clean UP-TO-DATE
19-May-2019 01:15:21 :buildSrc:compileJava NO-SOURCE
19-May-2019 01:15:24 :buildSrc:compileGroovy
19-May-2019 01:15:24 :buildSrc:processResources
19-May-2019 01:15:24 :buildSrc:classes
19-May-2019 01:15:24 :buildSrc:jar
19-May-2019 01:15:24 :buildSrc:assemble
19-May-2019 01:15:24 :buildSrc:compileTestJava NO-SOURCE
19-May-2019 01:15:24 :buildSrc:compileTestGroovy NO-SOURCE
19-May-2019 01:15:24 :buildSrc:processTestResources NO-SOURCE
19-May-2019 01:15:24 :buildSrc:testClasses UP-TO-DATE
19-May-2019 01:15:24 :buildSrc:test NO-SOURCE
19-May-2019 01:15:24 :buildSrc:check UP-TO-DATE
19-May-2019 01:15:24 :buildSrc:build
19-May-2019 01:15:25 Download https://repo.spring.io/plugins-release/io/spring/gradle/spring-io-plugin/0.0.5.RELEASE/spring-io-plugin-0.0.5.RELEASE.pom
19-May-2019 01:15:25 Download https://repo.spring.io/plugins-release/io/spring/gradle/dependency-management-plugin/0.6.0.RELEASE/dependency-management-plugin-0.6.0.RELEASE.pom
19-May-2019 01:15:27 POM relocation to an other version number is not fully supported in Gradle : xml-apis:xml-apis:2.0.2 relocated to xml-apis:xml-apis:1.0.b2.
19-May-2019 01:15:27 Please update your dependency to directly use the correct version 'xml-apis:xml-apis:1.0.b2'.
19-May-2019 01:15:27 Resolution will only pick dependencies of the relocated element.  Artifacts and other metadata will be ignored.
19-May-2019 01:15:27 Download https://repo.spring.io/plugins-release/io/spring/gradle/spring-io-plugin/0.0.5.RELEASE/spring-io-plugin-0.0.5.RELEASE.jar
19-May-2019 01:15:27 Download https://repo.spring.io/plugins-release/io/spring/gradle/dependency-management-plugin/0.6.0.RELEASE/dependency-management-plugin-0.6.0.RELEASE.jar
19-May-2019 01:15:31 Cannot publish pom for project ':' since it does not contain the Maven plugin install task and task ':artifactoryPublish' does not specify a custom pom path.
19-May-2019 01:15:31 Cannot publish pom for project ':spring-build-src' since it does not contain the Maven plugin install task and task ':spring-build-src:artifactoryPublish' does not specify a custom pom path.
19-May-2019 01:15:31 :clean UP-TO-DATE
19-May-2019 01:15:31 :docs:clean UP-TO-DATE
19-May-2019 01:15:31 :spring-build-src:clean
19-May-2019 01:15:31 :spring-social-config:clean UP-TO-DATE
19-May-2019 01:15:31 :spring-social-core:clean UP-TO-DATE
19-May-2019 01:15:31 :spring-social-security:clean UP-TO-DATE
19-May-2019 01:15:31 :spring-social-thymeleaf3:clean UP-TO-DATE
19-May-2019 01:15:31 :spring-social-web:clean UP-TO-DATE
19-May-2019 01:15:31 :docs:manual:clean UP-TO-DATE
19-May-2019 01:15:31 :spring-social-core:compileJava
19-May-2019 01:15:31 Download https://repo.spring.io/libs-snapshot/org/apache/httpcomponents/httpclient/4.3.6/httpclient-4.3.6.pom
19-May-2019 01:15:31 Download https://repo.spring.io/libs-snapshot/org/springframework/spring-jdbc/4.1.8.RELEASE/spring-jdbc-4.1.8.RELEASE.pom
19-May-2019 01:15:31 Download https://repo.spring.io/libs-snapshot/org/springframework/spring-web/4.1.8.RELEASE/spring-web-4.1.8.RELEASE.pom
19-May-2019 01:15:31 Download https://repo.spring.io/libs-snapshot/org/springframework/security/spring-security-crypto/3.2.9.RELEASE/spring-security-crypto-3.2.9.RELEASE.pom
19-May-2019 01:15:31 Download https://repo.spring.io/libs-snapshot/org/apache/httpcomponents/httpcomponents-client/4.3.6/httpcomponents-client-4.3.6.pom
19-May-2019 01:15:32 Download https://repo.spring.io/libs-snapshot/org/springframework/spring-tx/4.1.8.RELEASE/spring-tx-4.1.8.RELEASE.pom
19-May-2019 01:15:32 Download https://repo.spring.io/libs-snapshot/org/springframework/spring-core/4.1.8.RELEASE/spring-core-4.1.8.RELEASE.pom
19-May-2019 01:15:32 Download https://repo.spring.io/libs-snapshot/org/springframework/spring-beans/4.1.8.RELEASE/spring-beans-4.1.8.RELEASE.pom
19-May-2019 01:15:32 Download https://repo.spring.io/libs-snapshot/org/springframework/spring-aop/4.1.8.RELEASE/spring-aop-4.1.8.RELEASE.pom
19-May-2019 01:15:32 Download https://repo.spring.io/libs-snapshot/org/springframework/spring-context/4.1.8.RELEASE/spring-context-4.1.8.RELEASE.pom
19-May-2019 01:15:32 Download https://repo.spring.io/libs-snapshot/org/apache/httpcomponents/httpcore/4.3.3/httpcore-4.3.3.pom
19-May-2019 01:15:32 Download https://repo.spring.io/libs-snapshot/org/apache/httpcomponents/httpcomponents-core/4.3.3/httpcomponents-core-4.3.3.pom
19-May-2019 01:15:32 Download https://repo.spring.io/libs-snapshot/org/springframework/spring-expression/4.1.8.RELEASE/spring-expression-4.1.8.RELEASE.pom
19-May-2019 01:15:33 Download https://repo.spring.io/libs-snapshot/org/apache/httpcomponents/httpclient/4.3.6/httpclient-4.3.6.jar
19-May-2019 01:15:33 Download https://repo.spring.io/libs-snapshot/org/springframework/spring-jdbc/4.1.8.RELEASE/spring-jdbc-4.1.8.RELEASE.jar
19-May-2019 01:15:33 Download https://repo.spring.io/libs-snapshot/org/springframework/spring-web/4.1.8.RELEASE/spring-web-4.1.8.RELEASE.jar
19-May-2019 01:15:33 Download https://repo.spring.io/libs-snapshot/org/springframework/security/spring-security-crypto/3.2.9.RELEASE/spring-security-crypto-3.2.9.RELEASE.jar
19-May-2019 01:15:33 Download https://repo.spring.io/libs-snapshot/org/springframework/spring-context/4.1.8.RELEASE/spring-context-4.1.8.RELEASE.jar
19-May-2019 01:15:33 Download https://repo.spring.io/libs-snapshot/org/springframework/spring-aop/4.1.8.RELEASE/spring-aop-4.1.8.RELEASE.jar
19-May-2019 01:15:33 Download https://repo.spring.io/libs-snapshot/org/springframework/spring-beans/4.1.8.RELEASE/spring-beans-4.1.8.RELEASE.jar
19-May-2019 01:15:33 Download https://repo.spring.io/libs-snapshot/org/springframework/spring-expression/4.1.8.RELEASE/spring-expression-4.1.8.RELEASE.jar
19-May-2019 01:15:33 Download https://repo.spring.io/libs-snapshot/org/springframework/spring-core/4.1.8.RELEASE/spring-core-4.1.8.RELEASE.jar
19-May-2019 01:15:34 Download https://repo.spring.io/libs-snapshot/org/apache/httpcomponents/httpcore/4.3.3/httpcore-4.3.3.jar
19-May-2019 01:15:34 Download https://repo.spring.io/libs-snapshot/org/springframework/spring-tx/4.1.8.RELEASE/spring-tx-4.1.8.RELEASE.jar
19-May-2019 01:15:35 :spring-social-core:processResources
19-May-2019 01:15:35 :spring-social-core:classes
19-May-2019 01:15:35 :spring-social-core:jar
19-May-2019 01:15:36 :spring-social-web:compileJava
19-May-2019 01:15:36 Download https://repo.spring.io/libs-snapshot/org/springframework/spring-webmvc/4.1.8.RELEASE/spring-webmvc-4.1.8.RELEASE.pom
19-May-2019 01:15:36 Download https://repo.spring.io/libs-snapshot/org/thymeleaf/thymeleaf/2.1.5.RELEASE/thymeleaf-2.1.5.RELEASE.pom
19-May-2019 01:15:36 Download https://repo.spring.io/libs-snapshot/org/thymeleaf/thymeleaf-spring4/2.1.5.RELEASE/thymeleaf-spring4-2.1.5.RELEASE.pom
19-May-2019 01:15:36 Download https://repo.spring.io/libs-snapshot/org/javassist/javassist/3.16.1-GA/javassist-3.16.1-GA.pom
19-May-2019 01:15:36 Download https://repo.spring.io/libs-snapshot/org/unbescape/unbescape/1.1.0.RELEASE/unbescape-1.1.0.RELEASE.pom
19-May-2019 01:15:36 Download https://repo.spring.io/libs-snapshot/org/slf4j/slf4j-parent/1.6.6/slf4j-parent-1.6.6.pom
19-May-2019 01:15:37 Download https://repo.spring.io/libs-snapshot/org/thymeleaf/thymeleaf/2.1.5.RELEASE/thymeleaf-2.1.5.RELEASE.jar
19-May-2019 01:15:37 Download https://repo.spring.io/libs-snapshot/org/springframework/spring-webmvc/4.1.8.RELEASE/spring-webmvc-4.1.8.RELEASE.jar
19-May-2019 01:15:37 Download https://repo.spring.io/libs-snapshot/org/javassist/javassist/3.16.1-GA/javassist-3.16.1-GA.jar
19-May-2019 01:15:37 Download https://repo.spring.io/libs-snapshot/org/thymeleaf/thymeleaf-spring4/2.1.5.RELEASE/thymeleaf-spring4-2.1.5.RELEASE.jar
19-May-2019 01:15:38 :spring-social-web:processResources
19-May-2019 01:15:38 :spring-social-web:classes
19-May-2019 01:15:38 :spring-social-thymeleaf3:compileJava
19-May-2019 01:15:38 Download https://repo.spring.io/libs-snapshot/org/thymeleaf/thymeleaf-spring5/3.0.9.RELEASE/thymeleaf-spring5-3.0.9.RELEASE.pom
19-May-2019 01:15:38 Download https://repo.spring.io/libs-snapshot/org/thymeleaf/thymeleaf/3.0.9.RELEASE/thymeleaf-3.0.9.RELEASE.pom
19-May-2019 01:15:38 Download https://repo.spring.io/libs-snapshot/org/unbescape/unbescape/1.1.5.RELEASE/unbescape-1.1.5.RELEASE.pom
19-May-2019 01:15:39 Download https://repo.spring.io/libs-snapshot/org/thymeleaf/thymeleaf-spring5/3.0.9.RELEASE/thymeleaf-spring5-3.0.9.RELEASE.jar
19-May-2019 01:15:39 :spring-social-thymeleaf3:processResources NO-SOURCE
19-May-2019 01:15:39 :spring-social-thymeleaf3:classes
19-May-2019 01:15:39 :spring-social-web:jar
19-May-2019 01:15:39 :spring-social-security:compileJava
19-May-2019 01:15:39 Download https://repo.spring.io/libs-snapshot/org/springframework/security/spring-security-web/3.2.9.RELEASE/spring-security-web-3.2.9.RELEASE.pom
19-May-2019 01:15:39 Download https://repo.spring.io/libs-snapshot/org/springframework/security/spring-security-config/3.2.9.RELEASE/spring-security-config-3.2.9.RELEASE.pom
19-May-2019 01:15:39 Download https://repo.spring.io/libs-snapshot/org/springframework/security/spring-security-core/3.2.9.RELEASE/spring-security-core-3.2.9.RELEASE.pom
19-May-2019 01:15:39 Download https://repo.spring.io/libs-snapshot/org/springframework/security/spring-security-config/3.2.9.RELEASE/spring-security-config-3.2.9.RELEASE.jar
19-May-2019 01:15:39 Download https://repo.spring.io/libs-snapshot/org/springframework/security/spring-security-web/3.2.9.RELEASE/spring-security-web-3.2.9.RELEASE.jar
19-May-2019 01:15:39 Download https://repo.spring.io/libs-snapshot/org/springframework/security/spring-security-core/3.2.9.RELEASE/spring-security-core-3.2.9.RELEASE.jar
19-May-2019 01:15:40 :spring-social-security:processResources NO-SOURCE
19-May-2019 01:15:40 :spring-social-security:classes
19-May-2019 01:15:40 :spring-social-security:jar
19-May-2019 01:15:40 :docs:apidocs
19-May-2019 01:15:40 Download https://repo.spring.io/libs-snapshot/org/springframework/spring-expression/3.2.13.RELEASE/spring-expression-3.2.13.RELEASE.pom
19-May-2019 01:15:40 Download https://repo.spring.io/libs-snapshot/org/springframework/spring-aop/3.2.13.RELEASE/spring-aop-3.2.13.RELEASE.pom
19-May-2019 01:15:40 Download https://repo.spring.io/libs-snapshot/org/springframework/spring-beans/3.2.13.RELEASE/spring-beans-3.2.13.RELEASE.pom
19-May-2019 01:15:40 Download https://repo.spring.io/libs-snapshot/org/springframework/spring-core/3.2.13.RELEASE/spring-core-3.2.13.RELEASE.pom
19-May-2019 01:15:40 Download https://repo.spring.io/libs-snapshot/org/springframework/spring-context/3.2.13.RELEASE/spring-context-3.2.13.RELEASE.pom
19-May-2019 01:15:45 :docs:manual:asciidoctor
19-May-2019 01:15:45 :docs:assemble
19-May-2019 01:15:45 :docs:docs
19-May-2019 01:15:45 :docs:docsZip
19-May-2019 01:15:45 :docs:schemaZip
19-May-2019 01:15:45 :spring-build-src:assemble UP-TO-DATE
19-May-2019 01:15:45 :spring-social-config:compileJava
19-May-2019 01:15:45 :spring-social-config:processResources
19-May-2019 01:15:45 :spring-social-config:classes
19-May-2019 01:15:45 :spring-social-config:jar
19-May-2019 01:15:47 :spring-social-core:javadoc
19-May-2019 01:15:49 :spring-social-web:javadoc
19-May-2019 01:15:50 :spring-social-security:javadoc
19-May-2019 01:15:52 :spring-social-config:javadoc
19-May-2019 01:15:52 :spring-social-config:javadocJar
19-May-2019 01:15:52 :spring-social-config:sourcesJar
19-May-2019 01:15:52 :spring-social-config:assemble
19-May-2019 01:15:52 :spring-social-core:javadocJar
19-May-2019 01:15:52 :spring-social-core:sourcesJar
19-May-2019 01:15:52 :spring-social-core:assemble
19-May-2019 01:15:52 :spring-social-security:javadocJar
19-May-2019 01:15:52 :spring-social-security:sourcesJar
19-May-2019 01:15:52 :spring-social-security:assemble
19-May-2019 01:15:52 :spring-social-thymeleaf3:jar SKIPPED
19-May-2019 01:15:52 :spring-social-thymeleaf3:javadoc SKIPPED
19-May-2019 01:15:52 :spring-social-web:javadocJar
19-May-2019 01:15:52 :spring-social-thymeleaf3:javadocJar SKIPPED
19-May-2019 01:15:52 :spring-social-web:sourcesJar
19-May-2019 01:15:52 :spring-social-thymeleaf3:sourcesJar SKIPPED
19-May-2019 01:15:52 :spring-social-thymeleaf3:assemble UP-TO-DATE
19-May-2019 01:15:52 :spring-social-web:assemble
19-May-2019 01:15:52 :docs:manual:compileJava NO-SOURCE
19-May-2019 01:15:52 :docs:manual:processResources NO-SOURCE
19-May-2019 01:15:52 :docs:manual:classes UP-TO-DATE
19-May-2019 01:15:52 :docs:manual:jar
19-May-2019 01:15:52 :docs:manual:javadoc NO-SOURCE
19-May-2019 01:15:52 :docs:manual:javadocJar
19-May-2019 01:15:52 :docs:manual:sourcesJar
19-May-2019 01:15:52 :docs:manual:assemble
19-May-2019 01:15:52 :dist
19-May-2019 01:15:52 :assemble
19-May-2019 01:15:52 :compileJava NO-SOURCE
19-May-2019 01:15:52 :processResources NO-SOURCE
19-May-2019 01:15:52 :classes UP-TO-DATE
19-May-2019 01:15:52 :compileTestJava NO-SOURCE
19-May-2019 01:15:52 :processTestResources NO-SOURCE
19-May-2019 01:15:52 :testClasses UP-TO-DATE
19-May-2019 01:15:52 :test NO-SOURCE
19-May-2019 01:15:52 :check UP-TO-DATE
19-May-2019 01:15:52 :updateRootDocs
19-May-2019 01:15:52 :build
19-May-2019 01:15:52 :docs:compileJava NO-SOURCE
19-May-2019 01:15:52 :docs:processResources NO-SOURCE
19-May-2019 01:15:52 :docs:classes UP-TO-DATE
19-May-2019 01:15:52 :docs:compileTestJava NO-SOURCE
19-May-2019 01:15:52 :docs:processTestResources NO-SOURCE
19-May-2019 01:15:52 :docs:testClasses UP-TO-DATE
19-May-2019 01:15:52 :docs:springReleaseTest NO-SOURCE
19-May-2019 01:15:52 :docs:springSnapshotTest NO-SOURCE
19-May-2019 01:15:52 :docs:test NO-SOURCE
19-May-2019 01:15:52 :docs:check UP-TO-DATE
19-May-2019 01:15:52 :docs:build
19-May-2019 01:15:52 :spring-build-src:compileJava NO-SOURCE
19-May-2019 01:15:53 :spring-build-src:compileGroovy
19-May-2019 01:15:53 :spring-build-src:processResources
19-May-2019 01:15:53 :spring-build-src:classes
19-May-2019 01:15:53 :spring-build-src:compileTestJava NO-SOURCE
19-May-2019 01:15:53 :spring-build-src:compileTestGroovy NO-SOURCE
19-May-2019 01:15:53 :spring-build-src:processTestResources NO-SOURCE
19-May-2019 01:15:53 :spring-build-src:testClasses UP-TO-DATE
19-May-2019 01:15:53 :spring-build-src:test NO-SOURCE
19-May-2019 01:15:53 :spring-build-src:check UP-TO-DATE
19-May-2019 01:15:53 :spring-build-src:build UP-TO-DATE
19-May-2019 01:15:53 :spring-social-config:compileTestJava
19-May-2019 01:15:53 Download https://repo.spring.io/libs-snapshot/org/springframework/spring-test/4.1.8.RELEASE/spring-test-4.1.8.RELEASE.pom
19-May-2019 01:15:53 Download https://repo.spring.io/libs-snapshot/org/aspectj/aspectjweaver/1.8.5/aspectjweaver-1.8.5.pom
19-May-2019 01:15:53 Download https://repo.spring.io/libs-snapshot/com/h2database/h2/1.3.176/h2-1.3.176.pom
19-May-2019 01:15:53 Download https://repo.spring.io/libs-snapshot/org/aspectj/aspectjrt/1.8.5/aspectjrt-1.8.5.pom
19-May-2019 01:15:54 Download https://repo.spring.io/libs-snapshot/org/springframework/spring-test/4.1.8.RELEASE/spring-test-4.1.8.RELEASE.jar
19-May-2019 01:15:54 Download https://repo.spring.io/libs-snapshot/org/aspectj/aspectjweaver/1.8.5/aspectjweaver-1.8.5.jar
19-May-2019 01:15:54 Download https://repo.spring.io/libs-snapshot/com/h2database/h2/1.3.176/h2-1.3.176.jar
19-May-2019 01:15:54 Download https://repo.spring.io/libs-snapshot/org/aspectj/aspectjrt/1.8.5/aspectjrt-1.8.5.jar
19-May-2019 01:15:55 :spring-social-config:processTestResources
19-May-2019 01:15:55 :spring-social-config:testClasses
19-May-2019 01:15:55 :spring-social-config:springReleaseTest
19-May-2019 01:15:55 Download https://repo.spring.io/libs-snapshot/org/springframework/spring-test/maven-metadata.xml
19-May-2019 01:15:55 Download https://repo.spring.io/libs-snapshot/org/springframework/spring-aop/maven-metadata.xml
19-May-2019 01:15:56 Download https://repo.spring.io/libs-snapshot/org/springframework/spring-jdbc/maven-metadata.xml
19-May-2019 01:15:57 Download https://repo.spring.io/libs-snapshot/org/springframework/spring-web/maven-metadata.xml
19-May-2019 01:15:57 Download https://repo.spring.io/libs-snapshot/org/springframework/spring-webmvc/maven-metadata.xml
19-May-2019 01:15:58 Download https://repo.spring.io/libs-snapshot/org/springframework/spring-beans/maven-metadata.xml
19-May-2019 01:15:58 Download https://repo.spring.io/libs-snapshot/org/springframework/spring-context/maven-metadata.xml
19-May-2019 01:15:59 Download https://repo.spring.io/libs-snapshot/org/springframework/spring-core/maven-metadata.xml
19-May-2019 01:15:59 Download https://repo.spring.io/libs-snapshot/org/springframework/spring-expression/maven-metadata.xml
19-May-2019 01:16:00 Download https://repo.spring.io/libs-snapshot/org/springframework/spring-tx/maven-metadata.xml
19-May-2019 01:16:01 Download https://repo.spring.io/libs-snapshot/org/springframework/spring-jcl/maven-metadata.xml
19-May-2019 01:16:04 :spring-social-config:springSnapshotTest
19-May-2019 01:16:05 :spring-social-config:test
19-May-2019 01:16:05 :spring-social-config:check
19-May-2019 01:16:05 :spring-social-config:build
19-May-2019 01:16:06 :spring-social-core:compileTestJava
19-May-2019 01:16:06 :spring-social-core:processTestResources
19-May-2019 01:16:06 :spring-social-core:testClasses
19-May-2019 01:16:07 :spring-social-core:springReleaseTest
19-May-2019 01:16:07
19-May-2019 01:16:07 org.springframework.social.oauth2.OAuth2TemplateTest > buildAuthorizeUrl_noScopeInParameters FAILED
19-May-2019 01:16:07     org.junit.ComparisonFailure at OAuth2TemplateTest.java:77
19-May-2019 01:16:07
19-May-2019 01:16:07 org.springframework.social.oauth2.OAuth2TemplateTest > exchangeForAccess_jsonResponse_noExpiresIn FAILED
19-May-2019 01:16:07     java.lang.AssertionError at OAuth2TemplateTest.java:332
19-May-2019 01:16:07
19-May-2019 01:16:07 org.springframework.social.oauth2.OAuth2TemplateTest > exchangeForAccess_paramBasedClientAuthentication_jsonResponse_noExpiresInOrScope FAILED
19-May-2019 01:16:07     java.lang.AssertionError at OAuth2TemplateTest.java:332
19-May-2019 01:16:07
19-May-2019 01:16:07 org.springframework.social.oauth2.OAuth2TemplateTest > exchangeForAccess_jsonResponse_noExpiresInOrScope FAILED
19-May-2019 01:16:07     java.lang.AssertionError at OAuth2TemplateTest.java:332
19-May-2019 01:16:07
19-May-2019 01:16:07 org.springframework.social.oauth2.OAuth2TemplateTest > exchangeForAccess_paramBasedClientAuthentication_jsonResponse FAILED
19-May-2019 01:16:07     java.lang.AssertionError at OAuth2TemplateTest.java:332
19-May-2019 01:16:07
19-May-2019 01:16:07 org.springframework.social.oauth2.OAuth2TemplateTest > buildAuthorizeUrl_additionalParameters FAILED
19-May-2019 01:16:07     org.junit.ComparisonFailure at OAuth2TemplateTest.java:90
19-May-2019 01:16:07
19-May-2019 01:16:07 org.springframework.social.oauth2.OAuth2TemplateTest > exchangeForAccess_jsonResponse_expiresInAsString FAILED
19-May-2019 01:16:07     java.lang.AssertionError at OAuth2TemplateTest.java:332
19-May-2019 01:16:07
19-May-2019 01:16:07 org.springframework.social.oauth2.OAuth2TemplateTest > exchangeForAccess_jsonResponse FAILED
19-May-2019 01:16:07     java.lang.AssertionError at OAuth2TemplateTest.java:332
19-May-2019 01:16:07
19-May-2019 01:16:07 org.springframework.social.oauth2.OAuth2TemplateTest > exchangeForAccess_paramBasedClientAuthentication_jsonResponse_expiresInAsString FAILED
19-May-2019 01:16:07     java.lang.AssertionError at OAuth2TemplateTest.java:332
19-May-2019 01:16:07
19-May-2019 01:16:07 org.springframework.social.oauth2.OAuth2TemplateTest > exchangeForAccess_paramBasedClientAuthentication_jsonResponse_expiresInAsNonNumericString FAILED
19-May-2019 01:16:07     java.lang.AssertionError at OAuth2TemplateTest.java:332
19-May-2019 01:16:07
19-May-2019 01:16:07 org.springframework.social.oauth2.OAuth2TemplateTest > exchangeForAccess_jsonResponse_expiresInAsNonNumericString FAILED
19-May-2019 01:16:07     java.lang.AssertionError at OAuth2TemplateTest.java:332
19-May-2019 01:16:07
19-May-2019 01:16:07 org.springframework.social.oauth2.OAuth2TemplateTest > exchangeForAccess_paramBasedClientAuthentication_jsonResponse_noExpiresIn FAILED
19-May-2019 01:16:07     java.lang.AssertionError at OAuth2TemplateTest.java:332
19-May-2019 01:16:07
19-May-2019 01:16:07 org.springframework.social.oauth2.OAuth2TemplateTest > buildAuthorizeUrl_tokenResponseType FAILED
19-May-2019 01:16:07     org.junit.ComparisonFailure at OAuth2TemplateTest.java:68
19-May-2019 01:16:07
19-May-2019 01:16:07 org.springframework.social.oauth2.OAuth2TemplateTest > buildAuthorizeUrl_codeResponseType FAILED
19-May-2019 01:16:07     org.junit.ComparisonFailure at OAuth2TemplateTest.java:58
19-May-2019 01:16:08
19-May-2019 01:16:08 org.springframework.social.oauth1.SigningSupportTest > buildAuthorizationHeaderValue_oauthEncodedSecrets FAILED
19-May-2019 01:16:08     org.junit.ComparisonFailure at SigningSupportTest.java:152
19-May-2019 01:16:08
19-May-2019 01:16:08 org.springframework.social.oauth1.SigningSupportTest > buildAuthorizationHeaderValue_URI FAILED
19-May-2019 01:16:08     org.junit.ComparisonFailure at SigningSupportTest.java:152
19-May-2019 01:16:08
19-May-2019 01:16:08 org.springframework.social.oauth1.SigningSupportTest > buildBaseString_specificationExample FAILED
19-May-2019 01:16:08     org.junit.ComparisonFailure at SigningSupportTest.java:100
19-May-2019 01:16:08
19-May-2019 01:16:08 org.springframework.social.oauth1.SigningSupportTest > buildAuthorizationHeaderValue_Request FAILED
19-May-2019 01:16:08     org.junit.ComparisonFailure at SigningSupportTest.java:152
19-May-2019 01:16:08
19-May-2019 01:16:08 org.springframework.social.oauth1.OAuth1TemplateTest > buildAuthorizeUrl FAILED
19-May-2019 01:16:08     org.junit.ComparisonFailure at OAuth1TemplateTest.java:67
19-May-2019 01:16:08
19-May-2019 01:16:08 org.springframework.social.oauth1.OAuth1TemplateTest > buildAuthorizeUrl_customAuthorizeParameters FAILED
19-May-2019 01:16:08     org.junit.ComparisonFailure at OAuth1TemplateTest.java:75
19-May-2019 01:16:08
19-May-2019 01:16:08 org.springframework.social.oauth1.OAuth1TemplateTest > fetchNewRequestToken_OAuth10a FAILED
19-May-2019 01:16:08     java.lang.AssertionError at OAuth1TemplateTest.java:97
19-May-2019 01:16:08
19-May-2019 01:16:08 184 tests completed, 21 failed, 3 skipped
19-May-2019 01:16:08 :spring-social-core:springReleaseTest FAILED
19-May-2019 01:16:08
19-May-2019 01:16:08 FAILURE: Build failed with an exception.
19-May-2019 01:16:08
19-May-2019 01:16:08 * What went wrong:
19-May-2019 01:16:08 Execution failed for task ':spring-social-core:springReleaseTest'.
19-May-2019 01:16:08 > There were failing tests. See the report at: file:///opt/bamboo-home/xml-data/build-dir/SOCIAL-NS1-JOB1/spring-social-core/build/reports/spring-release-tests/index.html
19-May-2019 01:16:08
19-May-2019 01:16:08 * Try:
19-May-2019 01:16:08 Run with --info or --debug option to get more log output. Run with --scan to get full insights.
19-May-2019 01:16:08
19-May-2019 01:16:08 * Exception is:
19-May-2019 01:16:08 org.gradle.api.tasks.TaskExecutionException: Execution failed for task ':spring-social-core:springReleaseTest'.
19-May-2019 01:16:08         at org.gradle.api.internal.tasks.execution.ExecuteActionsTaskExecuter.executeActions(ExecuteActionsTaskExecuter.java:100)
19-May-2019 01:16:08         at org.gradle.api.internal.tasks.execution.ExecuteActionsTaskExecuter.execute(ExecuteActionsTaskExecuter.java:70)
19-May-2019 01:16:08         at org.gradle.api.internal.tasks.execution.OutputDirectoryCreatingTaskExecuter.execute(OutputDirectoryCreatingTaskExecuter.java:51)
19-May-2019 01:16:08         at org.gradle.api.internal.tasks.execution.SkipUpToDateTaskExecuter.execute(SkipUpToDateTaskExecuter.java:62)
19-May-2019 01:16:08         at org.gradle.api.internal.tasks.execution.ResolveTaskOutputCachingStateExecuter.execute(ResolveTaskOutputCachingStateExecuter.java:54)
19-May-2019 01:16:08         at org.gradle.api.internal.tasks.execution.ValidatingTaskExecuter.execute(ValidatingTaskExecuter.java:60)
19-May-2019 01:16:08         at org.gradle.api.internal.tasks.execution.SkipEmptySourceFilesTaskExecuter.execute(SkipEmptySourceFilesTaskExecuter.java:97)
19-May-2019 01:16:08         at org.gradle.api.internal.tasks.execution.CleanupStaleOutputsExecuter.execute(CleanupStaleOutputsExecuter.java:87)
19-May-2019 01:16:08         at org.gradle.api.internal.tasks.execution.ResolveTaskArtifactStateTaskExecuter.execute(ResolveTaskArtifactStateTaskExecuter.java:52)
19-May-2019 01:16:08         at org.gradle.api.internal.tasks.execution.SkipTaskWithNoActionsExecuter.execute(SkipTaskWithNoActionsExecuter.java:52)
19-May-2019 01:16:08         at org.gradle.api.internal.tasks.execution.SkipOnlyIfTaskExecuter.execute(SkipOnlyIfTaskExecuter.java:54)
19-May-2019 01:16:08         at org.gradle.api.internal.tasks.execution.ExecuteAtMostOnceTaskExecuter.execute(ExecuteAtMostOnceTaskExecuter.java:43)
19-May-2019 01:16:08         at org.gradle.api.internal.tasks.execution.CatchExceptionTaskExecuter.execute(CatchExceptionTaskExecuter.java:34)
19-May-2019 01:16:08         at org.gradle.execution.taskgraph.DefaultTaskGraphExecuter$EventFiringTaskWorker$1.run(DefaultTaskGraphExecuter.java:248)
19-May-2019 01:16:08         at org.gradle.internal.progress.DefaultBuildOperationExecutor$RunnableBuildOperationWorker.execute(DefaultBuildOperationExecutor.java:336)
19-May-2019 01:16:08         at org.gradle.internal.progress.DefaultBuildOperationExecutor$RunnableBuildOperationWorker.execute(DefaultBuildOperationExecutor.java:328)
19-May-2019 01:16:08         at org.gradle.internal.progress.DefaultBuildOperationExecutor.execute(DefaultBuildOperationExecutor.java:199)
19-May-2019 01:16:08         at org.gradle.internal.progress.DefaultBuildOperationExecutor.run(DefaultBuildOperationExecutor.java:110)
19-May-2019 01:16:08         at org.gradle.execution.taskgraph.DefaultTaskGraphExecuter$EventFiringTaskWorker.execute(DefaultTaskGraphExecuter.java:241)
19-May-2019 01:16:08         at org.gradle.execution.taskgraph.DefaultTaskGraphExecuter$EventFiringTaskWorker.execute(DefaultTaskGraphExecuter.java:230)
19-May-2019 01:16:08         at org.gradle.execution.taskgraph.DefaultTaskPlanExecutor$TaskExecutorWorker.processTask(DefaultTaskPlanExecutor.java:123)
19-May-2019 01:16:08         at org.gradle.execution.taskgraph.DefaultTaskPlanExecutor$TaskExecutorWorker.access$200(DefaultTaskPlanExecutor.java:79)
19-May-2019 01:16:08         at org.gradle.execution.taskgraph.DefaultTaskPlanExecutor$TaskExecutorWorker$1.execute(DefaultTaskPlanExecutor.java:104)
19-May-2019 01:16:08         at org.gradle.execution.taskgraph.DefaultTaskPlanExecutor$TaskExecutorWorker$1.execute(DefaultTaskPlanExecutor.java:98)
19-May-2019 01:16:08         at org.gradle.execution.taskgraph.DefaultTaskExecutionPlan.execute(DefaultTaskExecutionPlan.java:626)
19-May-2019 01:16:08         at org.gradle.execution.taskgraph.DefaultTaskExecutionPlan.executeWithTask(DefaultTaskExecutionPlan.java:581)
19-May-2019 01:16:08         at org.gradle.execution.taskgraph.DefaultTaskPlanExecutor$TaskExecutorWorker.run(DefaultTaskPlanExecutor.java:98)
19-May-2019 01:16:08         at org.gradle.internal.concurrent.ExecutorPolicy$CatchAndRecordFailures.onExecute(ExecutorPolicy.java:63)
19-May-2019 01:16:08         at org.gradle.internal.concurrent.ManagedExecutorImpl$1.run(ManagedExecutorImpl.java:46)
19-May-2019 01:16:08         at org.gradle.internal.concurrent.ThreadFactoryImpl$ManagedThreadRunnable.run(ThreadFactoryImpl.java:55)
19-May-2019 01:16:08 Caused by: org.gradle.api.GradleException: There were failing tests. See the report at: file:///opt/bamboo-home/xml-data/build-dir/SOCIAL-NS1-JOB1/spring-social-core/build/reports/spring-release-tests/index.html
19-May-2019 01:16:08         at org.gradle.api.tasks.testing.AbstractTestTask.handleTestFailures(AbstractTestTask.java:547)
19-May-2019 01:16:08         at org.gradle.api.tasks.testing.AbstractTestTask.executeTests(AbstractTestTask.java:464)
19-May-2019 01:16:08         at org.gradle.api.tasks.testing.Test.executeTests(Test.java:530)
19-May-2019 01:16:08         at org.gradle.internal.reflect.JavaMethod.invoke(JavaMethod.java:73)
19-May-2019 01:16:08         at org.gradle.api.internal.project.taskfactory.StandardTaskAction.doExecute(StandardTaskAction.java:46)
19-May-2019 01:16:08         at org.gradle.api.internal.project.taskfactory.StandardTaskAction.execute(StandardTaskAction.java:39)
19-May-2019 01:16:08         at org.gradle.api.internal.project.taskfactory.StandardTaskAction.execute(StandardTaskAction.java:26)
19-May-2019 01:16:08         at org.gradle.api.internal.AbstractTask$TaskActionWrapper.execute(AbstractTask.java:780)
19-May-2019 01:16:08         at org.gradle.api.internal.AbstractTask$TaskActionWrapper.execute(AbstractTask.java:747)
19-May-2019 01:16:08         at org.gradle.api.internal.tasks.execution.ExecuteActionsTaskExecuter$1.run(ExecuteActionsTaskExecuter.java:121)
19-May-2019 01:16:08         at org.gradle.internal.progress.DefaultBuildOperationExecutor$RunnableBuildOperationWorker.execute(DefaultBuildOperationExecutor.java:336)
19-May-2019 01:16:08         at org.gradle.internal.progress.DefaultBuildOperationExecutor$RunnableBuildOperationWorker.execute(DefaultBuildOperationExecutor.java:328)
19-May-2019 01:16:08         at org.gradle.internal.progress.DefaultBuildOperationExecutor.execute(DefaultBuildOperationExecutor.java:199)
19-May-2019 01:16:08         at org.gradle.internal.progress.DefaultBuildOperationExecutor.run(DefaultBuildOperationExecutor.java:110)
19-May-2019 01:16:08         at org.gradle.api.internal.tasks.execution.ExecuteActionsTaskExecuter.executeAction(ExecuteActionsTaskExecuter.java:110)
19-May-2019 01:16:08         at org.gradle.api.internal.tasks.execution.ExecuteActionsTaskExecuter.executeActions(ExecuteActionsTaskExecuter.java:92)
19-May-2019 01:16:08         ... 29 more
19-May-2019 01:16:08
19-May-2019 01:16:08
19-May-2019 01:16:08 * Get more help at https://help.gradle.org
19-May-2019 01:16:08
19-May-2019 01:16:08 BUILD FAILED in 59s
19-May-2019 01:16:08 52 actionable tasks: 44 executed, 8 up-to-date
19-May-2019 01:16:09
19-May-2019 01:16:09 Failing task since return code of [./gradlew --refresh-dependencies --stacktrace clean build -I /tmp/artifactory.init.script4813790559010090208gradle -DbuildInfoConfig.propertiesFile=/tmp/buildinfo7058169724031048491properties artifactoryPublish -Dartifactory.resolve.password=******** -Dartifactory.publish.password=********] was 1 while expected 0
19-May-2019 01:16:09 Parsing test results under /opt/bamboo-home/xml-data/build-dir/SOCIAL-NS1-JOB1...
19-May-2019 01:16:09 Finished task 'Publish Snapshot Build' with result: Failed
19-May-2019 01:16:09 Running post build plugin 'Docker Container Cleanup'
19-May-2019 01:16:09 Running post build plugin 'NCover Results Collector'
19-May-2019 01:16:09 Running post build plugin 'Artifactory Release Management Staging'
19-May-2019 01:16:09 Running post build plugin 'Artifactory Build Info Copier'
19-May-2019 01:16:09 Running post build plugin 'Artifactory Gradle Properties Info Copier'
19-May-2019 01:16:09 Running post build plugin 'Clover Results Collector'
19-May-2019 01:16:09 Running post build plugin 'npm Cache Cleanup'
19-May-2019 01:16:09 Running post build plugin 'Artifact Copier'
19-May-2019 01:16:09 Successfully removed working directory at '/opt/bamboo-home/xml-data/build-dir/SOCIAL-NS1-JOB1'
19-May-2019 01:16:09 Finalising the build...
19-May-2019 01:16:09 Stopping timer.
19-May-2019 01:16:09 Build SOCIAL-NS1-JOB1-546 completed.
19-May-2019 01:16:09 Running on server: post build plugin 'NCover Results Collector'
19-May-2019 01:16:09 Running on server: post build plugin 'Build Hanging Detection Configuration'
19-May-2019 01:16:09 Running on server: post build plugin 'Clover Delta Calculator'
19-May-2019 01:16:09 Running on server: post build plugin 'Maven Dependencies Postprocessor'
19-May-2019 01:16:09 All post build plugins have finished
19-May-2019 01:16:09 Generating build results summary...
19-May-2019 01:16:09 Saving build results to disk...
19-May-2019 01:16:09 Logging substituted variables...
19-May-2019 01:16:09 Indexing build results...
19-May-2019 01:16:09 Finished building SOCIAL-NS1-JOB1-546.