Build: #617 failed

Job: Default Job failed

Stages & jobs

  1. Default Stage

Build log

The build generated 336 lines of output. Download or view full build log

29-Jul-2019 01:15:02 Build Spring Social - Nightly Snapshot 1.1.x - Default Job #617 (SOCIAL-NS1-JOB1-617) started building on agent bamboo-19.af.pivotal.io
29-Jul-2019 01:15:02 Remote agent on host bamboo-19.af.pivotal.io
29-Jul-2019 01:15:02 Build working directory is /opt/bamboo-home/xml-data/build-dir/SOCIAL-NS1-JOB1
29-Jul-2019 01:15:02 Executing build Spring Social - Nightly Snapshot 1.1.x - Default Job #617 (SOCIAL-NS1-JOB1-617)
29-Jul-2019 01:15:02 Starting task 'Checkout Default Repository' of type 'com.atlassian.bamboo.plugins.vcs:task.vcs.checkout'
29-Jul-2019 01:15:02 Build always requires a clean checkout
29-Jul-2019 01:15:02 Cleaning build directory '/opt/bamboo-home/xml-data/build-dir/SOCIAL-NS1-JOB1'
29-Jul-2019 01:15:02 Checking out into /opt/bamboo-home/xml-data/build-dir/SOCIAL-NS1-JOB1
29-Jul-2019 01:15:02 Updating source code to revision: fd6c57f4840bbf7219d44bf0b054148cb1cc30f5
29-Jul-2019 01:15:02 Creating local git repository in '/opt/bamboo-home/xml-data/build-dir/SOCIAL-NS1-JOB1/.git'.
29-Jul-2019 01:15:02 Initialized empty Git repository in /opt/bamboo-home/xml-data/build-dir/SOCIAL-NS1-JOB1/.git/
29-Jul-2019 01:15:03 Fetching 'refs/heads/1.1.x.dev' from 'git://github.com/SpringSource/spring-social.git'.
29-Jul-2019 01:15:14 From git://github.com/SpringSource/spring-social
29-Jul-2019 01:15:14 * [new branch]        1.1.x.dev  -> 1.1.x.dev
29-Jul-2019 01:15:14 * [new tag]           v1.0.0.M1      -> v1.0.0.M1
29-Jul-2019 01:15:14 * [new tag]           v1.0.0.M2      -> v1.0.0.M2
29-Jul-2019 01:15:14 * [new tag]           v1.0.0.M3      -> v1.0.0.M3
29-Jul-2019 01:15:14 * [new tag]           v1.0.0.RC1     -> v1.0.0.RC1
29-Jul-2019 01:15:14 * [new tag]           v1.0.0.RC2     -> v1.0.0.RC2
29-Jul-2019 01:15:14 * [new tag]           v1.0.0.RC3     -> v1.0.0.RC3
29-Jul-2019 01:15:14 * [new tag]           v1.0.0.RELEASE -> v1.0.0.RELEASE
29-Jul-2019 01:15:14 * [new tag]           v1.0.1.RELEASE -> v1.0.1.RELEASE
29-Jul-2019 01:15:14 * [new tag]           v1.0.2.RELEASE -> v1.0.2.RELEASE
29-Jul-2019 01:15:14 * [new tag]           v1.1.0.M2      -> v1.1.0.M2
29-Jul-2019 01:15:14 * [new tag]           v1.1.0.M4      -> v1.1.0.M4
29-Jul-2019 01:15:14 * [new tag]           v1.1.2.RELEASE -> v1.1.2.RELEASE
29-Jul-2019 01:15:14 * [new tag]           v1.1.4.RELEASE -> v1.1.4.RELEASE
29-Jul-2019 01:15:14 Checking out revision fd6c57f4840bbf7219d44bf0b054148cb1cc30f5.
29-Jul-2019 01:15:15 Switched to branch '1.1.x.dev'
29-Jul-2019 01:15:15 Updated source code to revision: fd6c57f4840bbf7219d44bf0b054148cb1cc30f5
29-Jul-2019 01:15:15 Finished task 'Checkout Default Repository' with result: Success
29-Jul-2019 01:15:15 Running pre-build action: Artifactory Release Staging
29-Jul-2019 01:15:15 Running pre-build action: VCS Version Collector
29-Jul-2019 01:15:15 Starting task 'Publish Snapshot Build' of type 'org.jfrog.bamboo.bamboo-artifactory-plugin:artifactoryGradleTask'
29-Jul-2019 01:15:15 Bamboo Artifactory Plugin version: 2.6.3
29-Jul-2019 01:15:15
Beginning to execute external process for build 'Spring Social - Nightly Snapshot 1.1.x - Default Job #617 (SOCIAL-NS1-JOB1-617)'
... running command line:
./gradlew --refresh-dependencies --stacktrace clean build -I /tmp/artifactory.init.script5558964981555370666gradle -DbuildInfoConfig.propertiesFile=/tmp/buildinfo5791339564219640520properties artifactoryPublish -Dartifactory.resolve.password=******** -Dartifactory.publish.password=********
... in: /opt/bamboo-home/xml-data/build-dir/SOCIAL-NS1-JOB1
... using extra environment variables:
bamboo_planRepository_1_branch=1.1.x.dev
bamboo_********_username_password=********
bamboo_signing_store_password=********
bamboo_capability_system_builder_ant_Ant_1_9=/opt/ant-1.9
bamboo_capability_system_builder_ant_Ant_1_8=/opt/ant-1.8
bamboo_planRepository_1_branchDisplayName=1.1.x.dev
bamboo_artifactory_override_resolve_repo=libs-milestone
bamboo_capability_system_builder_node_Node_js_10_16=/opt/node-10.16/bin/node
bamboo_repository_revision_number=fd6c57f4840bbf7219d44bf0b054148cb1cc30f5
bamboo_RIAK_BIN=/usr/sbin/riak
WRAPPER_BITS=32
bamboo_buildKey=SOCIAL-NS1-JOB1
bamboo_bintray_password=********
bamboo_sonar_token_password=********
PWD=/opt/bamboo-home/bin
bamboo_shortJobName=Default Job
bamboo_artifactory_override_resolver_password=********
bamboo_sonatype_token=RSJChaox
bamboo_capability_system_builder_gradle___gradlew=./gradlew
bamboo_buildResultsUrl=https://build.spring.io/browse/SOCIAL-NS1-JOB1-617
bamboo_capability_system_builder_mvn3_Maven_3_3=/opt/maven-3.3
bamboo_capability_system_builder_mvn3_Maven_3_2=/opt/maven-3.2
bamboo_capability_system_builder_mvn3_Maven_3_1=/opt/maven-3.1
bamboo_planRepository_repositoryUrl=git://github.com/SpringSource/spring-social.git
bamboo_capability_system_builder_mvn3_Maven_3_6=/opt/maven-3.6
bamboo_agentId=286195715
bamboo_capability_system_builder_mvn3_Maven_3_5=/opt/maven-3.5
bamboo_capability_system_builder_mvn3_Maven_3_0=/opt/maven-3.0
bamboo_repository_256180263_git_branch=1.1.x.dev
bamboo_planRepository_revision=fd6c57f4840bbf7219d44bf0b054148cb1cc30f5
bamboo_repository_256180263_name=Plan Repository
bamboo_planRepository_previousRevision=fd6c57f4840bbf7219d44bf0b054148cb1cc30f5
bamboo_capability_remote_build=true
bamboo_repository_branch_name=1.1.x.dev
bamboo_sonatype_token_password=********
bamboo_repository_256180263_branch_name=1.1.x.dev
bamboo_sonatype_user=springsource
SHLVL=1
bamboo_org_jfrog_bamboo_buildInfo_serverUrl=https://repo.spring.io
bamboo_scdf_acceptance_tests_password=********
WRAPPER_OS=linux
JAVA_HOME=/opt/jdk-8/
bamboo_repository_256180263_git_username=
TERM=linux
XDG_SESSION_ID=c1
bamboo_planRepository_branch=1.1.x.dev
bamboo_org_jfrog_bamboo_release_activated=false
bamboo_repository_256180263_git_repositoryUrl=git://github.com/SpringSource/spring-social.git
bamboo_planRepository_1_type=gitv2
bamboo_planRepository_branchName=1.1.x.dev
bamboo_capability_system_jdk_JDK_12=/opt/jdk-12
WRAPPER_FILE_SEPARATOR=/
_=/opt/bamboo-home/bin/bamboo-agent.sh
bamboo_capability_system_builder_gradlew_gradlew=./
bamboo_capability_system_builder_ant_Ant_1_10=/opt/ant-1.10
bamboo_repository_256180263_previous_revision_number=fd6c57f4840bbf7219d44bf0b054148cb1cc30f5
WRAPPER_PATH_SEPARATOR=:
bamboo_sonar_password=********
bamboo_hg_cache_directory=/opt/bamboo-home/xml-data/build-dir/_hg-repositories-cache
bamboo_planRepository_1_username=
bamboo_planRepository_type=gitv2
bamboo_git_cache_directory=/opt/bamboo-home/xml-data/build-dir/_git-repositories-cache
bamboo_repository_256180263_revision_number=fd6c57f4840bbf7219d44bf0b054148cb1cc30f5
bamboo_artifactory_username=buildmaster
bamboo_tmp_directory=/opt/bamboo-home/temp
bamboo_planKey=SOCIAL-NS1
bamboo_planRepository_username=
bamboo_JDK8_HOME=/opt/jdk-8
bamboo_planRepository_1_branchName=1.1.x.dev
bamboo_sonar_version=5.6.3
bamboo_sonar_jdbc_password=********
bamboo_bintray_api_key_password=********
XDG_DATA_DIRS=/usr/local/share:/usr/share:/var/lib/snapd/desktop
bamboo_capability_system_jdk_JDK_1_11=/opt/jdk-11
bamboo_resultsUrl=https://build.spring.io/browse/SOCIAL-NS1-JOB1-617
bamboo_capability_system_jdk_JDK_1_10=/opt/jdk-10
bamboo_build_working_directory=/opt/bamboo-home/xml-data/build-dir/SOCIAL-NS1-JOB1
bamboo_planRepository_1_name=Plan Repository
bamboo_capability_system_os=ubuntu1804
bamboo_nexusPush_stagingProfile=buildmaster
bamboo_shortPlanName=Nightly Snapshot 1.1.x
MAIL=/var/mail/bamboo
bamboo_planRepository_name=Plan Repository
LOGNAME=bamboo
bamboo_buildNumber=617
SHELL=/bin/bash
bamboo_planName=Spring Social - Nightly Snapshot 1.1.x
bamboo_JDK7_HOME=/opt/jdk-7
bamboo_shortPlanKey=NS1
OLDPWD=/opt/users/bamboo
bamboo_shortJobKey=JOB1
bamboo_artifactory_password=********
bamboo_buildTimeStamp=2019-07-29T01:15:01.818Z
bamboo_repository_previous_revision_number=fd6c57f4840bbf7219d44bf0b054148cb1cc30f5
bamboo_sonar_username=buildmaster
bamboo_********_password=********
bamboo_repository_git_branch=1.1.x.dev
bamboo_buildResultKey=SOCIAL-NS1-JOB1-617
bamboo_nexusPush_close=true
bamboo_artifactory_override_resolver_username=buildmaster
bamboo_buildPlanName=Spring Social - Nightly Snapshot 1.1.x - Default Job
bamboo_planRepository_1_revision=fd6c57f4840bbf7219d44bf0b054148cb1cc30f5
bamboo_repository_name=Plan Repository
bamboo_signing_key_password=********
bamboo_capability_system_builder_groovy_Groovy_2_5=/opt/groovy-2.5
LANG=en_US.UTF-8
bamboo_buildFailed=false
bamboo_capability_system_docker_executable=/usr/bin/docker
DISPLAY=localhost:1.0
bamboo_capability_system_jdk_OpenJDK_7=/opt/jdk-7
bamboo_capability_system_builder_groovy_Groovy_2_4=/opt/groovy-2.4
bamboo_artifactory_override_deployer_username=buildmaster
bamboo_artifactory_password_mask_b=********
bamboo_capability_system_builder_command_Bash=/bin/bash
bamboo_artifactory_password_mask_a=********
bamboo_agentWorkingDirectory=/opt/bamboo-home/xml-data/build-dir
bamboo_capability_system_git_executable=/usr/bin/git
bamboo_repository_git_username=
bamboo_planRepository_1_previousRevision=fd6c57f4840bbf7219d44bf0b054148cb1cc30f5
bamboo_capability_os_family=unix
bamboo_planRepository_branchDisplayName=1.1.x.dev
bamboo_capability_system_builder_maven_Artifactory_Maven_3_6=/opt/maven-3.6
bamboo_capability_system_builder_maven_Artifactory_Maven_3_5=/opt/maven-3.5
GIT_SSL_NO_VERIFY=true
bamboo_capability_system_builder_maven_Artifactory_Maven_3_3=/opt/maven-3.3
bamboo_capability_system_builder_maven_Artifactory_Maven_3_2=/opt/maven-3.2
bamboo_s3_properties=/home/bamboo/tools/s3.properties
bamboo_capability_system_builder_maven_Artifactory_Maven_3_1=/opt/maven-3.1
bamboo_artifactory_override_deploy_repo=libs-snapshot-local
bamboo_capability_system_builder_maven_Artifactory_Maven_3_0=/opt/maven-3.0
bamboo_plan_storageTag=plan-255983679
bamboo_bintray_username_password=********
USER=bamboo
bamboo_repository_git_repositoryUrl=git://github.com/SpringSource/spring-social.git
bamboo_working_directory=/opt/bamboo-home/xml-data/build-dir/SOCIAL-NS1-JOB1
bamboo_org_jfrog_bamboo_buildInfo_activated=true
bamboo_planRepository_1_repositoryUrl=git://github.com/SpringSource/spring-social.git
bamboo_capability_system_jdk_JDK_1_8=/opt/jdk-8
bamboo_artifactory_override_deployer_password=********
bamboo_capability_system_jdk_JDK_1_9=/opt/jdk-9
WRAPPER_ARCH=x86
bamboo_capability_system_jdk_JDK_1_6=/opt/jdk-6
bamboo_sonatype_password=********
bamboo_capability_system_jdk_JDK_1_7=/opt/jdk-7
bamboo_sonar_ip=10.194.6.9
XDG_RUNTIME_DIR=/run/user/1002
HOME=/home/bamboo
PATH=/bin:/home/bamboo/bin:/usr/local/sbin:/usr/local/bin:/usr/sbin:/usr/bin:/sbin:/bin:/usr/games:/usr/local/games:/snap/bin:/home/bamboo/bin:/usr/local/bin:/bin:/home/bamboo/bin:/usr/local/sbin:/usr/local/bin:/usr/sbin:/usr/bin:/sbin:/bin:/usr/games:/usr/local/games:/snap/bin:/home/bamboo/bin:/usr/local/bin
29-Jul-2019 01:15:15 Starting a Gradle Daemon (subsequent builds will be faster)
29-Jul-2019 01:15:18 :buildSrc:clean UP-TO-DATE
29-Jul-2019 01:15:18 :buildSrc:compileJava NO-SOURCE
29-Jul-2019 01:15:21 :buildSrc:compileGroovy
29-Jul-2019 01:15:21 :buildSrc:processResources
29-Jul-2019 01:15:21 :buildSrc:classes
29-Jul-2019 01:15:21 :buildSrc:jar
29-Jul-2019 01:15:21 :buildSrc:assemble
29-Jul-2019 01:15:21 :buildSrc:compileTestJava NO-SOURCE
29-Jul-2019 01:15:21 :buildSrc:compileTestGroovy NO-SOURCE
29-Jul-2019 01:15:21 :buildSrc:processTestResources NO-SOURCE
29-Jul-2019 01:15:21 :buildSrc:testClasses UP-TO-DATE
29-Jul-2019 01:15:21 :buildSrc:test NO-SOURCE
29-Jul-2019 01:15:21 :buildSrc:check UP-TO-DATE
29-Jul-2019 01:15:21 :buildSrc:build
29-Jul-2019 01:15:24 POM relocation to an other version number is not fully supported in Gradle : xml-apis:xml-apis:2.0.2 relocated to xml-apis:xml-apis:1.0.b2.
29-Jul-2019 01:15:24 Please update your dependency to directly use the correct version 'xml-apis:xml-apis:1.0.b2'.
29-Jul-2019 01:15:24 Resolution will only pick dependencies of the relocated element.  Artifacts and other metadata will be ignored.
29-Jul-2019 01:15:27 Cannot publish pom for project ':' since it does not contain the Maven plugin install task and task ':artifactoryPublish' does not specify a custom pom path.
29-Jul-2019 01:15:27 Cannot publish pom for project ':spring-build-src' since it does not contain the Maven plugin install task and task ':spring-build-src:artifactoryPublish' does not specify a custom pom path.
29-Jul-2019 01:15:27 :clean UP-TO-DATE
29-Jul-2019 01:15:27 :docs:clean UP-TO-DATE
29-Jul-2019 01:15:27 :spring-build-src:clean
29-Jul-2019 01:15:27 :spring-social-config:clean UP-TO-DATE
29-Jul-2019 01:15:27 :spring-social-core:clean UP-TO-DATE
29-Jul-2019 01:15:27 :spring-social-security:clean UP-TO-DATE
29-Jul-2019 01:15:27 :spring-social-thymeleaf3:clean UP-TO-DATE
29-Jul-2019 01:15:27 :spring-social-web:clean UP-TO-DATE
29-Jul-2019 01:15:27 :docs:manual:clean UP-TO-DATE
29-Jul-2019 01:15:30 :spring-social-core:compileJava
29-Jul-2019 01:15:30 :spring-social-core:processResources
29-Jul-2019 01:15:30 :spring-social-core:classes
29-Jul-2019 01:15:30 :spring-social-core:jar
29-Jul-2019 01:15:31 :spring-social-web:compileJava
29-Jul-2019 01:15:31 :spring-social-web:processResources
29-Jul-2019 01:15:31 :spring-social-web:classes
29-Jul-2019 01:15:32 :spring-social-thymeleaf3:compileJava
29-Jul-2019 01:15:32 :spring-social-thymeleaf3:processResources NO-SOURCE
29-Jul-2019 01:15:32 :spring-social-thymeleaf3:classes
29-Jul-2019 01:15:32 :spring-social-web:jar
29-Jul-2019 01:15:33 :spring-social-security:compileJava
29-Jul-2019 01:15:33 :spring-social-security:processResources NO-SOURCE
29-Jul-2019 01:15:33 :spring-social-security:classes
29-Jul-2019 01:15:33 :spring-social-security:jar
29-Jul-2019 01:15:37 :docs:apidocs
29-Jul-2019 01:15:39 :docs:manual:asciidoctor
29-Jul-2019 01:15:39 :docs:assemble
29-Jul-2019 01:15:39 :docs:docs
29-Jul-2019 01:15:39 :docs:docsZip
29-Jul-2019 01:15:39 :docs:schemaZip
29-Jul-2019 01:15:39 :spring-build-src:assemble UP-TO-DATE
29-Jul-2019 01:15:39 :spring-social-config:compileJava
29-Jul-2019 01:15:39 :spring-social-config:processResources
29-Jul-2019 01:15:39 :spring-social-config:classes
29-Jul-2019 01:15:40 :spring-social-config:jar
29-Jul-2019 01:15:42 :spring-social-core:javadoc
29-Jul-2019 01:15:44 :spring-social-web:javadoc
29-Jul-2019 01:15:45 :spring-social-security:javadoc
29-Jul-2019 01:15:47 :spring-social-config:javadoc
29-Jul-2019 01:15:47 :spring-social-config:javadocJar
29-Jul-2019 01:15:47 :spring-social-config:sourcesJar
29-Jul-2019 01:15:47 :spring-social-config:assemble
29-Jul-2019 01:15:47 :spring-social-core:javadocJar
29-Jul-2019 01:15:47 :spring-social-core:sourcesJar
29-Jul-2019 01:15:47 :spring-social-core:assemble
29-Jul-2019 01:15:47 :spring-social-security:javadocJar
29-Jul-2019 01:15:47 :spring-social-security:sourcesJar
29-Jul-2019 01:15:47 :spring-social-security:assemble
29-Jul-2019 01:15:47 :spring-social-thymeleaf3:jar SKIPPED
29-Jul-2019 01:15:47 :spring-social-thymeleaf3:javadoc SKIPPED
29-Jul-2019 01:15:47 :spring-social-web:javadocJar
29-Jul-2019 01:15:47 :spring-social-thymeleaf3:javadocJar SKIPPED
29-Jul-2019 01:15:47 :spring-social-web:sourcesJar
29-Jul-2019 01:15:47 :spring-social-thymeleaf3:sourcesJar SKIPPED
29-Jul-2019 01:15:47 :spring-social-thymeleaf3:assemble UP-TO-DATE
29-Jul-2019 01:15:47 :spring-social-web:assemble
29-Jul-2019 01:15:47 :docs:manual:compileJava NO-SOURCE
29-Jul-2019 01:15:47 :docs:manual:processResources NO-SOURCE
29-Jul-2019 01:15:47 :docs:manual:classes UP-TO-DATE
29-Jul-2019 01:15:47 :docs:manual:jar
29-Jul-2019 01:15:47 :docs:manual:javadoc NO-SOURCE
29-Jul-2019 01:15:47 :docs:manual:javadocJar
29-Jul-2019 01:15:47 :docs:manual:sourcesJar
29-Jul-2019 01:15:47 :docs:manual:assemble
29-Jul-2019 01:15:47 :dist
29-Jul-2019 01:15:47 :assemble
29-Jul-2019 01:15:47 :compileJava NO-SOURCE
29-Jul-2019 01:15:47 :processResources NO-SOURCE
29-Jul-2019 01:15:47 :classes UP-TO-DATE
29-Jul-2019 01:15:47 :compileTestJava NO-SOURCE
29-Jul-2019 01:15:47 :processTestResources NO-SOURCE
29-Jul-2019 01:15:47 :testClasses UP-TO-DATE
29-Jul-2019 01:15:47 :test NO-SOURCE
29-Jul-2019 01:15:47 :check UP-TO-DATE
29-Jul-2019 01:15:47 :updateRootDocs
29-Jul-2019 01:15:47 :build
29-Jul-2019 01:15:47 :docs:compileJava NO-SOURCE
29-Jul-2019 01:15:47 :docs:processResources NO-SOURCE
29-Jul-2019 01:15:47 :docs:classes UP-TO-DATE
29-Jul-2019 01:15:47 :docs:compileTestJava NO-SOURCE
29-Jul-2019 01:15:47 :docs:processTestResources NO-SOURCE
29-Jul-2019 01:15:47 :docs:testClasses UP-TO-DATE
29-Jul-2019 01:15:47 :docs:springReleaseTest NO-SOURCE
29-Jul-2019 01:15:47 :docs:springSnapshotTest NO-SOURCE
29-Jul-2019 01:15:47 :docs:test NO-SOURCE
29-Jul-2019 01:15:47 :docs:check UP-TO-DATE
29-Jul-2019 01:15:47 :docs:build
29-Jul-2019 01:15:47 :spring-build-src:compileJava NO-SOURCE
29-Jul-2019 01:15:48 :spring-build-src:compileGroovy
29-Jul-2019 01:15:48 :spring-build-src:processResources
29-Jul-2019 01:15:48 :spring-build-src:classes
29-Jul-2019 01:15:48 :spring-build-src:compileTestJava NO-SOURCE
29-Jul-2019 01:15:48 :spring-build-src:compileTestGroovy NO-SOURCE
29-Jul-2019 01:15:48 :spring-build-src:processTestResources NO-SOURCE
29-Jul-2019 01:15:48 :spring-build-src:testClasses UP-TO-DATE
29-Jul-2019 01:15:48 :spring-build-src:test NO-SOURCE
29-Jul-2019 01:15:48 :spring-build-src:check UP-TO-DATE
29-Jul-2019 01:15:48 :spring-build-src:build UP-TO-DATE
29-Jul-2019 01:15:49 :spring-social-config:compileTestJava
29-Jul-2019 01:15:49 :spring-social-config:processTestResources
29-Jul-2019 01:15:49 :spring-social-config:testClasses
29-Jul-2019 01:15:50 :spring-social-config:springReleaseTest
29-Jul-2019 01:15:50 Download https://repo.spring.io/libs-snapshot/org/springframework/spring-test/maven-metadata.xml
29-Jul-2019 01:15:51 Download https://repo.spring.io/libs-snapshot/org/springframework/spring-aop/maven-metadata.xml
29-Jul-2019 01:15:53 Download https://repo.spring.io/libs-snapshot/org/springframework/spring-jdbc/maven-metadata.xml
29-Jul-2019 01:15:55 Download https://repo.spring.io/libs-snapshot/org/springframework/spring-web/maven-metadata.xml
29-Jul-2019 01:15:56 Download https://repo.spring.io/libs-snapshot/org/springframework/spring-webmvc/maven-metadata.xml
29-Jul-2019 01:15:58 Download https://repo.spring.io/libs-snapshot/org/springframework/spring-beans/maven-metadata.xml
29-Jul-2019 01:15:59 Download https://repo.spring.io/libs-snapshot/org/springframework/spring-context/maven-metadata.xml
29-Jul-2019 01:16:01 Download https://repo.spring.io/libs-snapshot/org/springframework/spring-core/maven-metadata.xml
29-Jul-2019 01:16:02 Download https://repo.spring.io/libs-snapshot/org/springframework/spring-expression/maven-metadata.xml
29-Jul-2019 01:16:03 Download https://repo.spring.io/libs-snapshot/org/springframework/spring-tx/maven-metadata.xml
29-Jul-2019 01:16:05 Download https://repo.spring.io/libs-snapshot/org/springframework/spring-jcl/maven-metadata.xml
29-Jul-2019 01:16:08 :spring-social-config:springSnapshotTest
29-Jul-2019 01:16:09 :spring-social-config:test
29-Jul-2019 01:16:09 :spring-social-config:check
29-Jul-2019 01:16:09 :spring-social-config:build
29-Jul-2019 01:16:10 :spring-social-core:compileTestJava
29-Jul-2019 01:16:10 :spring-social-core:processTestResources
29-Jul-2019 01:16:10 :spring-social-core:testClasses
29-Jul-2019 01:16:11 :spring-social-core:springReleaseTest
29-Jul-2019 01:16:11
29-Jul-2019 01:16:11 org.springframework.social.oauth2.OAuth2TemplateTest > buildAuthorizeUrl_noScopeInParameters FAILED
29-Jul-2019 01:16:11     org.junit.ComparisonFailure at OAuth2TemplateTest.java:77
29-Jul-2019 01:16:11
29-Jul-2019 01:16:11 org.springframework.social.oauth2.OAuth2TemplateTest > exchangeForAccess_jsonResponse_noExpiresIn FAILED
29-Jul-2019 01:16:11     java.lang.AssertionError at OAuth2TemplateTest.java:332
29-Jul-2019 01:16:11
29-Jul-2019 01:16:11 org.springframework.social.oauth2.OAuth2TemplateTest > exchangeForAccess_paramBasedClientAuthentication_jsonResponse_noExpiresInOrScope FAILED
29-Jul-2019 01:16:11     java.lang.AssertionError at OAuth2TemplateTest.java:332
29-Jul-2019 01:16:11
29-Jul-2019 01:16:11 org.springframework.social.oauth2.OAuth2TemplateTest > exchangeForAccess_jsonResponse_noExpiresInOrScope FAILED
29-Jul-2019 01:16:11     java.lang.AssertionError at OAuth2TemplateTest.java:332
29-Jul-2019 01:16:11
29-Jul-2019 01:16:11 org.springframework.social.oauth2.OAuth2TemplateTest > exchangeForAccess_paramBasedClientAuthentication_jsonResponse FAILED
29-Jul-2019 01:16:11     java.lang.AssertionError at OAuth2TemplateTest.java:332
29-Jul-2019 01:16:11
29-Jul-2019 01:16:11 org.springframework.social.oauth2.OAuth2TemplateTest > buildAuthorizeUrl_additionalParameters FAILED
29-Jul-2019 01:16:11     org.junit.ComparisonFailure at OAuth2TemplateTest.java:90
29-Jul-2019 01:16:11
29-Jul-2019 01:16:11 org.springframework.social.oauth2.OAuth2TemplateTest > exchangeForAccess_jsonResponse_expiresInAsString FAILED
29-Jul-2019 01:16:11     java.lang.AssertionError at OAuth2TemplateTest.java:332
29-Jul-2019 01:16:12
29-Jul-2019 01:16:12 org.springframework.social.oauth2.OAuth2TemplateTest > exchangeForAccess_jsonResponse FAILED
29-Jul-2019 01:16:12     java.lang.AssertionError at OAuth2TemplateTest.java:332
29-Jul-2019 01:16:12
29-Jul-2019 01:16:12 org.springframework.social.oauth2.OAuth2TemplateTest > exchangeForAccess_paramBasedClientAuthentication_jsonResponse_expiresInAsString FAILED
29-Jul-2019 01:16:12     java.lang.AssertionError at OAuth2TemplateTest.java:332
29-Jul-2019 01:16:12
29-Jul-2019 01:16:12 org.springframework.social.oauth2.OAuth2TemplateTest > exchangeForAccess_paramBasedClientAuthentication_jsonResponse_expiresInAsNonNumericString FAILED
29-Jul-2019 01:16:12     java.lang.AssertionError at OAuth2TemplateTest.java:332
29-Jul-2019 01:16:12
29-Jul-2019 01:16:12 org.springframework.social.oauth2.OAuth2TemplateTest > exchangeForAccess_jsonResponse_expiresInAsNonNumericString FAILED
29-Jul-2019 01:16:12     java.lang.AssertionError at OAuth2TemplateTest.java:332
29-Jul-2019 01:16:12
29-Jul-2019 01:16:12 org.springframework.social.oauth2.OAuth2TemplateTest > exchangeForAccess_paramBasedClientAuthentication_jsonResponse_noExpiresIn FAILED
29-Jul-2019 01:16:12     java.lang.AssertionError at OAuth2TemplateTest.java:332
29-Jul-2019 01:16:12
29-Jul-2019 01:16:12 org.springframework.social.oauth2.OAuth2TemplateTest > buildAuthorizeUrl_tokenResponseType FAILED
29-Jul-2019 01:16:12     org.junit.ComparisonFailure at OAuth2TemplateTest.java:68
29-Jul-2019 01:16:12
29-Jul-2019 01:16:12 org.springframework.social.oauth2.OAuth2TemplateTest > buildAuthorizeUrl_codeResponseType FAILED
29-Jul-2019 01:16:12     org.junit.ComparisonFailure at OAuth2TemplateTest.java:58
29-Jul-2019 01:16:12
29-Jul-2019 01:16:12 org.springframework.social.oauth1.SigningSupportTest > buildAuthorizationHeaderValue_oauthEncodedSecrets FAILED
29-Jul-2019 01:16:12     org.junit.ComparisonFailure at SigningSupportTest.java:152
29-Jul-2019 01:16:12
29-Jul-2019 01:16:12 org.springframework.social.oauth1.SigningSupportTest > buildAuthorizationHeaderValue_URI FAILED
29-Jul-2019 01:16:12     org.junit.ComparisonFailure at SigningSupportTest.java:152
29-Jul-2019 01:16:12
29-Jul-2019 01:16:12 org.springframework.social.oauth1.SigningSupportTest > buildBaseString_specificationExample FAILED
29-Jul-2019 01:16:12     org.junit.ComparisonFailure at SigningSupportTest.java:100
29-Jul-2019 01:16:12
29-Jul-2019 01:16:12 org.springframework.social.oauth1.SigningSupportTest > buildAuthorizationHeaderValue_Request FAILED
29-Jul-2019 01:16:12     org.junit.ComparisonFailure at SigningSupportTest.java:152
29-Jul-2019 01:16:12
29-Jul-2019 01:16:12 org.springframework.social.oauth1.OAuth1TemplateTest > buildAuthorizeUrl FAILED
29-Jul-2019 01:16:12     org.junit.ComparisonFailure at OAuth1TemplateTest.java:67
29-Jul-2019 01:16:12
29-Jul-2019 01:16:12 org.springframework.social.oauth1.OAuth1TemplateTest > buildAuthorizeUrl_customAuthorizeParameters FAILED
29-Jul-2019 01:16:12     org.junit.ComparisonFailure at OAuth1TemplateTest.java:75
29-Jul-2019 01:16:12
29-Jul-2019 01:16:12 org.springframework.social.oauth1.OAuth1TemplateTest > fetchNewRequestToken_OAuth10a FAILED
29-Jul-2019 01:16:12     java.lang.AssertionError at OAuth1TemplateTest.java:97
29-Jul-2019 01:16:12
29-Jul-2019 01:16:12 184 tests completed, 21 failed, 3 skipped
29-Jul-2019 01:16:13
29-Jul-2019 01:16:13 FAILURE: Build failed with an exception.
29-Jul-2019 01:16:13
29-Jul-2019 01:16:13 * What went wrong:
29-Jul-2019 01:16:13 Execution failed for task ':spring-social-core:springReleaseTest'.
29-Jul-2019 01:16:13 > There were failing tests. See the report at: file:///opt/bamboo-home/xml-data/build-dir/SOCIAL-NS1-JOB1/spring-social-core/build/reports/spring-release-tests/index.html
29-Jul-2019 01:16:13
29-Jul-2019 01:16:13 * Try:
29-Jul-2019 01:16:13 Run with --info or --debug option to get more log output. Run with --scan to get full insights.
29-Jul-2019 01:16:13
29-Jul-2019 01:16:13 * Exception is:
29-Jul-2019 01:16:13 :spring-social-core:springReleaseTest FAILED
29-Jul-2019 01:16:13 org.gradle.api.tasks.TaskExecutionException: Execution failed for task ':spring-social-core:springReleaseTest'.
29-Jul-2019 01:16:13         at org.gradle.api.internal.tasks.execution.ExecuteActionsTaskExecuter.executeActions(ExecuteActionsTaskExecuter.java:100)
29-Jul-2019 01:16:13         at org.gradle.api.internal.tasks.execution.ExecuteActionsTaskExecuter.execute(ExecuteActionsTaskExecuter.java:70)
29-Jul-2019 01:16:13         at org.gradle.api.internal.tasks.execution.OutputDirectoryCreatingTaskExecuter.execute(OutputDirectoryCreatingTaskExecuter.java:51)
29-Jul-2019 01:16:13         at org.gradle.api.internal.tasks.execution.SkipUpToDateTaskExecuter.execute(SkipUpToDateTaskExecuter.java:62)
29-Jul-2019 01:16:13         at org.gradle.api.internal.tasks.execution.ResolveTaskOutputCachingStateExecuter.execute(ResolveTaskOutputCachingStateExecuter.java:54)
29-Jul-2019 01:16:13         at org.gradle.api.internal.tasks.execution.ValidatingTaskExecuter.execute(ValidatingTaskExecuter.java:60)
29-Jul-2019 01:16:13         at org.gradle.api.internal.tasks.execution.SkipEmptySourceFilesTaskExecuter.execute(SkipEmptySourceFilesTaskExecuter.java:97)
29-Jul-2019 01:16:13         at org.gradle.api.internal.tasks.execution.CleanupStaleOutputsExecuter.execute(CleanupStaleOutputsExecuter.java:87)
29-Jul-2019 01:16:13         at org.gradle.api.internal.tasks.execution.ResolveTaskArtifactStateTaskExecuter.execute(ResolveTaskArtifactStateTaskExecuter.java:52)
29-Jul-2019 01:16:13         at org.gradle.api.internal.tasks.execution.SkipTaskWithNoActionsExecuter.execute(SkipTaskWithNoActionsExecuter.java:52)
29-Jul-2019 01:16:13         at org.gradle.api.internal.tasks.execution.SkipOnlyIfTaskExecuter.execute(SkipOnlyIfTaskExecuter.java:54)
29-Jul-2019 01:16:13         at org.gradle.api.internal.tasks.execution.ExecuteAtMostOnceTaskExecuter.execute(ExecuteAtMostOnceTaskExecuter.java:43)
29-Jul-2019 01:16:13         at org.gradle.api.internal.tasks.execution.CatchExceptionTaskExecuter.execute(CatchExceptionTaskExecuter.java:34)
29-Jul-2019 01:16:13 52 actionable tasks: 44 executed, 8 up-to-date
29-Jul-2019 01:16:13         at org.gradle.execution.taskgraph.DefaultTaskGraphExecuter$EventFiringTaskWorker$1.run(DefaultTaskGraphExecuter.java:248)
29-Jul-2019 01:16:13         at org.gradle.internal.progress.DefaultBuildOperationExecutor$RunnableBuildOperationWorker.execute(DefaultBuildOperationExecutor.java:336)
29-Jul-2019 01:16:13         at org.gradle.internal.progress.DefaultBuildOperationExecutor$RunnableBuildOperationWorker.execute(DefaultBuildOperationExecutor.java:328)
29-Jul-2019 01:16:13         at org.gradle.internal.progress.DefaultBuildOperationExecutor.execute(DefaultBuildOperationExecutor.java:199)
29-Jul-2019 01:16:13         at org.gradle.internal.progress.DefaultBuildOperationExecutor.run(DefaultBuildOperationExecutor.java:110)
29-Jul-2019 01:16:13         at org.gradle.execution.taskgraph.DefaultTaskGraphExecuter$EventFiringTaskWorker.execute(DefaultTaskGraphExecuter.java:241)
29-Jul-2019 01:16:13         at org.gradle.execution.taskgraph.DefaultTaskGraphExecuter$EventFiringTaskWorker.execute(DefaultTaskGraphExecuter.java:230)
29-Jul-2019 01:16:13         at org.gradle.execution.taskgraph.DefaultTaskPlanExecutor$TaskExecutorWorker.processTask(DefaultTaskPlanExecutor.java:123)
29-Jul-2019 01:16:13         at org.gradle.execution.taskgraph.DefaultTaskPlanExecutor$TaskExecutorWorker.access$200(DefaultTaskPlanExecutor.java:79)
29-Jul-2019 01:16:13         at org.gradle.execution.taskgraph.DefaultTaskPlanExecutor$TaskExecutorWorker$1.execute(DefaultTaskPlanExecutor.java:104)
29-Jul-2019 01:16:13         at org.gradle.execution.taskgraph.DefaultTaskPlanExecutor$TaskExecutorWorker$1.execute(DefaultTaskPlanExecutor.java:98)
29-Jul-2019 01:16:13         at org.gradle.execution.taskgraph.DefaultTaskExecutionPlan.execute(DefaultTaskExecutionPlan.java:626)
29-Jul-2019 01:16:13         at org.gradle.execution.taskgraph.DefaultTaskExecutionPlan.executeWithTask(DefaultTaskExecutionPlan.java:581)
29-Jul-2019 01:16:13         at org.gradle.execution.taskgraph.DefaultTaskPlanExecutor$TaskExecutorWorker.run(DefaultTaskPlanExecutor.java:98)
29-Jul-2019 01:16:13         at org.gradle.internal.concurrent.ExecutorPolicy$CatchAndRecordFailures.onExecute(ExecutorPolicy.java:63)
29-Jul-2019 01:16:13         at org.gradle.internal.concurrent.ManagedExecutorImpl$1.run(ManagedExecutorImpl.java:46)
29-Jul-2019 01:16:13         at org.gradle.internal.concurrent.ThreadFactoryImpl$ManagedThreadRunnable.run(ThreadFactoryImpl.java:55)
29-Jul-2019 01:16:13 Caused by: org.gradle.api.GradleException: There were failing tests. See the report at: file:///opt/bamboo-home/xml-data/build-dir/SOCIAL-NS1-JOB1/spring-social-core/build/reports/spring-release-tests/index.html
29-Jul-2019 01:16:13         at org.gradle.api.tasks.testing.AbstractTestTask.handleTestFailures(AbstractTestTask.java:547)
29-Jul-2019 01:16:13         at org.gradle.api.tasks.testing.AbstractTestTask.executeTests(AbstractTestTask.java:464)
29-Jul-2019 01:16:13         at org.gradle.api.tasks.testing.Test.executeTests(Test.java:530)
29-Jul-2019 01:16:13         at org.gradle.internal.reflect.JavaMethod.invoke(JavaMethod.java:73)
29-Jul-2019 01:16:13         at org.gradle.api.internal.project.taskfactory.StandardTaskAction.doExecute(StandardTaskAction.java:46)
29-Jul-2019 01:16:13         at org.gradle.api.internal.project.taskfactory.StandardTaskAction.execute(StandardTaskAction.java:39)
29-Jul-2019 01:16:13         at org.gradle.api.internal.project.taskfactory.StandardTaskAction.execute(StandardTaskAction.java:26)
29-Jul-2019 01:16:13         at org.gradle.api.internal.AbstractTask$TaskActionWrapper.execute(AbstractTask.java:780)
29-Jul-2019 01:16:13         at org.gradle.api.internal.AbstractTask$TaskActionWrapper.execute(AbstractTask.java:747)
29-Jul-2019 01:16:13         at org.gradle.api.internal.tasks.execution.ExecuteActionsTaskExecuter$1.run(ExecuteActionsTaskExecuter.java:121)
29-Jul-2019 01:16:13         at org.gradle.internal.progress.DefaultBuildOperationExecutor$RunnableBuildOperationWorker.execute(DefaultBuildOperationExecutor.java:336)
29-Jul-2019 01:16:13         at org.gradle.internal.progress.DefaultBuildOperationExecutor$RunnableBuildOperationWorker.execute(DefaultBuildOperationExecutor.java:328)
29-Jul-2019 01:16:13         at org.gradle.internal.progress.DefaultBuildOperationExecutor.execute(DefaultBuildOperationExecutor.java:199)
29-Jul-2019 01:16:13         at org.gradle.internal.progress.DefaultBuildOperationExecutor.run(DefaultBuildOperationExecutor.java:110)
29-Jul-2019 01:16:13         at org.gradle.api.internal.tasks.execution.ExecuteActionsTaskExecuter.executeAction(ExecuteActionsTaskExecuter.java:110)
29-Jul-2019 01:16:13         at org.gradle.api.internal.tasks.execution.ExecuteActionsTaskExecuter.executeActions(ExecuteActionsTaskExecuter.java:92)
29-Jul-2019 01:16:13         ... 29 more
29-Jul-2019 01:16:13
29-Jul-2019 01:16:13
29-Jul-2019 01:16:13 * Get more help at https://help.gradle.org
29-Jul-2019 01:16:13
29-Jul-2019 01:16:13 BUILD FAILED in 57s
29-Jul-2019 01:16:13
29-Jul-2019 01:16:13 Failing task since return code of [./gradlew --refresh-dependencies --stacktrace clean build -I /tmp/artifactory.init.script5558964981555370666gradle -DbuildInfoConfig.propertiesFile=/tmp/buildinfo5791339564219640520properties artifactoryPublish -Dartifactory.resolve.password=******** -Dartifactory.publish.password=********] was 1 while expected 0
29-Jul-2019 01:16:13 Parsing test results under /opt/bamboo-home/xml-data/build-dir/SOCIAL-NS1-JOB1...
29-Jul-2019 01:16:13 Finished task 'Publish Snapshot Build' with result: Failed
29-Jul-2019 01:16:13 Running post build plugin 'Docker Container Cleanup'
29-Jul-2019 01:16:13 Running post build plugin 'NCover Results Collector'
29-Jul-2019 01:16:13 Running post build plugin 'Artifactory Release Management Staging'
29-Jul-2019 01:16:13 Running post build plugin 'Artifactory Build Info Copier'
29-Jul-2019 01:16:13 Running post build plugin 'Artifactory Gradle Properties Info Copier'
29-Jul-2019 01:16:13 Running post build plugin 'Clover Results Collector'
29-Jul-2019 01:16:13 Running post build plugin 'npm Cache Cleanup'
29-Jul-2019 01:16:13 Running post build plugin 'Artifact Copier'
29-Jul-2019 01:16:13 Successfully removed working directory at '/opt/bamboo-home/xml-data/build-dir/SOCIAL-NS1-JOB1'
29-Jul-2019 01:16:13 Finalising the build...
29-Jul-2019 01:16:13 Stopping timer.
29-Jul-2019 01:16:13 Build SOCIAL-NS1-JOB1-617 completed.
29-Jul-2019 01:16:13 Running on server: post build plugin 'NCover Results Collector'
29-Jul-2019 01:16:13 Running on server: post build plugin 'Build Hanging Detection Configuration'
29-Jul-2019 01:16:13 Running on server: post build plugin 'Bamboo project link creator'
29-Jul-2019 01:16:13 Running on server: post build plugin 'Clover Delta Calculator'
29-Jul-2019 01:16:13 Running on server: post build plugin 'Maven Dependencies Postprocessor'
29-Jul-2019 01:16:13 All post build plugins have finished
29-Jul-2019 01:16:13 Generating build results summary...
29-Jul-2019 01:16:13 Saving build results to disk...
29-Jul-2019 01:16:13 Logging substituted variables...
29-Jul-2019 01:16:13 Indexing build results...
29-Jul-2019 01:16:13 Finished building SOCIAL-NS1-JOB1-617.