Build #1,486

Build: #1486 failed Changes by Rossen Stoyanchev

Build result summary

Details

Completed
Duration
14 minutes
Labels
None
Agent
bamboo-09.af.pivotal.io
Revisions
Spring Framework
862dd239759053db0a6afc6c8f1703570f21a73f 862dd239759053db0a6afc6c8f1703570f21a73f
Plan Repository
862dd239759053db0a6afc6c8f1703570f21a73f 862dd239759053db0a6afc6c8f1703570f21a73f
Total tests
19360
Failing since
#1482 (Changes by 3 people)

Responsible

Code commits

Spring Framework
Author Commit Message Commit date
Rossen Stoyanchev Rossen Stoyanchev 862dd239759053db0a6afc6c8f1703570f21a73f 862dd239759053db0a6afc6c8f1703570f21a73f Server adapters release buffers on error/cancel
Review and update Servlet and Undertow adapters to release any data
buffers they be holding on to at the time of error or cancellation.

Also remove onDiscard hooks from Reactor and Undertow request body.
For Reactor we expect it to be handled. For Undertow there isn't
any Reactor Core upstream for the callback to be useful.

Issue: SPR-17410
Plan Repository
Author Commit Message Commit date
Rossen Stoyanchev Rossen Stoyanchev 862dd239759053db0a6afc6c8f1703570f21a73f 862dd239759053db0a6afc6c8f1703570f21a73f Server adapters release buffers on error/cancel
Review and update Servlet and Undertow adapters to release any data
buffers they be holding on to at the time of error or cancellation.

Also remove onDiscard hooks from Reactor and Undertow request body.
For Reactor we expect it to be handled. For Undertow there isn't
any Reactor Core upstream for the callback to be useful.

Issue: SPR-17410

Tests

New test failures 2
Status Test View job Duration
Collapse Failed DefaultListableBeanFactoryTests testPrototypeCreationWithResolvedPropertiesIsFastEnough History
Default Job 4 secs
java.lang.AssertionError: java.lang.AssertionError: Prototype creation took too long: 4359
java.lang.AssertionError: Prototype creation took too long: 4359
	at org.junit.Assert.fail(Assert.java:88)
	at org.junit.Assert.assertTrue(Assert.java:41)
	at org.springframework.beans.factory.DefaultListableBeanFactoryTests.testPrototypeCreationWithResolvedPropertiesIsFastEnough(DefaultListableBeanFactoryTests.java:2565)
	at sun.reflect.NativeMethodAccessorImpl.invoke0(Native Method)
	at sun.reflect.NativeMethodAccessorImpl.invoke(NativeMethodAccessorImpl.java:62)
	at sun.reflect.DelegatingMethodAccessorImpl.invoke(DelegatingMethodAccessorImpl.java:43)
(44 more lines...)
Collapse Failed DefaultListableBeanFactoryTests testPrototypeCreationWithDependencyCheckIsFastEnough History
Default Job 3 secs
java.lang.AssertionError: java.lang.AssertionError: Prototype creation took too long: 3738
java.lang.AssertionError: Prototype creation took too long: 3738
	at org.junit.Assert.fail(Assert.java:88)
	at org.junit.Assert.assertTrue(Assert.java:41)
	at org.springframework.beans.factory.DefaultListableBeanFactoryTests.testPrototypeCreationWithDependencyCheckIsFastEnough(DefaultListableBeanFactoryTests.java:2472)
	at sun.reflect.NativeMethodAccessorImpl.invoke0(Native Method)
	at sun.reflect.NativeMethodAccessorImpl.invoke(NativeMethodAccessorImpl.java:62)
	at sun.reflect.DelegatingMethodAccessorImpl.invoke(DelegatingMethodAccessorImpl.java:43)
(44 more lines...)
Existing test failures 1
Status Test Failing since View job Duration
java.lang.AssertionError: java.lang.AssertionError: Prototype creation took too long: 4756
java.lang.AssertionError: Prototype creation took too long: 4756
	at org.junit.Assert.fail(Assert.java:88)
	at org.junit.Assert.assertTrue(Assert.java:41)
	at org.springframework.beans.factory.DefaultListableBeanFactoryTests.testPrototypeCreationWithPropertiesIsFastEnough(DefaultListableBeanFactoryTests.java:2542)
	at sun.reflect.NativeMethodAccessorImpl.invoke0(Native Method)
	at sun.reflect.NativeMethodAccessorImpl.invoke(NativeMethodAccessorImpl.java:62)
	at sun.reflect.DelegatingMethodAccessorImpl.invoke(DelegatingMethodAccessorImpl.java:43)
(44 more lines...)

JIRA issues

IssueDescriptionStatus
Unknown Issue TypeSPR-17410Could not obtain issue details from JIRA