Build #7,552

Build: #7552 failed Changes by Rossen Stoyanchev

Build result summary

Details

Completed
Duration
9 minutes
Labels
None
Agent
bamboo-19.af.pivotal.io
Revisions
Spring Framework
3d913b813412c38e1a235b23e1e61adf39711175 3d913b813412c38e1a235b23e1e61adf39711175
Plan Repository
3d913b813412c38e1a235b23e1e61adf39711175 3d913b813412c38e1a235b23e1e61adf39711175
Total tests
19078
Failing since
#7551 (Changes by Rossen Stoyanchev)
Fixed in
#7553 (Manual run by Rossen Stoyanchev)

Tests

Responsible

Code commits

Spring Framework
Author Commit Message Commit date
Rossen Stoyanchev Rossen Stoyanchev 3d913b813412c38e1a235b23e1e61adf39711175 3d913b813412c38e1a235b23e1e61adf39711175 Merge branch '5.1.x'
Rossen Stoyanchev Rossen Stoyanchev 5af9a8edae06b90ba8b466bc07be286b2cc7ab2f m 5af9a8edae06b90ba8b466bc07be286b2cc7ab2f Ensure WebSocketHttpRequestHandler writes headers
Closes gh-23179
Rossen Stoyanchev Rossen Stoyanchev 4e6e47b726cacf983a6d630eeacf45d18be7e622 m 4e6e47b726cacf983a6d630eeacf45d18be7e622 Earlier detection of token authentication
Use a callback to detect token authentication (via inteceptor) thus
avoiding a potential race between that detection after the message is
sent on the inbound channel (via Executor) and the processing of the
CONNECTED frame returned from the broker on the outbound channel.

Closes gh-23160
Plan Repository
Author Commit Message Commit date
Rossen Stoyanchev Rossen Stoyanchev 3d913b813412c38e1a235b23e1e61adf39711175 3d913b813412c38e1a235b23e1e61adf39711175 Merge branch '5.1.x'
Rossen Stoyanchev Rossen Stoyanchev 4e6e47b726cacf983a6d630eeacf45d18be7e622 m 4e6e47b726cacf983a6d630eeacf45d18be7e622 Earlier detection of token authentication
Use a callback to detect token authentication (via inteceptor) thus
avoiding a potential race between that detection after the message is
sent on the inbound channel (via Executor) and the processing of the
CONNECTED frame returned from the broker on the outbound channel.

Closes gh-23160

Tests

New test failures 1
Status Test View job Duration
Collapse Failed WebSocketIntegrationTests echo[client[org.springframework.web.reactive.socket.client.ReactorNettyWebSocketClient@68bf4e8] - server [org.springframework.http.server.reactive.bootstrap.TomcatHttpServer@68b933f0]] History
Default Job 5 secs
java.lang.IllegalStateException: java.lang.IllegalStateException: Timeout on blocking read for 5000 MILLISECONDS
java.lang.IllegalStateException: Timeout on blocking read for 5000 MILLISECONDS
	at reactor.core.publisher.BlockingSingleSubscriber.blockingGet(BlockingSingleSubscriber.java:117)
	at reactor.core.publisher.Mono.block(Mono.java:1520)
	at org.springframework.web.reactive.socket.WebSocketIntegrationTests.echo(WebSocketIntegrationTests.java:71)
	at sun.reflect.NativeMethodAccessorImpl.invoke0(Native Method)
	at sun.reflect.NativeMethodAccessorImpl.invoke(NativeMethodAccessorImpl.java:62)
	at sun.reflect.DelegatingMethodAccessorImpl.invoke(DelegatingMethodAccessorImpl.java:43)
(55 more lines...)