Build #7,574

Build: #7574 failed Changes by Sam Brannen

Build result summary

Details

Completed
Duration
8 minutes
Labels
None
Agent
bamboo-17.af.pivotal.io
Revisions
Spring Framework
39de64bafc234a3db9210f05b38174e878a69489 39de64bafc234a3db9210f05b38174e878a69489
Plan Repository
39de64bafc234a3db9210f05b38174e878a69489 39de64bafc234a3db9210f05b38174e878a69489
Total tests
19108
Fixed in
#7575 (Changes by Sam Brannen)

Tests

Responsible

Code commits

Spring Framework
Author Commit Message Commit date
Sam Brannen Sam Brannen 39de64bafc234a3db9210f05b38174e878a69489 39de64bafc234a3db9210f05b38174e878a69489 Log at WARN level in case of contradicting PersistenceUnitManager setup
Closes gh-23257
Plan Repository
Author Commit Message Commit date
Sam Brannen Sam Brannen 39de64bafc234a3db9210f05b38174e878a69489 39de64bafc234a3db9210f05b38174e878a69489 Log at WARN level in case of contradicting PersistenceUnitManager setup
Closes gh-23257

Tests

New test failures 1
Status Test View job Duration
Collapse Failed WebSocketIntegrationTests echo[client[org.springframework.web.reactive.socket.client.ReactorNettyWebSocketClient@66b14159] - server [org.springframework.http.server.reactive.bootstrap.TomcatHttpServer@8a6d36c]] History
Default Job 5 secs
java.lang.IllegalStateException: java.lang.IllegalStateException: Timeout on blocking read for 5000 MILLISECONDS
java.lang.IllegalStateException: Timeout on blocking read for 5000 MILLISECONDS
	at reactor.core.publisher.BlockingSingleSubscriber.blockingGet(BlockingSingleSubscriber.java:117)
	at reactor.core.publisher.Mono.block(Mono.java:1520)
	at org.springframework.web.reactive.socket.WebSocketIntegrationTests.echo(WebSocketIntegrationTests.java:71)
	at sun.reflect.NativeMethodAccessorImpl.invoke0(Native Method)
	at sun.reflect.NativeMethodAccessorImpl.invoke(NativeMethodAccessorImpl.java:62)
	at sun.reflect.DelegatingMethodAccessorImpl.invoke(DelegatingMethodAccessorImpl.java:43)
(55 more lines...)