Build #7,578

Build: #7578 failed Changes by Arjen Poutsma

Test results

  • 5,321 tests in total
  • 1 test failed
  • 1 failure is new
  • 81 tests were quarantined / skipped
  • 47 seconds taken in total.
New test failures 1
Status Test View job Duration
Collapse Failed ConnectorServerFactoryBeanTests startupWithLocatedServer History
Default Job < 1 sec
java.net.BindException: java.net.BindException: Address already in use (Bind failed)
java.net.BindException: Address already in use (Bind failed)
	at java.net.PlainSocketImpl.socketBind(Native Method)
	at java.net.AbstractPlainSocketImpl.bind(AbstractPlainSocketImpl.java:387)
	at java.net.ServerSocket.bind(ServerSocket.java:375)
	at java.net.ServerSocket.<init>(ServerSocket.java:237)
	at java.net.ServerSocket.<init>(ServerSocket.java:181)
	at com.sun.jmx.remote.socket.SocketConnectionServer.start(SocketConnectionServer.java:157)
(54 more lines...)
Skipped tests 81
Status Test Failing since View job
Skipped ReflectiveAspectJAdvisorFactoryTests testIntroductionWithArgumentBinding History
Default Job
Skipped AspectJAutoProxyCreatorTests testAspectsAndAdvisorNotAppliedToPrototypeIsFastEnough History
Default Job
Skipped AspectJAutoProxyCreatorTests testAspectsAndAdvisorNotAppliedToManySingletonsIsFastEnough History
Default Job
Skipped AspectJAutoProxyCreatorTests testAspectsAndAdvisorAppliedToPrototypeIsFastEnough History
Default Job
Skipped CglibProxyTests testManyProxies History
Default Job
Skipped JdkDynamicProxyTests testManyProxies History
Default Job
Skipped ProxyFactoryTests testExclusionOfNonPublicInterfaces History
Default Job
Skipped RefreshableTargetSourceTests testRefreshOverTime History
Default Job
Skipped BeanWrapperTests setPrimitiveArrayPropertyLargeMatching History
Default Job
Skipped DirectFieldAccessorTests setPrimitiveArrayPropertyLargeMatching History
Default Job
Skipped ConcurrentBeanFactoryTests testConcurrent History
Default Job
Skipped ConcurrentBeanFactoryTests testSingleThread History
Default Job
Skipped DefaultListableBeanFactoryTests testPrototypeCreationWithPropertiesIsFastEnough History
Default Job
Skipped DefaultListableBeanFactoryTests testByTypeLookupIsFastEnough History
Default Job
Skipped DefaultListableBeanFactoryTests testPrototypeCreationWithDependencyCheckIsFastEnough History
Default Job
Skipped DefaultListableBeanFactoryTests testPrototypeCreationIsFastEnough History
Default Job
Skipped DefaultListableBeanFactoryTests testSingletonLookupByNameIsFastEnough History
Default Job
Skipped DefaultListableBeanFactoryTests testRegistrationOfManyBeanDefinitionsIsFastEnough History
Default Job
Skipped DefaultListableBeanFactoryTests testSingletonLookupByTypeIsFastEnough History
Default Job
Skipped DefaultListableBeanFactoryTests testPrototypeCreationWithConstructorArgumentsIsFastEnough History
Default Job
Skipped DefaultListableBeanFactoryTests testPrototypeCreationWithResolvedConstructorArgumentsIsFastEnough History
Default Job
Skipped DefaultListableBeanFactoryTests testPrototypeCreationWithResolvedPropertiesIsFastEnough History
Default Job
Skipped DefaultListableBeanFactoryTests testRegistrationOfManySingletonsIsFastEnough History
Default Job
Skipped AutowiredAnnotationBeanPostProcessorTests testGenericsBasedInjectionIntoTypeVariableSelectingBestMatchAgainstFactoryMethodSignature History
Default Job
Skipped ServiceLocatorFactoryBeanTests testServiceMappings History
Default Job
Skipped ServiceLocatorFactoryBeanTests testCombinedLocatorInterface History
Default Job
Skipped ServiceLoaderTests testServiceListFactoryBean History
Default Job
Skipped ServiceLoaderTests testServiceLoaderFactoryBean History
Default Job
Skipped ServiceLoaderTests testServiceFactoryBean History
Default Job
Skipped BeanFactoryGenericsTests testSetBean History
Default Job
Skipped QualifierAnnotationAutowireBeanFactoryTests testAutowireCandidateWithMethodDescriptor History
Default Job
Skipped QualifierAnnotationAutowireBeanFactoryTests testAutowireCandidateWithConstructorDescriptor History
Default Job
Skipped QualifierAnnotationAutowireBeanFactoryTests testAutowireCandidateWithFieldDescriptor History
Default Job
Skipped PagedListHolderTests testPagedListHolder History
Default Job
Skipped AspectJEnableCachingIsolatedTests emptyConfigSupport History
Default Job
Skipped Spr16217Tests baseConfigurationIsIncludedWhenFirstSuperclassReferenceIsSkippedInRegisterBeanPhase History
Default Job
Skipped AnnotationDrivenEventListenerTests listenersReceiveEarlyEvents History
Default Job
Skipped ApplicationContextExpressionTests prototypeCreationIsFastEnough History
Default Job
Skipped DefaultLifecycleProcessorTests dependentShutdownFirstButNotSmartLifecycle History
Default Job
Skipped DefaultLifecycleProcessorTests singleSmartLifecycleShutdown History
Default Job
Skipped DefaultLifecycleProcessorTests dependentShutdownFirstEvenIfItsPhaseIsLower History
Default Job
Skipped DefaultLifecycleProcessorTests dependentShutdownFirstAndIsSmartLifecycle History
Default Job
Skipped DefaultLifecycleProcessorTests smartLifecycleGroupShutdown History
Default Job
Skipped PropertyResourceConfigurerIntegrationTests testPropertyPlaceholderConfigurerWithAutowireByType History
Default Job
Skipped Spr7538Tests repro History
Default Job
Skipped DateFormattingTests testBindDateAnnotatedWithFallbackError History
Default Job
Skipped EnableSchedulingTests withInitiallyDelayedFixedRateTask History
Default Job
Skipped EnableSchedulingTests withSubclass History
Default Job
Skipped EnableSchedulingTests withTriggerTask History
Default Job
Skipped EnableSchedulingTests withAmbiguousTaskSchedulers_andSingleTask_disambiguatedBySchedulerNameAttribute History
Default Job
Skipped EnableSchedulingTests withTaskAddedVia_configureTasks History
Default Job
Skipped EnableSchedulingTests withExplicitScheduler History
Default Job
Skipped EnableSchedulingTests withExplicitScheduledTaskRegistrar History
Default Job
Skipped EnableSchedulingTests withFixedRateTask History
Default Job
Skipped EnableSchedulingTests withAmbiguousTaskSchedulers_andSingleTask_disambiguatedByScheduledTaskRegistrarBean History
Default Job
Skipped ScheduledAndTransactionalAnnotationIntegrationTests withAspectConfig History
Default Job
Skipped ScheduledAndTransactionalAnnotationIntegrationTests failsWhenJdkProxyAndScheduledMethodNotPresentOnInterface History
Default Job
Skipped ScheduledAndTransactionalAnnotationIntegrationTests succeedsWhenSubclassProxyAndScheduledMethodNotPresentOnInterface History
Default Job
Skipped ScheduledAndTransactionalAnnotationIntegrationTests succeedsWhenJdkProxyAndScheduledMethodIsPresentOnInterface History
Default Job
Skipped AnnotationAsyncExecutionAspectTests voidMethodInAsyncClassGetsRoutedAsynchronously History
Default Job
Skipped AnnotationAsyncExecutionAspectTests asyncMethodGetsRoutedAsynchronously History
Default Job
Skipped AnnotationAsyncExecutionAspectTests methodReturningFutureInAsyncClassGetsRoutedAsynchronouslyAndReturnsAFuture History
Default Job
Skipped AnnotationAsyncExecutionAspectTests exceptionHandlerCalled History
Default Job
Skipped AnnotationAsyncExecutionAspectTests syncMethodGetsRoutedSynchronously History
Default Job
Skipped AnnotationAsyncExecutionAspectTests exceptionHandlerNeverThrowsUnexpectedException History
Default Job
Skipped AnnotationAsyncExecutionAspectTests asyncMethodReturningFutureGetsRoutedAsynchronouslyAndReturnsAFuture History
Default Job
Skipped AnnotationAsyncExecutionAspectTests qualifiedAsyncMethodsAreRoutedToCorrectExecutor History
Default Job
Skipped ScheduledExecutorFactoryBeanTests testWithInitialDelayRepeatedExecutionIsSetUpAndFiresCorrectly History
Default Job
Skipped ScheduledExecutorFactoryBeanTests testFixedRepeatedExecutionIsSetUpAndFiresCorrectlyAfterException History
Default Job
Skipped ScheduledExecutorFactoryBeanTests testOneTimeExecutionIsSetUpAndFiresCorrectly History
Default Job
Skipped ScheduledExecutorFactoryBeanTests testWithInitialDelayRepeatedExecutionIsSetUpAndFiresCorrectlyAfterException History
Default Job
Skipped ScheduledExecutorFactoryBeanTests testFixedRepeatedExecutionIsSetUpAndFiresCorrectly History
Default Job
Skipped ScriptFactoryPostProcessorTests testRefreshedScriptReferencePropagatesToCollaborators History
Default Job
Skipped ScriptFactoryPostProcessorTests testReferencesAcrossAContainerHierarchy History
Default Job
Skipped ScriptFactoryPostProcessorTests testThrowsExceptionIfGivenNonAbstractBeanFactoryImplementation History
Default Job
Skipped ScriptFactoryPostProcessorTests testForRefreshedScriptHavingErrorPickedUpOnFirstCall History
Default Job
Skipped ScriptFactoryPostProcessorTests testPrototypeScriptedBean History
Default Job
Skipped ScriptFactoryPostProcessorTests testDoesNothingWhenPostProcessingNonScriptFactoryTypeBeforeInstantiation History
Default Job
Skipped ScriptFactoryPostProcessorTests testScriptHavingAReferenceToAnotherBean History
Default Job
Skipped ScriptFactoryPostProcessorTests testChangeScriptWithNoRefreshableBeanFunctionality History
Default Job
Skipped ScriptFactoryPostProcessorTests testChangeScriptWithRefreshableBeanFunctionality History
Default Job