Build #7,643

Build: #7643 failed Changes by Sam Brannen

Build result summary

Details

Completed
Duration
14 minutes
Labels
None
Agent
bamboo-18.af.pivotal.io
Revisions
Spring Framework
5190eaf503bf1c280a9b9671252f15b77d72defc 5190eaf503bf1c280a9b9671252f15b77d72defc
Plan Repository
5190eaf503bf1c280a9b9671252f15b77d72defc 5190eaf503bf1c280a9b9671252f15b77d72defc
Total tests
20603
Fixed in
#7645 (Changes by Sam Brannen)
No failed tests found, a possible compilation error occurred.

Tests

Responsible

Code commits

Spring Framework
Author Commit Message Commit date
Sam Brannen Sam Brannen 5190eaf503bf1c280a9b9671252f15b77d72defc 5190eaf503bf1c280a9b9671252f15b77d72defc Merge branch '5.1.x'
Ryan Burke <ryanb93@users.noreply.github.com> Ryan Burke <ryanb93@users.noreply.github.com> 78802d4277a68c2eb5b742840cfc31d0848c0efc m 78802d4277a68c2eb5b742840cfc31d0848c0efc Fix typo in webflux.adoc
Sam Brannen Sam Brannen d633cb3ad548088bca111afb433c09d67dd6d74e d633cb3ad548088bca111afb433c09d67dd6d74e Polish @Sql tests
Plan Repository
Author Commit Message Commit date
Sam Brannen Sam Brannen 5190eaf503bf1c280a9b9671252f15b77d72defc 5190eaf503bf1c280a9b9671252f15b77d72defc Merge branch '5.1.x'
Ryan Burke <ryanb93@users.noreply.github.com> Ryan Burke <ryanb93@users.noreply.github.com> 78802d4277a68c2eb5b742840cfc31d0848c0efc m 78802d4277a68c2eb5b742840cfc31d0848c0efc Fix typo in webflux.adoc

Error summary for Default Job

The job generated some errors, drill down into the full build log for more details.

        at org.gradle.api.internal.tasks.execution.SkipOnlyIfTaskExecuter.execute(SkipOnlyIfTaskExecuter.java:56)
        at org.gradle.api.internal.tasks.execution.CatchExceptionTaskExecuter.execute(CatchExceptionTaskExecuter.java:36)
        at org.gradle.api.internal.tasks.execution.EventFiringTaskExecuter$1.executeTask(EventFiringTaskExecuter.java:73)
        at org.gradle.api.internal.tasks.execution.EventFiringTaskExecuter$1.call(EventFiringTaskExecuter.java:52)
        at org.gradle.api.internal.tasks.execution.EventFiringTaskExecuter$1.call(EventFiringTaskExecuter.java:49)
        at org.gradle.internal.operations.DefaultBuildOperationExecutor$CallableBuildOperationWorker.execute(DefaultBuildOperationExecutor.java:416)
        at org.gradle.internal.operations.DefaultBuildOperationExecutor$CallableBuildOperationWorker.execute(DefaultBuildOperationExecutor.java:406)
        at org.gradle.internal.operations.DefaultBuildOperationExecutor$1.execute(DefaultBuildOperationExecutor.java:165)
        at org.gradle.internal.operations.DefaultBuildOperationExecutor.execute(DefaultBuildOperationExecutor.java:250)
        at org.gradle.internal.operations.DefaultBuildOperationExecutor.execute(DefaultBuildOperationExecutor.java:158)
        at org.gradle.internal.operations.DefaultBuildOperationExecutor.call(DefaultBuildOperationExecutor.java:102)
        at org.gradle.internal.operations.DelegatingBuildOperationExecutor.call(DelegatingBuildOperationExecutor.java:36)
        at org.gradle.api.internal.tasks.execution.EventFiringTaskExecuter.execute(EventFiringTaskExecuter.java:49)
        at org.gradle.execution.plan.LocalTaskNodeExecutor.execute(LocalTaskNodeExecutor.java:43)
        at org.gradle.execution.taskgraph.DefaultTaskExecutionGraph$InvokeNodeExecutorsAction.execute(DefaultTaskExecutionGraph.java:355)
        at org.gradle.execution.taskgraph.DefaultTaskExecutionGraph$InvokeNodeExecutorsAction.execute(DefaultTaskExecutionGraph.java:343)
        at org.gradle.execution.taskgraph.DefaultTaskExecutionGraph$BuildOperationAwareExecutionAction.execute(DefaultTaskExecutionGraph.java:336)
        at org.gradle.execution.taskgraph.DefaultTaskExecutionGraph$BuildOperationAwareExecutionAction.execute(DefaultTaskExecutionGraph.java:322)
        at org.gradle.execution.plan.DefaultPlanExecutor$ExecutorWorker$1.execute(DefaultPlanExecutor.java:134)
        at org.gradle.execution.plan.DefaultPlanExecutor$ExecutorWorker$1.execute(DefaultPlanExecutor.java:129)
        at org.gradle.execution.plan.DefaultPlanExecutor$ExecutorWorker.execute(DefaultPlanExecutor.java:202)
        at org.gradle.execution.plan.DefaultPlanExecutor$ExecutorWorker.executeNextNode(DefaultPlanExecutor.java:193)
        at org.gradle.execution.plan.DefaultPlanExecutor$ExecutorWorker.run(DefaultPlanExecutor.java:129)
        at org.gradle.internal.concurrent.ExecutorPolicy$CatchAndRecordFailures.onExecute(ExecutorPolicy.java:63)
        at org.gradle.internal.concurrent.ManagedExecutorImpl$1.run(ManagedExecutorImpl.java:46)
        at org.gradle.internal.concurrent.ThreadFactoryImpl$ManagedThreadRunnable.run(ThreadFactoryImpl.java:55)
Caused by: org.gradle.api.UncheckedIOException: java.io.IOException: Failed to deploy file. Status code: 403 Response message: Artifactory returned the following errors:
'buildmaster' is blocked due to recurrent login failures, please try again in 1 seconds Status code: 403
        at org.gradle.internal.UncheckedException.throwAsUncheckedException(UncheckedException.java:61)
        at org.gradle.internal.UncheckedException.throwAsUncheckedException(UncheckedException.java:41)
        at org.gradle.internal.reflect.JavaMethod.invoke(JavaMethod.java:106)
        at org.gradle.api.internal.project.taskfactory.StandardTaskAction.doExecute(StandardTaskAction.java:48)
        at org.gradle.api.internal.project.taskfactory.StandardTaskAction.execute(StandardTaskAction.java:41)
        at org.gradle.api.internal.project.taskfactory.StandardTaskAction.execute(StandardTaskAction.java:28)
        at org.gradle.api.internal.AbstractTask$TaskActionWrapper.execute(AbstractTask.java:702)
        at org.gradle.api.internal.AbstractTask$TaskActionWrapper.execute(AbstractTask.java:669)
        at org.gradle.api.internal.tasks.execution.ExecuteActionsTaskExecuter$5.run(ExecuteActionsTaskExecuter.java:401)
        at org.gradle.internal.operations.DefaultBuildOperationExecutor$RunnableBuildOperationWorker.execute(DefaultBuildOperationExecutor.java:402)
        at org.gradle.internal.operations.DefaultBuildOperationExecutor$RunnableBuildOperationWorker.execute(DefaultBuildOperationExecutor.java:394)
        at org.gradle.internal.operations.DefaultBuildOperationExecutor$1.execute(DefaultBuildOperationExecutor.java:165)
        at org.gradle.internal.operations.DefaultBuildOperationExecutor.execute(DefaultBuildOperationExecutor.java:250)
        at org.gradle.internal.operations.DefaultBuildOperationExecutor.execute(DefaultBuildOperationExecutor.java:158)
        at org.gradle.internal.operations.DefaultBuildOperationExecutor.run(DefaultBuildOperationExecutor.java:92)
        at org.gradle.internal.operations.DelegatingBuildOperationExecutor.run(DelegatingBuildOperationExecutor.java:31)
        at org.gradle.api.internal.tasks.execution.ExecuteActionsTaskExecuter.executeAction(ExecuteActionsTaskExecuter.java:390)
        at org.gradle.api.internal.tasks.execution.ExecuteActionsTaskExecuter.executeActions(ExecuteActionsTaskExecuter.java:373)
        at org.gradle.api.internal.tasks.execution.ExecuteActionsTaskExecuter.access$200(ExecuteActionsTaskExecuter.java:79)
        at org.gradle.api.internal.tasks.execution.ExecuteActionsTaskExecuter$TaskExecution.execute(ExecuteActionsTaskExecuter.java:210)
        at org.gradle.internal.execution.steps.ExecuteStep.lambda$execute$1(ExecuteStep.java:33)
        at org.gradle.internal.execution.steps.ExecuteStep.execute(ExecuteStep.java:33)
        at org.gradle.internal.execution.steps.ExecuteStep.execute(ExecuteStep.java:26)
        at org.gradle.internal.execution.steps.CleanupOutputsStep.execute(CleanupOutputsStep.java:58)
        at org.gradle.internal.execution.steps.CleanupOutputsStep.execute(CleanupOutputsStep.java:35)
        at org.gradle.internal.execution.steps.ResolveInputChangesStep.execute(ResolveInputChangesStep.java:48)
        at org.gradle.internal.execution.steps.ResolveInputChangesStep.execute(ResolveInputChangesStep.java:33)
        at org.gradle.internal.execution.steps.CancelExecutionStep.execute(CancelExecutionStep.java:39)
        at org.gradle.internal.execution.steps.TimeoutStep.executeWithoutTimeout(TimeoutStep.java:73)
        at org.gradle.internal.execution.steps.TimeoutStep.execute(TimeoutStep.java:54)
        at org.gradle.internal.execution.steps.CatchExceptionStep.execute(CatchExceptionStep.java:35)
        at org.gradle.internal.execution.steps.CreateOutputsStep.execute(CreateOutputsStep.java:51)
        at org.gradle.internal.execution.steps.SnapshotOutputsStep.execute(SnapshotOutputsStep.java:45)
        at org.gradle.internal.execution.steps.SnapshotOutputsStep.execute(SnapshotOutputsStep.java:31)
        at org.gradle.internal.execution.steps.CacheStep.executeWithoutCache(CacheStep.java:201)
        at org.gradle.internal.execution.steps.CacheStep.execute(CacheStep.java:70)
        at org.gradle.internal.execution.steps.CacheStep.execute(CacheStep.java:45)
        at org.gradle.internal.execution.steps.BroadcastChangingOutputsStep.execute(BroadcastChangingOutputsStep.java:49)
        at org.gradle.internal.execution.steps.StoreSnapshotsStep.execute(StoreSnapshotsStep.java:43)
        at org.gradle.internal.execution.steps.StoreSnapshotsStep.execute(StoreSnapshotsStep.java:32)
        at org.gradle.internal.execution.steps.RecordOutputsStep.execute(RecordOutputsStep.java:38)
        at org.gradle.internal.execution.steps.RecordOutputsStep.execute(RecordOutputsStep.java:24)
        at org.gradle.internal.execution.steps.SkipUpToDateStep.executeBecause(SkipUpToDateStep.java:96)
        at org.gradle.internal.execution.steps.SkipUpToDateStep.lambda$execute$0(SkipUpToDateStep.java:89)
        at org.gradle.internal.execution.steps.SkipUpToDateStep.execute(SkipUpToDateStep.java:54)
        at org.gradle.internal.execution.steps.SkipUpToDateStep.execute(SkipUpToDateStep.java:38)
        at org.gradle.internal.execution.steps.ResolveChangesStep.execute(ResolveChangesStep.java:77)
        at org.gradle.internal.execution.steps.ResolveChangesStep.execute(ResolveChangesStep.java:37)
        at org.gradle.internal.execution.steps.legacy.MarkSnapshottingInputsFinishedStep.execute(MarkSnapshottingInputsFinishedStep.java:36)
        at org.gradle.internal.execution.steps.legacy.MarkSnapshottingInputsFinishedStep.execute(MarkSnapshottingInputsFinishedStep.java:26)
        at org.gradle.internal.execution.steps.ResolveCachingStateStep.execute(ResolveCachingStateStep.java:90)
        at org.gradle.internal.execution.steps.ResolveCachingStateStep.execute(ResolveCachingStateStep.java:48)
        at org.gradle.internal.execution.impl.DefaultWorkExecutor.execute(DefaultWorkExecutor.java:33)
        at org.gradle.api.internal.tasks.execution.ExecuteActionsTaskExecuter.execute(ExecuteActionsTaskExecuter.java:117)
        ... 35 more
Caused by: java.io.IOException: Failed to deploy file. Status code: 403 Response message: Artifactory returned the following errors:
'buildmaster' is blocked due to recurrent login failures, please try again in 1 seconds Status code: 403
        at org.jfrog.build.extractor.clientConfiguration.client.ArtifactoryBuildInfoClient.uploadFile(ArtifactoryBuildInfoClient.java:691)
        at org.jfrog.build.extractor.clientConfiguration.client.ArtifactoryBuildInfoClient.doDeployArtifact(ArtifactoryBuildInfoClient.java:373)
        at org.jfrog.build.extractor.clientConfiguration.client.ArtifactoryBuildInfoClient.deployArtifact(ArtifactoryBuildInfoClient.java:361)
        at org.jfrog.build.extractor.clientConfiguration.client.ArtifactoryBuildInfoClient.deployArtifact(ArtifactoryBuildInfoClient.java:346)
        at org.jfrog.gradle.plugin.artifactory.task.DeployTask.deployArtifacts(DeployTask.java:262)
        at org.jfrog.gradle.plugin.artifactory.task.DeployTask.prepareAndDeploy(DeployTask.java:113)
        at org.jfrog.gradle.plugin.artifactory.task.DeployTask.collectProjectBuildInfo(DeployTask.java:50)
        at org.jfrog.gradle.plugin.artifactory.task.DeployTask.taskAction(DeployTask.java:44)
        at org.gradle.internal.reflect.JavaMethod.invoke(JavaMethod.java:103)
        ... 86 more


* Get more help at https://help.gradle.org

BUILD FAILED in 14m 14s